jmeter-dev mailing list archives

Site index · List index
Message view « Date » · « Thread »
Top « Date » · « Thread »
From Apache Jenkins Server <jenk...@builds.apache.org>
Subject Build failed in Jenkins: JMeter-trunk #7337
Date Sat, 14 Sep 2019 21:58:37 GMT
See <https://builds.apache.org/job/JMeter-trunk/7337/display/redirect?page=changes>

Changes:

[pmouawad] New JMESPATH extractor (#489)

------------------------------------------
[...truncated 113.85 KB...]
    JMeterVersion=5.2.0-SNAPSHOT b15c922
    java.version=1.8.0_191
    java.vm.name=Java HotSpot(TM) 64-Bit Server VM
    java.vendor=Oracle Corporation
    java.home=/usr/local/asfpackages/java/jdk1.8.0_191/jre
    file.encoding=ISO-8859-1
    default encoding=ISO-8859-1
    user.home=/home/jenkins
    user.dir=<https://builds.apache.org/job/JMeter-trunk/ws/src/core>
    user.language=en
    user.region=null
    user.country=US
    user.variant=
    Locale=en_US
    java.class.version=52.0
    java.awt.headless=true
    os.name=Linux
    os.version=4.4.0-143-generic
    os.arch=amd64

org.apache.jmeter.resources.PackageTest > checkI18n STANDARD_OUT
    Ignoring missing junit_failure_default_code=0001 in org/apache/jmeter/resources/messages_fr.properties
    Ignoring missing aggregate_report_90=90% in org/apache/jmeter/resources/messages_fr.properties
    Ignoring missing junit_error_default_code=9999 in org/apache/jmeter/resources/messages_fr.properties
    Ignoring missing junit_success_default_code=1000 in org/apache/jmeter/resources/messages_fr.properties

org.apache.jmeter.JMeterTest > testSuccessWhenJmxExists STANDARD_OUT
    Creating summariser <summary>
    Created the tree successfully using /tmp/testPlan1750186966383158134.jmx
    Starting the test @ Sat Sep 14 21:58:16 UTC 2019 (1568498296920)

org.apache.jmeter.JMeterTest STANDARD_OUT
    Waiting for possible Shutdown/StopTestNow/HeapDump/ThreadDump message on port 4445

org.apache.jmeter.JMeterTest > testFailureWithMissingPlugin STANDARD_OUT
    Error in NonGUIDriver java.lang.IllegalArgumentException: Problem loading XML from:'/tmp/testPlan2712039319657687844.jmx'.

    Cause:
    CannotResolveClassException: kg.apc.jmeter.samplers.DummySampler

     Detail:com.thoughtworks.xstream.converters.ConversionException: 
    ---- Debugging information ----
    cause-exception     : com.thoughtworks.xstream.converters.ConversionException
    cause-message       : 
    first-jmeter-class  : org.apache.jmeter.save.converters.HashTreeConverter.unmarshal(HashTreeConverter.java:67)
    class               : org.apache.jmeter.save.ScriptWrapper
    required-type       : org.apache.jmeter.save.ScriptWrapper
    converter-type      : org.apache.jmeter.save.ScriptWrapperConverter
    path                : /jmeterTestPlan/hashTree/hashTree/hashTree/kg.apc.jmeter.samplers.DummySampler
    line number         : 16
    version             : not available
    -------------------------------

org.apache.jmeter.testbeans.gui.TestFieldStringEditor > testSetGetAsText STANDARD_OUT
    JMeterUtils.getJMeterVe rsion() = 5.2.0-SNAPSHOT b15c922
    JMeterUtils.getJMeterVe rsion() = 5.2.0-SNAPSHOT b15c922
    summary =      0 in 00:00:00 = ******/s Avg:     0 Min: 9223372036854775807 Max: -9223372036854775808
Err:     0 (0.00%)
    Tidying up ...    @ Sat Sep 14 21:58:17 UTC 2019 (1568498297448)
    JMeterUtils.getJMeterVe rsion() = 5.2.0-SNAPSHOT b15c922

org.apache.jmeter.testbeans.gui.TestFieldStringEditor > testSetGet STANDARD_OUT
    ... end of run

org.apache.jmeter.engine.LocalHostTest > testLocalHost STANDARD_ERROR
    java.rmi.server.hostname=null
    asf929.gq1.ygridcore.net/67.195.81.179
    isSiteLocalAddress:false
    isAnyLocalAddress:false
    isLinkLocalAddress:false
    isLoopbackAddress:false
    isMulticastAddress:false
    localhost/127.0.0.1
    isSiteLocalAddress:false
    isAnyLocalAddress:false
    isLinkLocalAddress:false
    isLoopbackAddress:true
    isMulticastAddress:false
    ====================
    asf929.gq1.ygridcore.net/67.195.81.179
    isSiteLocalAddress:false
    isAnyLocalAddress:false
    isLinkLocalAddress:false
    isLoopbackAddress:false
    isMulticastAddress:false

org.apache.jmeter.engine.LocalHostTest > testInterfaces STANDARD_ERROR
    Interfaces: {name:veth65dac43 (veth65dac43) => [/fe80:0:0:0:1ce8:b7ff:fe6f:d743%veth65dac43/64
[null]], name:br-7a9ab0ccb319 (br-7a9ab0ccb319) => [/fe80:0:0:0:42:87ff:fe14:673c%br-7a9ab0ccb319/64
[null], /172.27.0.1/16 [/172.27.255.255]], name:docker0 (docker0) => [/fe80:0:0:0:42:93ff:fe78:f66d%docker0/64
[null], /172.17.0.1/16 [/0.0.0.0]], name:enp5s0f0 (enp5s0f0) => [/fe80:0:0:0:28c:faff:fe5b:40f4%enp5s0f0/64
[null], /67.195.81.179/26 [/67.195.81.191]], name:lo (lo) => [/0:0:0:0:0:0:0:1%lo/128 [null],
/127.0.0.1/8 [null]]}
    Choose 172.27.0.1 to talk to external services
    java.rmi.server.hostname=null

org.apache.jmeter.report.core.ConvertersSpec STANDARD_OUT
    The JVM should have exited but did not.

org.apache.jmeter.report.core.ConvertersSpec > Convert number-like (+5) to instance of
(class java.lang.Float) STANDARD_OUT
    The following non-daemon threads are still running (DestroyJavaVM is OK):
    Thread[Test worker,5,main], stackTrace:java.lang.Class#forName0
    java.lang.Class#forName at line:264
    groovy.lang.MetaClassRegistry$MetaClassCreationHandle#createWithCustomLookup at line:149
    groovy.lang.MetaClassRegistry$MetaClassCreationHandle#create at line:144
    org.codehaus.groovy.reflection.ClassInfo#getMetaClassUnderLock at line:288
    org.codehaus.groovy.reflection.ClassInfo#getMetaClass at line:331
    org.codehaus.groovy.reflection.ClassInfo#getMetaClass at line:341
    org.codehaus.groovy.runtime.metaclass.MetaClassRegistryImpl#getMetaClass at line:281
    org.codehaus.groovy.runtime.InvokerHelper#getMetaClass at line:901
    org.codehaus.groovy.runtime.callsite.CallSiteArray#createPojoSite at line:124
    org.codehaus.groovy.runtime.callsite.CallSiteArray#createCallSite at line:165
    org.codehaus.groovy.runtime.callsite.CallSiteArray#defaultCall at line:47
    org.apache.jmeter.report.core.StringConverter$convert#call
    org.apache.jmeter.report.core.ConvertersSpec#$spock_feature_0_0 at line:30
    sun.reflect.NativeMethodAccessorImpl#invoke0
    sun.reflect.NativeMethodAccessorImpl#invoke at line:62
    sun.reflect.DelegatingMethodAccessorImpl#invoke at line:43
    java.lang.reflect.Method#invoke at line:498
    org.spockframework.util.ReflectionUtil#invokeMethod at line:200
    org.spockframework.runtime.model.MethodInfo#invoke at line:113
    org.spockframework.runtime.BaseSpecRunner#invokeRaw at line:484
    org.spockframework.runtime.BaseSpecRunner#invoke at line:467
    org.spockframework.runtime.BaseSpecRunner#runFeatureMethod at line:408
    org.spockframework.runtime.BaseSpecRunner#doRunIteration at line:322
    org.spockframework.runtime.BaseSpecRunner$6#invoke at line:306
    org.spockframework.runtime.BaseSpecRunner#invokeRaw at line:484
    org.spockframework.runtime.BaseSpecRunner#invoke at line:467
    org.spockframework.runtime.BaseSpecRunner#runIteration at line:285
    org.spockframework.runtime.BaseSpecRunner#initializeAndRunIteration at line:275
    org.spockframework.runtime.ParameterizedSpecRunner#runIterations at line:139
    org.spockframework.runtime.ParameterizedSpecRunner#runParameterizedFeature at line:41
    org.spockframework.runtime.BaseSpecRunner#doRunFeature at line:259
    org.spockframework.runtime.BaseSpecRunner$5#invoke at line:243
    org.spockframework.runtime.BaseSpecRunner#invokeRaw at line:484
    org.spockframework.runtime.BaseSpecRunner#invoke at line:467
    org.spockframework.runtime.BaseSpecRunner#runFeature at line:235
    org.spockframework.runtime.BaseSpecRunner#runFeatures at line:185
    org.spockframework.runtime.BaseSpecRunner#doRunSpec at line:95
    org.spockframework.runtime.BaseSpecRunner$1#invoke at line:81
    org.spockframework.runtime.BaseSpecRunner#invokeRaw at line:484
    org.spockframework.runtime.BaseSpecRunner#invoke at line:467
    org.spockframework.runtime.BaseSpecRunner#runSpec at line:73
    org.spockframework.runtime.BaseSpecRunner#run at line:64
    org.spockframework.runtime.Sputnik#run at line:63
    org.gradle.api.internal.tasks.testing.junit.JUnitTestClassExecutor#runTestClass at line:110
    org.gradle.api.internal.tasks.testing.junit.JUnitTestClassExecutor#execute at line:58
    org.gradle.api.internal.tasks.testing.junit.JUnitTestClassExecutor#execute at line:38
    org.gradle.api.internal.tasks.testing.junit.AbstractJUnitTestClassProcessor#processTestClass
at line:62
    org.gradle.api.internal.tasks.testing.SuiteTestClassProcessor#processTestClass at line:51
    sun.reflect.GeneratedMethodAccessor6#invoke
    sun.reflect.DelegatingMethodAccessorImpl#invoke at line:43
    java.lang.reflect.Method#invoke at line:498
    org.gradle.internal.dispatch.ReflectionDispatch#dispatch at line:35
    org.gradle.internal.dispatch.ReflectionDispatch#dispatch at line:24
    org.gradle.internal.dispatch.ContextClassLoaderDispatch#dispatch at line:32
    org.gradle.internal.dispatch.ProxyDispatchAdapter$DispatchingInvocationHandler#invoke
at line:93
    com.sun.proxy.$Proxy2#processTestClass
    org.gradle.api.internal.tasks.testing.worker.TestWorker#processTestClass at line:118
    sun.reflect.GeneratedMethodAccessor5#invoke
    sun.reflect.DelegatingMethodAccessorImpl#invoke at line:43
    java.lang.reflect.Method#invoke at line:498
    org.gradle.internal.dispatch.ReflectionDispatch#dispatch at line:35
    org.gradle.internal.dispatch.ReflectionDispatch#dispatch at line:24
    org.gradle.internal.remote.internal.hub.MessageHubBackedObjectConnection$DispatchWrapper#dispatch
at line:175
    org.gradle.internal.remote.internal.hub.MessageHubBackedObjectConnection$DispatchWrapper#dispatch
at line:157
    org.gradle.internal.remote.internal.hub.MessageHub$Handler#run at line:404
    org.gradle.internal.concurrent.ExecutorPolicy$CatchAndRecordFailures#onExecute at line:63
    org.gradle.internal.concurrent.ManagedExecutorImpl$1#run at line:46
    java.util.concurrent.ThreadPoolExecutor#runWorker at line:1149
    java.util.concurrent.ThreadPoolExecutor$Worker#run at line:624
    org.gradle.internal.concurrent.ThreadFactoryImpl$ManagedThreadRunnable#run at line:55
    java.lang.Thread#run at line:748

    Thread[main,5,main], stackTrace:sun.misc.Unsafe#park
    java.util.concurrent.locks.LockSupport#park at line:175
    java.util.concurrent.locks.AbstractQueuedSynchronizer#parkAndCheckInterrupt at line:836
    java.util.concurrent.locks.AbstractQueuedSynchronizer#doAcquireSharedInterruptibly at
line:997
    java.util.concurrent.locks.AbstractQueuedSynchronizer#acquireSharedInterruptibly at line:1304
    java.util.concurrent.CountDownLatch#await at line:231
    org.gradle.api.internal.tasks.testing.worker.TestWorker#execute at line:72
    org.gradle.api.internal.tasks.testing.worker.TestWorker#execute at line:46
    org.gradle.process.internal.worker.child.ActionExecutionWorker#execute at line:86
    org.gradle.process.internal.worker.child.ActionExecutionWorker#execute at line:34
    org.gradle.process.internal.worker.child.SystemApplicationClassLoaderWorker#call at line:132
    org.gradle.process.internal.worker.child.SystemApplicationClassLoaderWorker#call at line:68
    worker.org.gradle.process.internal.worker.GradleWorkerMain#run at line:68
    worker.org.gradle.process.internal.worker.GradleWorkerMain#main at line:73

    Thread[/0:0:0:0:0:0:0:1:56018 to /0:0:0:0:0:0:0:1:39821 workers Thread 3,5,main], stackTrace:sun.nio.ch.EPollArrayWrapper#epollWait
    sun.nio.ch.EPollArrayWrapper#poll at line:269
    sun.nio.ch.EPollSelectorImpl#doSelect at line:93
    sun.nio.ch.SelectorImpl#lockAndDoSelect at line:86
    sun.nio.ch.SelectorImpl#select at line:97
    sun.nio.ch.SelectorImpl#select at line:101
    org.gradle.internal.remote.internal.inet.SocketConnection$SocketInputStream#read at line:179
    com.esotericsoftware.kryo.io.Input#fill at line:146
    com.esotericsoftware.kryo.io.Input#require at line:178
    com.esotericsoftware.kryo.io.Input#readByte at line:295
    org.gradle.internal.serialize.kryo.KryoBackedDecoder#readByte at line:80
    org.gradle.internal.remote.internal.hub.InterHubMessageSerializer$MessageReader#read at
line:63
    org.gradle.internal.remote.internal.hub.InterHubMessageSerializer$MessageReader#read at
line:52
    org.gradle.internal.remote.internal.inet.SocketConnection#receive at line:80
    org.gradle.internal.remote.internal.hub.MessageHub$ConnectionReceive#run at line:263
    org.gradle.internal.concurrent.ExecutorPolicy$CatchAndRecordFailures#onExecute at line:63
    org.gradle.internal.concurrent.ManagedExecutorImpl$1#run at line:46
    java.util.concurrent.ThreadPoolExecutor#runWorker at line:1149
    java.util.concurrent.ThreadPoolExecutor$Worker#run at line:624
    org.gradle.internal.concurrent.ThreadFactoryImpl$ManagedThreadRunnable#run at line:55
    java.lang.Thread#run at line:748


org.apache.jmeter.report.core.ConvertersSpec STANDARD_OUT
    Thread[/0:0:0:0:0:0:0:1:56018 to /0:0:0:0:0:0:0:1:39821 workers Thread 2,5,main], stackTrace:java.lang.Object#clone
    java.lang.reflect.Method#getParameterTypes at line:264
    org.gradle.internal.remote.internal.hub.MethodInvocationSerializer$MethodInvocationWriter#write
at line:67
    org.gradle.internal.remote.internal.hub.MethodInvocationSerializer$MethodInvocationWriter#write
at line:56
    org.gradle.internal.serialize.kryo.TypeSafeSerializer$2#write at line:43
    org.gradle.internal.remote.internal.hub.InterHubMessageSerializer$MessageWriter#write
at line:102
    org.gradle.internal.remote.internal.hub.InterHubMessageSerializer$MessageWriter#write
at line:87
    org.gradle.internal.remote.internal.inet.SocketConnection#dispatch at line:117
    org.gradle.internal.remote.internal.hub.MessageHub$ConnectionDispatch#run at line:320
    org.gradle.internal.concurrent.ExecutorPolicy$CatchAndRecordFailures#onExecute at line:63
    org.gradle.internal.concurrent.ManagedExecutorImpl$1#run at line:46
    java.util.concurrent.ThreadPoolExecutor#runWorker at line:1149
    java.util.concurrent.ThreadPoolExecutor$Worker#run at line:624

org.apache.jmeter.report.core.ConvertersSpec > Convert number-like ( 1.2E16 ) to instance
of (float) STANDARD_OUT
    org.gradle.internal.concurrent.ThreadFactoryImpl$ManagedThreadRunnable#run at line:55
    java.lang.Thread#run at line:748


FAILURE: Build failed with an exception.

* What went wrong:
Execution failed for task ':src:dist:javadocAggregate'.
> Javadoc generation failed. Generated Javadoc options file (useful for troubleshooting):
'<https://builds.apache.org/job/JMeter-trunk/ws/src/dist/build/tmp/javadocAggregate/javadoc.options'>

* Try:
Run with --stacktrace option to get the stack trace. Run with --info or --debug option to
get more log output. Run with --scan to get full insights.

* Get more help at https://help.gradle.org

Deprecated Gradle features were used in this build, making it incompatible with Gradle 6.0.
Use '--warning-mode all' to show the individual deprecation warnings.
See https://docs.gradle.org/5.5.1/userguide/command_line_interface.html#sec:command_line_warnings

BUILD FAILED in 5m 28s
209 actionable tasks: 130 executed, 79 up-to-date
Build step 'Invoke Gradle script' changed build result to FAILURE
Build step 'Invoke Gradle script' marked build as failure
[locks-and-latches] Releasing all the locks
[locks-and-latches] All the locks released
Archiving artifacts
[Fast Archiver] Compressed 152.42 MB of artifacts by 87.5% relative to #7336
Recording test results

Mime
View raw message