jmeter-dev mailing list archives

Site index · List index
Message view « Date » · « Thread »
Top « Date » · « Thread »
From Apache Jenkins Server <jenk...@builds.apache.org>
Subject Build failed in Jenkins: JMeter-trunk #7344
Date Thu, 19 Sep 2019 12:05:35 GMT
See <https://builds.apache.org/job/JMeter-trunk/7344/display/redirect?page=changes>

Changes:

[pmouawad] ProxyControl: Format, renaming, removed invalid throws and comment fixes

------------------------------------------
[...truncated 47.82 KB...]
> Task :src:launcher:testClasses UP-TO-DATE
> Task :src:launcher:checkstyleTest NO-SOURCE
> Task :src:bshclient:spotbugsMain UP-TO-DATE
> Task :src:launcher:spotbugsMain UP-TO-DATE
> Task :src:bshclient:spotbugsTest NO-SOURCE
> Task :src:launcher:spotbugsTest NO-SOURCE
> Task :src:launcher:test NO-SOURCE
> Task :src:bshclient:test NO-SOURCE
> Task :src:launcher:check
> Task :src:launcher:assemble UP-TO-DATE
> Task :src:bshclient:check
> Task :src:bshclient:jar UP-TO-DATE
> Task :src:bshclient:assemble UP-TO-DATE

> Task :src:jorphan:compileJava
Note: Some input files use or override a deprecated API.
Note: Recompile with -Xlint:deprecation for details.

> Task :src:jorphan:compileGroovy NO-SOURCE
> Task :src:jorphan:processResources UP-TO-DATE
> Task :src:jorphan:classes
> Task :src:jorphan:jar
> Task :src:jorphan:compileTestJava UP-TO-DATE
> Task :src:jorphan:compileTestGroovy
> Task :src:jorphan:processTestResources NO-SOURCE
> Task :src:jorphan:testClasses
> Task :src:jorphan:testJar UP-TO-DATE
> Task :rat
> Task :check
> Task :src:jorphan:checkstyleMain
> Task :src:jorphan:checkstyleTest
> Task :src:core:compileJava
> Task :src:core:compileGroovy NO-SOURCE
> Task :src:core:classes
> Task :src:protocol:ftp:compileJava UP-TO-DATE
> Task :src:protocol:jms:compileJava UP-TO-DATE
> Task :src:protocol:ftp:classes UP-TO-DATE
> Task :src:protocol:jms:classes UP-TO-DATE
> Task :src:protocol:ftp:jar UP-TO-DATE
> Task :src:protocol:junit:compileJava UP-TO-DATE
> Task :src:protocol:jdbc:compileJava UP-TO-DATE
> Task :src:protocol:jms:jar UP-TO-DATE
> Task :src:protocol:ldap:compileJava UP-TO-DATE
> Task :src:protocol:ldap:classes UP-TO-DATE
> Task :src:protocol:junit:classes UP-TO-DATE
> Task :src:protocol:java:compileJava UP-TO-DATE
> Task :src:protocol:java:classes UP-TO-DATE
> Task :src:protocol:mail:compileJava UP-TO-DATE
> Task :src:protocol:mail:classes UP-TO-DATE
> Task :src:protocol:mongodb:compileJava UP-TO-DATE
> Task :src:protocol:tcp:compileJava UP-TO-DATE
> Task :src:protocol:mongodb:classes UP-TO-DATE
> Task :src:protocol:tcp:classes UP-TO-DATE
> Task :src:protocol:jdbc:compileGroovy NO-SOURCE
> Task :src:protocol:native:compileJava UP-TO-DATE
> Task :src:protocol:jdbc:classes UP-TO-DATE
> Task :src:protocol:native:classes UP-TO-DATE
> Task :src:protocol:junit-sample:compileJava UP-TO-DATE
> Task :src:protocol:junit-sample:classes UP-TO-DATE
> Task :src:protocol:java:jar UP-TO-DATE
> Task :src:protocol:ldap:jar UP-TO-DATE
> Task :src:protocol:junit-sample:jar UP-TO-DATE
> Task :src:protocol:native:jar UP-TO-DATE
> Task :src:protocol:junit:jar UP-TO-DATE
> Task :src:protocol:tcp:jar UP-TO-DATE
> Task :src:protocol:mongodb:jar UP-TO-DATE
> Task :src:protocol:mail:jar UP-TO-DATE
> Task :src:protocol:jdbc:jar UP-TO-DATE
> Task :src:protocol:ftp:checkstyleMain
> Task :src:protocol:ftp:assemble UP-TO-DATE
> Task :src:core:jar
> Task :src:core:compileTestJava UP-TO-DATE
> Task :src:protocol:junit-sample:checkstyleMain
> Task :src:protocol:mongodb:checkstyleMain
> Task :src:protocol:native:checkstyleMain
> Task :src:protocol:jms:checkstyleMain
> Task :src:protocol:java:checkstyleMain
> Task :src:protocol:junit:checkstyleMain
> Task :src:protocol:tcp:checkstyleMain
> Task :src:protocol:jdbc:checkstyleMain
> Task :src:protocol:ldap:checkstyleMain
> Task :src:protocol:mail:checkstyleMain
> Task :src:dist:distTarSource
> Task :src:dist:distTarSourceSha512
> Task :src:core:compileTestGroovy
> Task :src:core:testClasses
> Task :src:core:testJar UP-TO-DATE

> Task :src:components:compileJava
Note: Some input files use or override a deprecated API.
Note: Recompile with -Xlint:deprecation for details.
Note: Some input files use unchecked or unsafe operations.
Note: Recompile with -Xlint:unchecked for details.

> Task :src:components:compileGroovy NO-SOURCE
> Task :src:components:classes
> Task :src:examples:compileJava
> Task :src:examples:classes
> Task :src:generator:compileJava
> Task :src:generator:classes
> Task :src:generator:jar UP-TO-DATE
> Task :src:examples:checkstyleMain
> Task :src:examples:compileTestJava NO-SOURCE
> Task :src:examples:testClasses UP-TO-DATE
> Task :src:examples:checkstyleTest NO-SOURCE
> Task :src:examples:jar UP-TO-DATE
> Task :src:examples:assemble UP-TO-DATE
> Task :src:generator:checkstyleMain
> Task :src:generator:compileTestJava NO-SOURCE
> Task :src:generator:testClasses UP-TO-DATE
> Task :src:generator:checkstyleTest NO-SOURCE
> Task :src:generator:assemble UP-TO-DATE

> Task :src:functions:compileJava
Note: <https://builds.apache.org/job/JMeter-trunk/ws/src/functions/src/main/java/org/apache/jmeter/functions/StringFromFile.java>
uses or overrides a deprecated API.
Note: Recompile with -Xlint:deprecation for details.

> Task :src:functions:compileGroovy NO-SOURCE
> Task :src:functions:classes
> Task :src:functions:jar UP-TO-DATE
> Task :src:functions:checkstyleMain
> Task :src:functions:assemble UP-TO-DATE

> Task :src:protocol:http:compileJava
Note: Some input files use or override a deprecated API.
Note: Recompile with -Xlint:deprecation for details.
Note: <https://builds.apache.org/job/JMeter-trunk/ws/src/protocol/http/src/main/java/org/apache/jmeter/protocol/http/sampler/HTTPHC4Impl.java>
uses unchecked or unsafe operations.
Note: Recompile with -Xlint:unchecked for details.

> Task :src:protocol:http:compileGroovy NO-SOURCE
> Task :src:protocol:http:classes
> Task :src:protocol:http:jar

> Task :src:protocol:junit-sample:spotbugsMain
SpotBugs rule violations were found. See the report at: file://<https://builds.apache.org/job/JMeter-trunk/ws/src/protocol/junit-sample/build/reports/spotbugs/main.xml>

> Task :src:protocol:junit-sample:compileTestJava NO-SOURCE
> Task :src:protocol:junit-sample:testClasses UP-TO-DATE
> Task :src:protocol:junit-sample:checkstyleTest NO-SOURCE
> Task :src:protocol:junit-sample:spotbugsTest NO-SOURCE
> Task :src:protocol:junit-sample:test NO-SOURCE
> Task :src:protocol:junit-sample:check
> Task :src:protocol:junit-sample:assemble UP-TO-DATE
> Task :src:jorphan:spotbugsMain
> Task :src:protocol:ftp:spotbugsMain
> Task :src:protocol:mongodb:spotbugsMain
> Task :src:protocol:native:spotbugsMain
> Task :src:protocol:jms:spotbugsMain
> Task :src:protocol:java:spotbugsMain
> Task :src:protocol:junit:spotbugsMain
> Task :src:protocol:tcp:spotbugsMain
> Task :src:protocol:jdbc:spotbugsMain
> Task :src:components:checkstyleMain
> Task :src:protocol:ldap:spotbugsMain
> Task :src:protocol:mail:spotbugsMain

> Task :src:protocol:mongodb:spotbugsMain
SpotBugs rule violations were found. See the report at: file://<https://builds.apache.org/job/JMeter-trunk/ws/src/protocol/mongodb/build/reports/spotbugs/main.xml>

> Task :src:protocol:mongodb:compileTestJava UP-TO-DATE
> Task :src:protocol:mongodb:testClasses UP-TO-DATE
> Task :src:protocol:mongodb:testJar UP-TO-DATE
> Task :src:dist:distZipSource
> Task :src:core:checkstyleMain
> Task :src:protocol:mongodb:checkstyleTest
> Task :src:dist:compileJava NO-SOURCE
> Task :src:dist:classes UP-TO-DATE
> Task :src:dist-check:compileJava NO-SOURCE
> Task :src:dist:checkstyleMain NO-SOURCE
> Task :src:dist-check:compileGroovy NO-SOURCE
> Task :src:dist-check:classes UP-TO-DATE
> Task :src:dist-check:checkstyleMain NO-SOURCE
> Task :src:dist:jar UP-TO-DATE
> Task :src:dist-check:jar UP-TO-DATE
> Task :src:dist-check:assemble UP-TO-DATE

> Task :src:components:compileTestJava
Note: Some input files use or override a deprecated API.
Note: Recompile with -Xlint:deprecation for details.

> Task :src:protocol:native:spotbugsMain
SpotBugs rule violations were found. See the report at: file://<https://builds.apache.org/job/JMeter-trunk/ws/src/protocol/native/build/reports/spotbugs/main.xml>

> Task :src:protocol:native:compileTestJava UP-TO-DATE
> Task :src:protocol:native:testClasses UP-TO-DATE
> Task :src:protocol:native:testJar UP-TO-DATE

> Task :src:protocol:http:checkstyleMain
[ant:checkstyle] [ERROR] <https://builds.apache.org/job/JMeter-trunk/ws/src/protocol/http/src/main/java/org/apache/jmeter/protocol/http/proxy/ProxyControl.java>:1247:84:
';' is followed by whitespace. [EmptyForIteratorPad]

> Task :src:protocol:http:checkstyleMain FAILED
> Task :src:protocol:native:checkstyleTest
> Task :src:core:checkstyleTest

> Task :src:protocol:ftp:spotbugsMain
SpotBugs rule violations were found. See the report at: file://<https://builds.apache.org/job/JMeter-trunk/ws/src/protocol/ftp/build/reports/spotbugs/main.xml>

> Task :src:protocol:jdbc:spotbugsMain
SpotBugs rule violations were found. See the report at: file://<https://builds.apache.org/job/JMeter-trunk/ws/src/protocol/jdbc/build/reports/spotbugs/main.xml>

> Task :src:components:compileTestGroovy

> Task :src:protocol:junit:spotbugsMain
SpotBugs rule violations were found. See the report at: file://<https://builds.apache.org/job/JMeter-trunk/ws/src/protocol/junit/build/reports/spotbugs/main.xml>

> Task :src:jorphan:spotbugsMain
SpotBugs rule violations were found. See the report at: file://<https://builds.apache.org/job/JMeter-trunk/ws/src/jorphan/build/reports/spotbugs/main.xml>

> Task :src:protocol:tcp:spotbugsMain
SpotBugs rule violations were found. See the report at: file://<https://builds.apache.org/job/JMeter-trunk/ws/src/protocol/tcp/build/reports/spotbugs/main.xml>

> Task :src:protocol:jms:spotbugsMain
SpotBugs rule violations were found. See the report at: file://<https://builds.apache.org/job/JMeter-trunk/ws/src/protocol/jms/build/reports/spotbugs/main.xml>

> Task :src:protocol:mongodb:spotbugsTest

> Task :src:protocol:mail:spotbugsMain
SpotBugs rule violations were found. See the report at: file://<https://builds.apache.org/job/JMeter-trunk/ws/src/protocol/mail/build/reports/spotbugs/main.xml>

> Task :src:dist:javadocAggregate

FAILURE: Build failed with an exception.

* What went wrong:
Execution failed for task ':src:protocol:http:checkstyleMain'.
> Checkstyle rule violations were found. See the report at: file://<https://builds.apache.org/job/JMeter-trunk/ws/src/protocol/http/build/reports/checkstyle/main.html>
  Checkstyle files with violations: 1
  Checkstyle violations by severity: [error:1]


* Try:
Run with --stacktrace option to get the stack trace. Run with --info or --debug option to
get more log output. Run with --scan to get full insights.

* Get more help at https://help.gradle.org

Deprecated Gradle features were used in this build, making it incompatible with Gradle 6.0.
Use '--warning-mode all' to show the individual deprecation warnings.
See https://docs.gradle.org/5.5.1/userguide/command_line_interface.html#sec:command_line_warnings

BUILD FAILED in 2m 54s
155 actionable tasks: 79 executed, 76 up-to-date
Build step 'Invoke Gradle script' changed build result to FAILURE
Build step 'Invoke Gradle script' marked build as failure
[locks-and-latches] Releasing all the locks
[locks-and-latches] All the locks released
Archiving artifacts
[Fast Archiver] Compressed 176.97 MB of artifacts by 63.0% relative to #7343
Recording test results
ERROR: Step ?Publish JUnit test result report? failed: No test report files were found. Configuration
error?

Mime
View raw message