jmeter-dev mailing list archives

Site index · List index
Message view « Date » · « Thread »
Top « Date » · « Thread »
From Apache Jenkins Server <jenk...@builds.apache.org>
Subject Build failed in Jenkins: JMeter-trunk #7347
Date Fri, 20 Sep 2019 21:12:12 GMT
See <https://builds.apache.org/job/JMeter-trunk/7347/display/redirect?page=changes>

Changes:

[sitnikov.vladimir] Prepare build scripts for Gradle 6.0

------------------------------------------
Started by an SCM change
[EnvInject] - Loading node environment variables.
Building remotely on H37 (ubuntu xenial) in workspace <https://builds.apache.org/job/JMeter-trunk/ws/>
No credentials specified
 > git rev-parse --is-inside-work-tree # timeout=10
Fetching changes from the remote Git repository
 > git config remote.origin.url https://gitbox.apache.org/repos/asf/jmeter.git # timeout=10
Fetching upstream changes from https://gitbox.apache.org/repos/asf/jmeter.git
 > git --version # timeout=10
 > git fetch --tags --progress https://gitbox.apache.org/repos/asf/jmeter.git +refs/heads/*:refs/remotes/origin/*
 > git rev-parse refs/remotes/origin/master^{commit} # timeout=10
 > git rev-parse refs/remotes/origin/origin/master^{commit} # timeout=10
Checking out Revision 250ba4c04064f6fa200c4d0f962ad9d694bf38f4 (refs/remotes/origin/master)
 > git config core.sparsecheckout # timeout=10
 > git checkout -f 250ba4c04064f6fa200c4d0f962ad9d694bf38f4
Commit message: "Prepare build scripts for Gradle 6.0"
 > git rev-list --no-walk d5cde8aee0fcefd78d3104943dbf9581874950bc # timeout=10
[EnvInject] - Executing scripts and injecting environment variables after the SCM step.
[EnvInject] - Injecting as environment variables the properties content 
SONAR_HOST_URL=https://sonarcloud.io

[EnvInject] - Variables injected successfully.
[EnvInject] - Mask passwords that will be passed as build parameters.
[locks-and-latches] Checking to see if we really have the locks
[locks-and-latches] Have all the locks, build can start
[Gradle] - Launching build.
[JMeter-trunk] $ <https://builds.apache.org/job/JMeter-trunk/ws/gradlew> -Djava.awt.headless=true
-PignoreSpotBugsFailures=true -Pspotbugs=true -PCI=true -Pcoverage=true cleanTest check assemble
sonarqube
To honour the JVM settings for this build a new JVM will be forked. Please consider using
the daemon: https://docs.gradle.org/5.5.1/userguide/gradle_daemon.html.
Daemon will be stopped at the end of the build stopping after processing

> Configure project :buildSrc
ConnectException: Downloading key 98fe03a974ce0a0b for org.jetbrains.kotlin:kotlin-stdlib-jdk8:1.3.31@jar.asc
(attempt 1 of 40, 2a00:c6c0:0:154:1:0:0:1, hkp://keys.openpgp.org)

> Task :buildSrc:compileKotlin NO-SOURCE
> Task :buildSrc:compileJava NO-SOURCE
> Task :buildSrc:compileGroovy NO-SOURCE
> Task :buildSrc:pluginDescriptors UP-TO-DATE
> Task :buildSrc:processResources NO-SOURCE
> Task :buildSrc:classes UP-TO-DATE
> Task :buildSrc:inspectClassesForKotlinIC UP-TO-DATE
> Task :buildSrc:jar UP-TO-DATE
> Task :buildSrc:assemble UP-TO-DATE
> Task :buildSrc:compileTestKotlin NO-SOURCE
> Task :buildSrc:compileTestJava NO-SOURCE
> Task :buildSrc:compileTestGroovy NO-SOURCE
> Task :buildSrc:processTestResources NO-SOURCE
> Task :buildSrc:testClasses UP-TO-DATE
> Task :buildSrc:validateTaskProperties UP-TO-DATE

> Task :buildSrc:batchtest:compileKotlin
ConnectException: Downloading key c84125c13bf6f2f2 for org.ajoberstar.grgit:grgit-gradle:3.1.1@jar.asc
(attempt 1 of 40, 2605:bc80:3010:600:dead:beef:cafe:fedc, https://keys.fedoraproject.org)
ConnectException: Downloading key 5b05ccde140c2876 for org.eclipse.jgit:org.eclipse.jgit:5.3.0.201903130848-r@jar.asc
(attempt 1 of 40, 2001:67c:21ec:1000:0:0:0:a, hkp://pool.sks-keyservers.net)
ConnectException: Downloading key 5b05ccde140c2876 for org.eclipse.jgit:org.eclipse.jgit:5.3.0.201903130848-r@jar.asc
(attempt 2 of 40, 2001:41d0:800:d1e:0:0:82:0, hkp://pool.sks-keyservers.net)
ConnectException: Downloading key 5b05ccde140c2876 for org.eclipse.jgit:org.eclipse.jgit:5.3.0.201903130848-r@jar.asc
(attempt 3 of 40, 2001:720:418:caf1:0:0:0:8, hkp://pool.sks-keyservers.net)
ConnectException: Downloading key 5b05ccde140c2876 for org.eclipse.jgit:org.eclipse.jgit:5.3.0.201903130848-r@jar.asc
(attempt 4 of 40, 2001:ba8:1f1:f2d4:0:0:0:2, hkp://pool.sks-keyservers.net)
ConnectException: Downloading key 5b05ccde140c2876 for org.eclipse.jgit:org.eclipse.jgit:5.3.0.201903130848-r@jar.asc
(attempt 5 of 40, 2001:19f0:5001:2dba:ec4:7aff:fe8e:faf2, hkp://pool.sks-keyservers.net)
ConnectException: Downloading key 5b05ccde140c2876 for org.eclipse.jgit:org.eclipse.jgit:5.3.0.201903130848-r@jar.asc
(attempt 6 of 40, 2a02:c207:3003:2176:0:0:0:1, hkp://pool.sks-keyservers.net)
SocketTimeoutException: Downloading key 5b05ccde140c2876 for org.eclipse.jgit:org.eclipse.jgit:5.3.0.201903130848-r@jar.asc
(attempt 7 of 40, 37.191.231.105, hkp://pool.sks-keyservers.net)

> Task :buildSrc:batchtest:pluginDescriptors UP-TO-DATE
> Task :buildSrc:batchtest:processResources UP-TO-DATE
> Task :buildSrc:batchtest:processTestResources NO-SOURCE
> Task :buildSrc:batchtest:compileJava NO-SOURCE
> Task :buildSrc:batchtest:classes UP-TO-DATE
> Task :buildSrc:batchtest:inspectClassesForKotlinIC
> Task :buildSrc:batchtest:jar
> Task :buildSrc:batchtest:assemble
> Task :buildSrc:batchtest:compileTestKotlin NO-SOURCE
> Task :buildSrc:batchtest:pluginUnderTestMetadata
> Task :buildSrc:batchtest:compileTestJava NO-SOURCE
> Task :buildSrc:batchtest:testClasses UP-TO-DATE
> Task :buildSrc:batchtest:test NO-SOURCE
> Task :buildSrc:pluginUnderTestMetadata
> Task :buildSrc:test NO-SOURCE
> Task :buildSrc:check UP-TO-DATE
> Task :buildSrc:build UP-TO-DATE
> Task :buildSrc:batchtest:validateTaskProperties
> Task :buildSrc:batchtest:check
> Task :buildSrc:batchtest:build
PGP key resolution time: 5961ms, resolution requests: 30, download time: 5285ms, keys downloaded:
9
PGP verification time: 6984ms, files processed: 30, processed: 47MiB, skipped: 95MiB

> Configure project :
ConnectException: Downloading key 7a01b0f236e5430f for com.google.code.gson:gson:2.8.2@jar.asc
(attempt 1 of 40, 2a00:c6c0:0:154:1:0:0:1, hkp://keys.openpgp.org)
ConnectException: Downloading key abe9f3126bb741c1 for com.google.guava:guava:25.1-jre@jar.asc
(attempt 1 of 40, 2a02:168:f405:0:0:0:0:37, hkp://pool.sks-keyservers.net)
SocketTimeoutException: Downloading key c84125c13bf6f2f2 for org.ajoberstar.grgit:grgit-gradle:3.1.1@jar.asc
(attempt 1 of 40, 51.38.91.189, hkp://pool.sks-keyservers.net)
ConnectException: Downloading key c84125c13bf6f2f2 for org.ajoberstar.grgit:grgit-gradle:3.1.1@jar.asc
(attempt 2 of 40, 2001:41d0:800:d1e:0:0:82:0, hkp://pool.sks-keyservers.net)
Retrying Downloading key 59a252fb1199d873 for com.google.code.findbugs:jsr305:3.0.2@jar.asc
(attempt 1 of 40, 89.231.96.83, hkp://pool.sks-keyservers.net): Keyserver should respond with
successful HTTP codes (200..300), actual code is 503, url: http://pool.sks-keyservers.net:11371/pks/lookup?op=get&options=mr&search=0x59a252fb1199d873
ConnectException: Downloading key b16698a4adf4d638 for org.checkerframework:checker-qual:2.0.0@jar.asc
(attempt 1 of 40, 2a01:4f9:c010:206b:0:0:0:1, hkp://pool.sks-keyservers.net)
ConnectException: Downloading key b16698a4adf4d638 for org.checkerframework:checker-qual:2.0.0@jar.asc
(attempt 2 of 40, 2607:f140:8801:0:0:0:1:65, hkp://pool.sks-keyservers.net)
SocketTimeoutException: Downloading key b16698a4adf4d638 for org.checkerframework:checker-qual:2.0.0@jar.asc
(attempt 3 of 40, 193.224.163.43, hkp://pool.sks-keyservers.net)
ConnectException: Downloading key b16698a4adf4d638 for org.checkerframework:checker-qual:2.0.0@jar.asc
(attempt 4 of 40, 2001:4c80:40:628:5c70:d1ff:fe44:1424, hkp://pool.sks-keyservers.net)
ConnectException: Downloading key bf935c771a8474f8 for com.google.errorprone:error_prone_annotations:2.1.3@jar.asc
(attempt 1 of 40, 2001:67c:26b4:0:0:0:98:0, hkp://pool.sks-keyservers.net)
ConnectException: Downloading key 6525fd70cc303655 for org.codehaus.mojo:animal-sniffer-annotations:1.14@jar.asc
(attempt 1 of 40, 2001:720:418:caf1:0:0:0:8, hkp://pool.sks-keyservers.net)
ConnectException: Downloading key 6525fd70cc303655 for org.codehaus.mojo:animal-sniffer-annotations:1.14@jar.asc
(attempt 2 of 40, 2605:bc80:3010:600:dead:beef:cafe:fedc, https://keys.fedoraproject.org)
ConnectException: Downloading key 6525fd70cc303655 for org.codehaus.mojo:animal-sniffer-annotations:1.14@jar.asc
(attempt 3 of 40, 2a02:c207:3003:2176:0:0:0:1, hkp://pool.sks-keyservers.net)
ConnectException: Downloading key 6525fd70cc303655 for org.codehaus.mojo:animal-sniffer-annotations:1.14@jar.asc
(attempt 4 of 40, 2001:738:0:600:216:3eff:fe02:42, hkp://pool.sks-keyservers.net)
ConnectException: Downloading key 6525fd70cc303655 for org.codehaus.mojo:animal-sniffer-annotations:1.14@jar.asc
(attempt 5 of 40, 2001:67c:21ec:1000:0:0:0:a, hkp://pool.sks-keyservers.net)
Building JMeter 5.2.0-SNAPSHOT
PGP key resolution time: 7630ms, resolution requests: 32, download time: 7521ms, keys downloaded:
24
PGP verification time: 2241ms, files processed: 32, processed: 17MiB, skipped: 0MiB

FAILURE: Build failed with an exception.

* What went wrong:
Could not determine the dependencies of task ':src:dist-check:batchTests'.
> Could not create task ':src:dist-check:batchSlowCharsFeatureHttpClient4'.
   > Could not create task of type 'BatchTest'.
      > Extension of type 'BatchTest' does not exist. Currently registered extension types:
[ExtraPropertiesExtension]

* Try:
Run with --stacktrace option to get the stack trace. Run with --info or --debug option to
get more log output. Run with --scan to get full insights.

* Get more help at https://help.gradle.org

Deprecated Gradle features were used in this build, making it incompatible with Gradle 6.0.
Use '--warning-mode all' to show the individual deprecation warnings.
See https://docs.gradle.org/5.5.1/userguide/command_line_interface.html#sec:command_line_warnings

BUILD FAILED in 2m 25s
Build step 'Invoke Gradle script' changed build result to FAILURE
Build step 'Invoke Gradle script' marked build as failure
[locks-and-latches] Releasing all the locks
[locks-and-latches] All the locks released
Archiving artifacts
[Fast Archiver] Compressed 162.78 MB of artifacts by 69.4% relative to #7346
Recording test results
ERROR: Step ?Publish JUnit test result report? failed: Test reports were found but none of
them are new. Did leafNodes run? 
For example, <https://builds.apache.org/job/JMeter-trunk/ws/src/components/build/test-results/test/TEST-org.apache.jmeter.assertions.CompareAssertionSpec.xml>
is 2 days 13 hr old


Mime
View raw message