jmeter-dev mailing list archives

Site index · List index
Message view « Date » · « Thread »
Top « Date » · « Thread »
From Apache Jenkins Server <jenk...@builds.apache.org>
Subject Build failed in Jenkins: JMeter Windows #1493
Date Sat, 28 Sep 2019 20:34:48 GMT
See <https://builds.apache.org/job/JMeter%20Windows/1493/display/redirect>

------------------------------------------
[...truncated 142.50 KB...]
> Task :src:components:compileTestGroovy
> Task :src:components:testClasses
> Task :src:components:checkstyleTest
> Task :src:components:spotbugsMain SKIPPED
> Task :src:components:spotbugsTest SKIPPED

> Task :src:components:test

Gradle Test Executor 14 STANDARD_OUT
    Setting JMeterHome: F:\jenkins\jenkins-slave\workspace\JMeter Windows\src\components\..\..\.
    Initializing Properties: ../.././bin/jmeter.properties

Gradle Test Executor 14 STANDARD_ERROR
    Sep 28, 2019 1:32:42 PM java.util.prefs.WindowsPreferences <init>
    WARNING: Could not open/create prefs root node Software\JavaSoft\Prefs at root 0x80000002.
Windows RegCreateKeyEx(...) returned error code 5.

Gradle Test Executor 14 STANDARD_OUT
    JMeterVersion=5.2.0-SNAPSHOT 32f4a74
    java.version=1.8.0_152
    java.vm.name=Java HotSpot(TM) 64-Bit Server VM
    java.vendor=Oracle Corporation
    java.home=F:\jenkins\tools\java\latest1.8\jre
    file.encoding=windows-1252
    default encoding=windows-1252
    user.home=C:\Users\jenkins
    user.dir=F:\jenkins\jenkins-slave\workspace\JMeter Windows\src\components
    user.language=en
    user.region=null
    user.country=US
    user.variant=
    Locale=en_US
    java.class.version=52.0
    java.awt.headless=
    os.name=Windows Server 2016
    os.version=10.0
    os.arch=amd64

> Task :src:core:check
> Task :src:core:assemble
> Task :src:components:check
> Task :src:components:jar
> Task :src:examples:spotbugsMain SKIPPED
> Task :src:examples:spotbugsTest SKIPPED
> Task :src:generator:spotbugsMain SKIPPED
> Task :src:generator:spotbugsTest SKIPPED
> Task :src:generator:test NO-SOURCE
> Task :src:generator:check
> Task :src:examples:test NO-SOURCE
> Task :src:examples:check
> Task :src:components:testJar
> Task :src:components:assemble
SocketTimeoutException: Downloading key e57428da9e879e7d for com.helger:ph-css:6.1.1@jar.asc
(attempt 1 of 40, 162.213.33.9, https://keyserver.ubuntu.com)

> Task :src:functions:compileJava
Note: F:\jenkins\jenkins-slave\workspace\JMeter Windows\src\functions\src\main\java\org\apache\jmeter\functions\StringFromFile.java
uses or overrides a deprecated API.
Note: Recompile with -Xlint:deprecation for details.

> Task :src:functions:compileGroovy NO-SOURCE
> Task :src:functions:classes
> Task :src:functions:jar
> Task :src:functions:compileTestJava
> Task :src:functions:compileTestGroovy
> Task :src:functions:testClasses
> Task :src:functions:testJar

> Task :src:protocol:http:compileJava
Note: Some input files use or override a deprecated API.
Note: Recompile with -Xlint:deprecation for details.
Note: F:\jenkins\jenkins-slave\workspace\JMeter Windows\src\protocol\http\src\main\java\org\apache\jmeter\protocol\http\sampler\HTTPHC4Impl.java
uses unchecked or unsafe operations.
Note: Recompile with -Xlint:unchecked for details.

> Task :src:functions:checkstyleMain
> Task :src:protocol:http:compileGroovy NO-SOURCE
> Task :src:protocol:http:classes
> Task :src:dist:compileJava NO-SOURCE
> Task :src:dist:classes UP-TO-DATE
> Task :src:dist:checkstyleMain NO-SOURCE
> Task :src:dist:jar
> Task :src:functions:checkstyleTest
> Task :src:functions:spotbugsMain SKIPPED
> Task :src:functions:spotbugsTest SKIPPED
> Task :src:protocol:http:jar
> Task :src:dist-check:compileJava NO-SOURCE
> Task :src:dist-check:compileGroovy NO-SOURCE
> Task :src:dist-check:classes UP-TO-DATE
> Task :src:dist-check:checkstyleMain NO-SOURCE
> Task :src:dist-check:spotbugsMain SKIPPED
> Task :src:dist-check:jar
> Task :src:dist-check:assemble

> Task :src:functions:test

Gradle Test Executor 15 STANDARD_OUT
    Setting JMeterHome: F:\jenkins\jenkins-slave\workspace\JMeter Windows\src\functions\..\..\.
    Initializing Properties: ../.././bin/jmeter.properties

Gradle Test Executor 15 STANDARD_ERROR
    Sep 28, 2019 1:33:08 PM java.util.prefs.WindowsPreferences <init>
    WARNING: Could not open/create prefs root node Software\JavaSoft\Prefs at root 0x80000002.
Windows RegCreateKeyEx(...) returned error code 5.

Gradle Test Executor 15 STANDARD_OUT
    JMeterVersion=5.2.0-SNAPSHOT 32f4a74
    java.version=1.8.0_152
    java.vm.name=Java HotSpot(TM) 64-Bit Server VM
    java.vendor=Oracle Corporation
    java.home=F:\jenkins\tools\java\latest1.8\jre
    file.encoding=windows-1252
    default encoding=windows-1252
    user.home=C:\Users\jenkins
    user.dir=F:\jenkins\jenkins-slave\workspace\JMeter Windows\src\functions
    user.language=en
    user.region=null
    user.country=US
    user.variant=
    Locale=en_US
    java.class.version=52.0
    java.awt.headless=
    os.name=Windows Server 2016
    os.version=10.0
    os.arch=amd64

> Task :src:protocol:http:compileTestJava
Note: Some input files use or override a deprecated API.
Note: Recompile with -Xlint:deprecation for details.

> Task :src:dist:javadocAggregate
javadoc: warning - Multiple sources of package comments found for package "org.apache.jmeter.assertions"
javadoc: warning - Multiple sources of package comments found for package "org.apache.jmeter.visualizers"

> Task :src:protocol:http:compileTestGroovy
> Task :src:protocol:http:testClasses

> Task :src:functions:test

org.apache.jmeter.functions.StringFromFileFunctionTest STANDARD_ERROR
    Sep 28, 2019 1:33:09 PM org.junit.jupiter.engine.execution.JupiterEngineExecutionContext
close
    SEVERE: Caught exception while closing extension context: org.junit.jupiter.engine.descriptor.ClassExtensionContext@7567b353
    java.io.IOException: Failed to delete temp directory C:\Users\jenkins\AppData\Local\Temp\3\junit2164443231444756592.
The following paths could not be deleted (see suppressed exceptions for details): , SFFTest1.txt
    	at org.junit.jupiter.engine.extension.TempDirectory$CloseablePath.createIOExceptionWithAttachedFailures(TempDirectory.java:211)
    	at org.junit.jupiter.engine.extension.TempDirectory$CloseablePath.close(TempDirectory.java:168)
    	at org.junit.platform.engine.support.hierarchical.ThrowableCollector.execute(ThrowableCollector.java:73)
    	at org.junit.jupiter.engine.execution.ExtensionValuesStore.closeAllStoredCloseableValues(ExtensionValuesStore.java:61)
    	at org.junit.jupiter.engine.descriptor.AbstractExtensionContext.close(AbstractExtensionContext.java:73)
    	at org.junit.jupiter.engine.execution.JupiterEngineExecutionContext.close(JupiterEngineExecutionContext.java:53)
    	at org.junit.jupiter.engine.descriptor.JupiterTestDescriptor.cleanUp(JupiterTestDescriptor.java:222)
    	at org.junit.jupiter.engine.descriptor.JupiterTestDescriptor.cleanUp(JupiterTestDescriptor.java:57)
    	at org.junit.platform.engine.support.hierarchical.NodeTestTask.lambda$cleanUp$9(NodeTestTask.java:151)
    	at org.junit.platform.engine.support.hierarchical.ThrowableCollector.execute(ThrowableCollector.java:73)
    	at org.junit.platform.engine.support.hierarchical.NodeTestTask.cleanUp(NodeTestTask.java:151)
    	at org.junit.platform.engine.support.hierarchical.NodeTestTask.execute(NodeTestTask.java:83)
    	at org.junit.platform.engine.support.hierarchical.ForkJoinPoolHierarchicalTestExecutorService$ExclusiveTask.compute(ForkJoinPoolHierarchicalTestExecutorService.java:171)
    	at org.junit.platform.engine.support.hierarchical.ForkJoinPoolHierarchicalTestExecutorService.executeNonConcurrentTasks(ForkJoinPoolHierarchicalTestExecutorService.java:141)
    	at org.junit.platform.engine.support.hierarchical.ForkJoinPoolHierarchicalTestExecutorService.invokeAll(ForkJoinPoolHierarchicalTestExecutorService.java:121)
    	at org.junit.platform.engine.support.hierarchical.NodeTestTask.lambda$executeRecursively$5(NodeTestTask.java:139)
    	at org.junit.platform.engine.support.hierarchical.ThrowableCollector.execute(ThrowableCollector.java:73)
    	at org.junit.platform.engine.support.hierarchical.NodeTestTask.lambda$executeRecursively$7(NodeTestTask.java:125)
    	at org.junit.platform.engine.support.hierarchical.Node.around(Node.java:135)
    	at org.junit.platform.engine.support.hierarchical.NodeTestTask.lambda$executeRecursively$8(NodeTestTask.java:123)
    	at org.junit.platform.engine.support.hierarchical.ThrowableCollector.execute(ThrowableCollector.java:73)
    	at org.junit.platform.engine.support.hierarchical.NodeTestTask.executeRecursively(NodeTestTask.java:122)
    	at org.junit.platform.engine.support.hierarchical.NodeTestTask.execute(NodeTestTask.java:80)
    	at org.junit.platform.engine.support.hierarchical.ForkJoinPoolHierarchicalTestExecutorService$ExclusiveTask.compute(ForkJoinPoolHierarchicalTestExecutorService.java:171)
    	at java.util.concurrent.RecursiveAction.exec(RecursiveAction.java:189)
    	at java.util.concurrent.ForkJoinTask.doExec(ForkJoinTask.java:289)
    	at java.util.concurrent.ForkJoinPool$WorkQueue.runTask(ForkJoinPool.java:1056)
    	at java.util.concurrent.ForkJoinPool.runWorker(ForkJoinPool.java:1692)
    	at java.util.concurrent.ForkJoinWorkerThread.run(ForkJoinWorkerThread.java:157)
    	Suppressed: java.nio.file.DirectoryNotEmptyException: C:\Users\jenkins\AppData\Local\Temp\3\junit2164443231444756592
    		at sun.nio.fs.WindowsFileSystemProvider.implDelete(WindowsFileSystemProvider.java:266)
    		at sun.nio.fs.AbstractFileSystemProvider.delete(AbstractFileSystemProvider.java:103)
    		at java.nio.file.Files.delete(Files.java:1126)
    		at org.junit.jupiter.engine.extension.TempDirectory$CloseablePath$1.deleteAndContinue(TempDirectory.java:192)
    		at org.junit.jupiter.engine.extension.TempDirectory$CloseablePath$1.postVisitDirectory(TempDirectory.java:187)
    		at org.junit.jupiter.engine.extension.TempDirectory$CloseablePath$1.postVisitDirectory(TempDirectory.java:178)
    		at java.nio.file.Files.walkFileTree(Files.java:2688)
    		at java.nio.file.Files.walkFileTree(Files.java:2742)
    		at org.junit.jupiter.engine.extension.TempDirectory$CloseablePath.deleteAllFilesAndDirectories(TempDirectory.java:178)
    		at org.junit.jupiter.engine.extension.TempDirectory$CloseablePath.close(TempDirectory.java:166)
    		... 27 more
    	Suppressed: java.nio.file.FileSystemException: C:\Users\jenkins\AppData\Local\Temp\3\junit2164443231444756592\SFFTest1.txt:
The process cannot access the file because it is being used by another process.

    		at sun.nio.fs.WindowsException.translateToIOException(WindowsException.java:86)
    		at sun.nio.fs.WindowsException.rethrowAsIOException(WindowsException.java:97)
    		at sun.nio.fs.WindowsException.rethrowAsIOException(WindowsException.java:102)
    		at sun.nio.fs.WindowsFileSystemProvider.implDelete(WindowsFileSystemProvider.java:269)
    		at sun.nio.fs.AbstractFileSystemProvider.delete(AbstractFileSystemProvider.java:103)
    		at java.nio.file.Files.delete(Files.java:1126)
    		at org.junit.jupiter.engine.extension.TempDirectory$CloseablePath$1.deleteAndContinue(TempDirectory.java:192)
    		at org.junit.jupiter.engine.extension.TempDirectory$CloseablePath$1.visitFile(TempDirectory.java:182)
    		at org.junit.jupiter.engine.extension.TempDirectory$CloseablePath$1.visitFile(TempDirectory.java:178)
    		at java.nio.file.Files.walkFileTree(Files.java:2670)
    		at java.nio.file.Files.walkFileTree(Files.java:2742)
    		at org.junit.jupiter.engine.extension.TempDirectory$CloseablePath.deleteAllFilesAndDirectories(TempDirectory.java:178)
    		at org.junit.jupiter.engine.extension.TempDirectory$CloseablePath.close(TempDirectory.java:166)
    		... 27 more


org.apache.jmeter.functions.StringFromFileFunctionTest > executionError FAILED
    java.io.IOException: Failed to delete temp directory C:\Users\jenkins\AppData\Local\Temp\3\junit2164443231444756592.
The following paths could not be deleted (see suppressed exceptions for details): , SFFTest1.txt

> Task :src:protocol:http:testJar
> Task :src:dist-check:compileTestJava

> Task :src:dist:javadocAggregate
javadoc: warning - Multiple sources of package comments found for package "org.apache.jmeter.report.config"
javadoc: warning - Multiple sources of package comments found for package "org.apache.jmeter.report.core"
javadoc: warning - Multiple sources of package comments found for package "org.apache.jmeter.report.dashboard"
javadoc: warning - Multiple sources of package comments found for package "org.apache.jmeter.report.processor"
javadoc: warning - Multiple sources of package comments found for package "org.apache.jmeter.report.processor.graph"
javadoc: warning - Multiple sources of package comments found for package "org.apache.jmeter.report.processor.graph.impl"
javadoc: warning - Multiple sources of package comments found for package "org.apache.commons.cli.avalon"

> Task :src:dist-check:compileTestGroovy
> Task :src:dist-check:testClasses
> Task :src:protocol:http:checkstyleMain

> Task :src:functions:test

264 tests completed, 1 failed, 5 skipped

> Task :src:dist-check:checkstyleTest
> Task :src:dist-check:spotbugsTest SKIPPED
> Task :src:functions:test FAILED
> Task :src:protocol:http:checkstyleTest

> Task :src:dist:javadocAggregate
9 warnings
checksum-dependency elapsed time: 10457ms, configurations processed: 404 (add -PchecksumTimingsPrint
to print detailed timings)

FAILURE: Build failed with an exception.

* What went wrong:
Execution failed for task ':src:functions:test'.
> There were failing tests. See the report at: file:///F:/jenkins/jenkins-slave/workspace/JMeter%20Windows/src/functions/build/reports/tests/test/index.html

* Try:
Run with --stacktrace option to get the stack trace. Run with --info or --debug option to
get more log output. Run with --scan to get full insights.

* Get more help at https://help.gradle.org

Deprecated Gradle features were used in this build, making it incompatible with Gradle 6.0.
Use '--warning-mode all' to show the individual deprecation warnings.
See https://docs.gradle.org/5.6.2/userguide/command_line_interface.html#sec:command_line_warnings

BUILD FAILED in 3m 13s
213 actionable tasks: 141 executed, 72 up-to-date
Could not open/create prefs root node Software\JavaSoft\Prefs at root 0x80000002. Windows
RegCreateKeyEx(...) returned error code 5.
Build step 'Invoke Gradle script' changed build result to FAILURE
Build step 'Invoke Gradle script' marked build as failure

Mime
View raw message