jmeter-dev mailing list archives

Site index · List index
Message view « Date » · « Thread »
Top « Date » · « Thread »
From Apache Jenkins Server <jenk...@builds.apache.org>
Subject Build failed in Jenkins: JMeter-trunk #7427
Date Mon, 30 Sep 2019 20:57:49 GMT
See <https://builds.apache.org/job/JMeter-trunk/7427/display/redirect?page=changes>

Changes:

[pmouawad] This commit fixes bugs 63614 and 63723 Bug 63614 - Distributed testing:


------------------------------------------
[...truncated 1.53 MB...]
  Source paths: src/main/java
  Test paths: src/test/java
Indexing files of module 'mongodb'
  Base dir: <https://builds.apache.org/job/JMeter-trunk/ws/src/protocol/mongodb>
  Source paths: src/main/java
  Test paths: src/test/java
Indexing files of module 'native'
  Base dir: <https://builds.apache.org/job/JMeter-trunk/ws/src/protocol/native>
  Source paths: src/main/java
  Test paths: src/test/java
Indexing files of module 'tcp'
  Base dir: <https://builds.apache.org/job/JMeter-trunk/ws/src/protocol/tcp>
  Source paths: src/main/java
  Test paths: src/test/java
Indexing files of module 'protocol'
  Base dir: <https://builds.apache.org/job/JMeter-trunk/ws/src/protocol>
Indexing files of module 'release'
  Base dir: <https://builds.apache.org/job/JMeter-trunk/ws/src/release>
Indexing files of module 'testkit'
  Base dir: <https://builds.apache.org/job/JMeter-trunk/ws/src/testkit>
  Source paths: src/main/java
Indexing files of module 'testkit-wiremock'
  Base dir: <https://builds.apache.org/job/JMeter-trunk/ws/src/testkit-wiremock>
  Source paths: src/main/java
Indexing files of module 'src'
  Base dir: <https://builds.apache.org/job/JMeter-trunk/ws/src>
Indexing files of module 'JMeter'
  Base dir: <https://builds.apache.org/job/JMeter-trunk/ws/>

1387 files indexed

> Task :sonarqube
0 files ignored because of scm ignore settings
Quality profile for java: Sonar way
------------- Run sensors on module bshclient
Load metrics repository
Load metrics repository (done) | time=187ms
Sensor JavaSquidSensor [java]

Expiring Daemon due to JVM Metaspace space being exhausted

> Task :sonarqube
Configured Java source version (sonar.java.source): 8
JavaClasspath initialization
JavaClasspath initialization (done) | time=24ms
JavaTestClasspath initialization
JavaTestClasspath initialization (done) | time=3ms
Java Main Files AST scan
1 source files to be analyzed
Load project repositories
Load project repositories (done) | time=680ms

1/1 source files have been analyzed
0/0 source files have been analyzed

> Task :sonarqube
Java Main Files AST scan (done) | time=2505ms
Java Test Files AST scan
0 source files to be analyzed
Java Test Files AST scan (done) | time=1ms
Sensor JavaSquidSensor [java] (done) | time=3864ms
Sensor Import of SpotBugs issues [java]
Importing <https://builds.apache.org/job/JMeter-trunk/ws/src/bshclient/build/reports/spotbugs/main.xml>
Sensor Import of SpotBugs issues [java] (done) | time=83ms
Sensor SurefireSensor [java]
parsing [<https://builds.apache.org/job/JMeter-trunk/ws/src/bshclient/target/surefire-reports]>
Sensor SurefireSensor [java] (done) | time=5ms
Sensor JaCoCoSensor [java]
Sensor JaCoCoSensor [java] (done) | time=3ms
Sensor JavaXmlSensor [java]
Sensor JavaXmlSensor [java] (done) | time=2ms
Sensor HTML [web]
Sensor HTML [web] (done) | time=10ms
Sensor JaCoCo XML Report Importer [jacoco]
Sensor JaCoCo XML Report Importer [jacoco] (done) | time=472ms
------------- Run sensors on module licenses
Sensor JavaXmlSensor [java]
Sensor JavaXmlSensor [java] (done) | time=1ms
Sensor JaCoCo XML Report Importer [jacoco]
Sensor JaCoCo XML Report Importer [jacoco] (done) | time=3ms
------------- Run sensors on module config
Sensor JavaXmlSensor [java]
Sensor JavaXmlSensor [java] (done) | time=0ms
Sensor JaCoCo XML Report Importer [jacoco]
Sensor JaCoCo XML Report Importer [jacoco] (done) | time=1ms
------------- Run sensors on module functions
Sensor JavaSquidSensor [java]
Configured Java source version (sonar.java.source): 8
JavaClasspath initialization
JavaClasspath initialization (done) | time=2ms
JavaTestClasspath initialization
JavaTestClasspath initialization (done) | time=5ms
Java Main Files AST scan
55 source files to be analyzed

Expiring Daemon due to JVM Metaspace space being exhausted
0/55 files analyzed, current file: src/functions/src/main/java/org/apache/jmeter/functions/TimeShift.java
Expiring Daemon due to JVM Metaspace space being exhausted
0/55 files analyzed, current file: src/functions/src/main/java/org/apache/jmeter/functions/TimeShift.java
Expiring Daemon due to JVM Metaspace space being exhausted
Expiring Daemon due to JVM Metaspace space being exhausted
0/55 files analyzed, current file: src/functions/src/main/java/org/apache/jmeter/functions/TimeShift.java
0/55 files analyzed, current file: src/functions/src/main/java/org/apache/jmeter/functions/TimeShift.java
Expiring Daemon due to JVM Metaspace space being exhausted
Expiring Daemon due to JVM Metaspace space being exhausted
0/55 files analyzed, current file: src/functions/src/main/java/org/apache/jmeter/functions/TimeShift.java
Expiring Daemon due to JVM Metaspace space being exhausted
0/55 files analyzed, current file: src/functions/src/main/java/org/apache/jmeter/functions/TimeShift.java
Expiring Daemon due to JVM Metaspace space being exhausted
0/55 files analyzed, current file: src/functions/src/main/java/org/apache/jmeter/functions/TimeShift.java
Expiring Daemon due to JVM Metaspace space being exhausted
0/55 files analyzed, current file: src/functions/src/main/java/org/apache/jmeter/functions/TimeShift.java
Expiring Daemon due to JVM Metaspace space being exhausted
Expiring Daemon due to JVM Metaspace space being exhausted
0/55 files analyzed, current file: src/functions/src/main/java/org/apache/jmeter/functions/TimeShift.java
Expiring Daemon due to JVM Metaspace space being exhausted
0/55 files analyzed, current file: src/functions/src/main/java/org/apache/jmeter/functions/TimeShift.java
Expiring Daemon due to JVM Metaspace space being exhausted
Expiring Daemon due to JVM Metaspace space being exhausted
Expiring Daemon due to JVM Metaspace space being exhausted
Expiring Daemon due to JVM Metaspace space being exhausted
Expiring Daemon due to JVM Metaspace space being exhausted
Expiring Daemon due to JVM Metaspace space being exhausted
Expiring Daemon due to JVM Metaspace space being exhausted
Expiring Daemon due to JVM Metaspace space being exhausted
Expiring Daemon due to JVM Metaspace space being exhausted
Expiring Daemon due to JVM Metaspace space being exhausted
Expiring Daemon due to JVM Metaspace space being exhausted
Expiring Daemon due to JVM Metaspace space being exhausted
Expiring Daemon due to JVM Metaspace space being exhausted
Expiring Daemon due to JVM Metaspace space being exhausted
Expiring Daemon due to JVM Metaspace space being exhausted
Expiring Daemon due to JVM Metaspace space being exhausted
Expiring Daemon due to JVM Metaspace space being exhausted
Expiring Daemon due to JVM Metaspace space being exhausted
Expiring Daemon due to JVM Metaspace space being exhausted
Expiring Daemon due to JVM Metaspace space being exhausted
Expiring Daemon due to JVM Metaspace space being exhausted
Expiring Daemon due to JVM Metaspace space being exhausted
Expiring Daemon due to JVM Metaspace space being exhausted
Expiring Daemon due to JVM Metaspace space being exhausted
Expiring Daemon due to JVM Metaspace space being exhausted
Expiring Daemon due to JVM Metaspace space being exhausted
Expiring Daemon due to JVM Metaspace space being exhausted
Expiring Daemon due to JVM Metaspace space being exhausted
Expiring Daemon due to JVM Metaspace space being exhausted
Expiring Daemon due to JVM Metaspace space being exhausted
Expiring Daemon due to JVM Metaspace space being exhausted
Expiring Daemon due to JVM Metaspace space being exhausted
Expiring Daemon due to JVM Metaspace space being exhausted
Stopped 1 worker daemon(s).
VCS Checkout Cache (<https://builds.apache.org/job/JMeter-trunk/ws/.gradle/vcs-1)> removing
files not accessed on or after Mon Sep 23 20:34:25 UTC 2019.
VCS Checkout Cache (<https://builds.apache.org/job/JMeter-trunk/ws/.gradle/vcs-1)> cleaned
up in 0.006 secs.

FAILURE: Build failed with an exception.

* What went wrong:
java.lang.UnsupportedOperationException (no error message)

* Try:
Run with --debug option to get more log output. Run with --scan to get full insights.

* Exception is:
java.lang.UnsupportedOperationException
	at org.gradle.internal.service.DefaultServiceRegistry$FixedInstanceService.create(DefaultServiceRegistry.java:869)
	at org.gradle.internal.service.DefaultServiceRegistry$ManagedObjectServiceProvider.getInstance(DefaultServiceRegistry.java:556)
	at org.gradle.internal.service.DefaultServiceRegistry$FixedInstanceService.getDisplayName(DefaultServiceRegistry.java:864)
	at org.gradle.internal.service.DefaultServiceRegistry$SingletonService.toString(DefaultServiceRegistry.java:609)
	at org.gradle.internal.concurrent.CompositeStoppable.stop(CompositeStoppable.java:111)
	at org.gradle.internal.service.DefaultServiceRegistry$OwnServices.stop(DefaultServiceRegistry.java:470)
	at org.gradle.internal.concurrent.CompositeStoppable.stop(CompositeStoppable.java:106)
	at org.gradle.internal.service.DefaultServiceRegistry$CompositeServiceProvider.stop(DefaultServiceRegistry.java:962)
	at org.gradle.internal.concurrent.CompositeStoppable.stop(CompositeStoppable.java:106)
	at org.gradle.internal.service.DefaultServiceRegistry.close(DefaultServiceRegistry.java:259)
	at org.gradle.internal.concurrent.CompositeStoppable$2.stop(CompositeStoppable.java:90)
	at org.gradle.internal.concurrent.CompositeStoppable.stop(CompositeStoppable.java:106)
	at org.gradle.initialization.DefaultGradleLauncher.stop(DefaultGradleLauncher.java:258)
	at org.gradle.composite.internal.DefaultRootBuildState.stop(DefaultRootBuildState.java:69)
	at org.gradle.internal.concurrent.CompositeStoppable.stop(CompositeStoppable.java:106)
	at org.gradle.composite.internal.DefaultIncludedBuildRegistry.stop(DefaultIncludedBuildRegistry.java:256)
	at org.gradle.internal.concurrent.CompositeStoppable.stop(CompositeStoppable.java:106)
	at org.gradle.internal.service.DefaultServiceRegistry$ManagedObjectServiceProvider.stop(DefaultServiceRegistry.java:583)
	at org.gradle.internal.concurrent.CompositeStoppable.stop(CompositeStoppable.java:106)
	at org.gradle.internal.service.DefaultServiceRegistry$ManagedObjectServiceProvider.stop(DefaultServiceRegistry.java:583)
	at org.gradle.internal.concurrent.CompositeStoppable.stop(CompositeStoppable.java:106)
	at org.gradle.internal.service.DefaultServiceRegistry$OwnServices.stop(DefaultServiceRegistry.java:470)
	at org.gradle.internal.concurrent.CompositeStoppable.stop(CompositeStoppable.java:106)
	at org.gradle.internal.service.DefaultServiceRegistry$CompositeServiceProvider.stop(DefaultServiceRegistry.java:962)
	at org.gradle.internal.concurrent.CompositeStoppable.stop(CompositeStoppable.java:106)
	at org.gradle.internal.service.DefaultServiceRegistry.close(DefaultServiceRegistry.java:259)
	at org.gradle.launcher.exec.BuildTreeScopeBuildActionExecuter.execute(BuildTreeScopeBuildActionExecuter.java:44)
	at org.gradle.launcher.exec.BuildTreeScopeBuildActionExecuter.execute(BuildTreeScopeBuildActionExecuter.java:28)
	at org.gradle.tooling.internal.provider.ContinuousBuildActionExecuter.execute(ContinuousBuildActionExecuter.java:78)
	at org.gradle.tooling.internal.provider.ContinuousBuildActionExecuter.execute(ContinuousBuildActionExecuter.java:52)
	at org.gradle.tooling.internal.provider.SubscribableBuildActionExecuter.execute(SubscribableBuildActionExecuter.java:59)
	at org.gradle.tooling.internal.provider.SubscribableBuildActionExecuter.execute(SubscribableBuildActionExecuter.java:36)
	at org.gradle.tooling.internal.provider.SessionScopeBuildActionExecuter.execute(SessionScopeBuildActionExecuter.java:68)
	at org.gradle.tooling.internal.provider.SessionScopeBuildActionExecuter.execute(SessionScopeBuildActionExecuter.java:38)
	at org.gradle.tooling.internal.provider.GradleThreadBuildActionExecuter.execute(GradleThreadBuildActionExecuter.java:37)
	at org.gradle.tooling.internal.provider.GradleThreadBuildActionExecuter.execute(GradleThreadBuildActionExecuter.java:26)
	at org.gradle.tooling.internal.provider.ParallelismConfigurationBuildActionExecuter.execute(ParallelismConfigurationBuildActionExecuter.java:43)
	at org.gradle.tooling.internal.provider.ParallelismConfigurationBuildActionExecuter.execute(ParallelismConfigurationBuildActionExecuter.java:29)
	at org.gradle.tooling.internal.provider.StartParamsValidatingActionExecuter.execute(StartParamsValidatingActionExecuter.java:60)
	at org.gradle.tooling.internal.provider.StartParamsValidatingActionExecuter.execute(StartParamsValidatingActionExecuter.java:32)
	at org.gradle.tooling.internal.provider.SessionFailureReportingActionExecuter.execute(SessionFailureReportingActionExecuter.java:55)
	at org.gradle.tooling.internal.provider.SessionFailureReportingActionExecuter.execute(SessionFailureReportingActionExecuter.java:41)
	at org.gradle.tooling.internal.provider.SetupLoggingActionExecuter.execute(SetupLoggingActionExecuter.java:48)
	at org.gradle.tooling.internal.provider.SetupLoggingActionExecuter.execute(SetupLoggingActionExecuter.java:32)
	at org.gradle.launcher.daemon.server.exec.ExecuteBuild.doBuild(ExecuteBuild.java:68)
	at org.gradle.launcher.daemon.server.exec.BuildCommandOnly.execute(BuildCommandOnly.java:37)
	at org.gradle.launcher.daemon.server.api.DaemonCommandExecution.proceed(DaemonCommandExecution.java:104)
	at org.gradle.launcher.daemon.server.exec.WatchForDisconnection.execute(WatchForDisconnection.java:39)
	at org.gradle.launcher.daemon.server.api.DaemonCommandExecution.proceed(DaemonCommandExecution.java:104)
	at org.gradle.launcher.daemon.server.exec.ResetDeprecationLogger.execute(ResetDeprecationLogger.java:27)
	at org.gradle.launcher.daemon.server.api.DaemonCommandExecution.proceed(DaemonCommandExecution.java:104)
	at org.gradle.launcher.daemon.server.exec.RequestStopIfSingleUsedDaemon.execute(RequestStopIfSingleUsedDaemon.java:35)
	at org.gradle.launcher.daemon.server.api.DaemonCommandExecution.proceed(DaemonCommandExecution.java:104)
	at org.gradle.launcher.daemon.server.exec.ForwardClientInput$2.create(ForwardClientInput.java:78)
	at org.gradle.launcher.daemon.server.exec.ForwardClientInput$2.create(ForwardClientInput.java:75)
	at org.gradle.util.Swapper.swap(Swapper.java:38)
	at org.gradle.launcher.daemon.server.exec.ForwardClientInput.execute(ForwardClientInput.java:75)
	at org.gradle.launcher.daemon.server.api.DaemonCommandExecution.proceed(DaemonCommandExecution.java:104)
	at org.gradle.launcher.daemon.server.exec.LogAndCheckHealth.execute(LogAndCheckHealth.java:50)
	at org.gradle.launcher.daemon.server.api.DaemonCommandExecution.proceed(DaemonCommandExecution.java:104)
	at org.gradle.launcher.daemon.server.exec.LogToClient.doBuild(LogToClient.java:63)
	at org.gradle.launcher.daemon.server.exec.BuildCommandOnly.execute(BuildCommandOnly.java:37)
	at org.gradle.launcher.daemon.server.api.DaemonCommandExecution.proceed(DaemonCommandExecution.java:104)
	at org.gradle.launcher.daemon.server.exec.EstablishBuildEnvironment.doBuild(EstablishBuildEnvironment.java:82)
	at org.gradle.launcher.daemon.server.exec.BuildCommandOnly.execute(BuildCommandOnly.java:37)
	at org.gradle.launcher.daemon.server.api.DaemonCommandExecution.proceed(DaemonCommandExecution.java:104)
	at org.gradle.launcher.daemon.server.exec.StartBuildOrRespondWithBusy$1.run(StartBuildOrRespondWithBusy.java:52)
	at org.gradle.launcher.daemon.server.DaemonStateCoordinator$1.run(DaemonStateCoordinator.java:297)
	at org.gradle.internal.concurrent.ExecutorPolicy$CatchAndRecordFailures.onExecute(ExecutorPolicy.java:64)
	at org.gradle.internal.concurrent.ManagedExecutorImpl$1.run(ManagedExecutorImpl.java:48)
	at org.gradle.internal.concurrent.ThreadFactoryImpl$ManagedThreadRunnable.run(ThreadFactoryImpl.java:56)


* Get more help at https://help.gradle.org

Deprecated Gradle features were used in this build, making it incompatible with Gradle 6.0.
Use '--warning-mode all' to show the individual deprecation warnings.
See https://docs.gradle.org/5.6.2/userguide/command_line_interface.html#sec:command_line_warnings

BUILD FAILED in 24m 14s
Build step 'Invoke Gradle script' changed build result to FAILURE
Build step 'Invoke Gradle script' marked build as failure
Archiving artifacts
[Fast Archiver] Compressed 148.61 MB of artifacts by 77.5% relative to #7426
Recording test results

Mime
View raw message