jmeter-dev mailing list archives

Site index · List index
Message view « Date » · « Thread »
Top « Date » · « Thread »
From Apache Jenkins Server <jenk...@builds.apache.org>
Subject Build failed in Jenkins: JMeter Ubuntu #837
Date Sat, 07 Sep 2019 13:51:07 GMT
See <https://builds.apache.org/job/JMeter%20Ubuntu/837/display/redirect?page=changes>

Changes:

[felix.schumacher] Add more log messages about the delays

[felix.schumacher] Revert behaviour of TimerService#adjustDelay to that of 5.1.1

[felix.schumacher] correct javadoc

------------------------------------------
[...truncated 71.95 KB...]
> Task :src:protocol:ldap:spotbugsTest SKIPPED
> Task :src:protocol:tcp:checkstyleTest
> Task :src:protocol:tcp:spotbugsTest SKIPPED
> Task :src:protocol:jms:checkstyleTest
> Task :src:protocol:jms:spotbugsTest SKIPPED
> Task :src:protocol:jdbc:compileTestGroovy
> Task :src:protocol:jdbc:testClasses
> Task :src:protocol:jdbc:testJar
> Task :src:protocol:jdbc:checkstyleTest
> Task :src:protocol:jdbc:spotbugsTest SKIPPED
> Task :src:protocol:native:test
> Task :src:protocol:native:check
> Task :src:protocol:mongodb:test
> Task :src:protocol:mongodb:check
> Task :src:protocol:ftp:test
> Task :src:protocol:ftp:check
> Task :src:protocol:junit:test
> Task :src:protocol:junit:check
> Task :src:protocol:java:test
> Task :src:protocol:java:check
> Task :src:protocol:tcp:test
> Task :src:protocol:tcp:check
> Task :src:protocol:mail:test
> Task :src:protocol:mail:check
> Task :src:protocol:ldap:test
> Task :src:protocol:ldap:check
> Task :src:components:compileJava
> Task :src:components:compileGroovy NO-SOURCE
> Task :src:components:classes
> Task :src:protocol:jms:test
> Task :src:protocol:jms:check
> Task :src:generator:compileJava
> Task :src:generator:classes
> Task :src:examples:compileJava
> Task :src:examples:classes
> Task :src:generator:jar
> Task :src:generator:checkstyleMain
> Task :src:generator:compileTestJava NO-SOURCE
> Task :src:generator:testClasses UP-TO-DATE
> Task :src:generator:checkstyleTest NO-SOURCE
> Task :src:examples:checkstyleMain
> Task :src:examples:compileTestJava NO-SOURCE
> Task :src:examples:testClasses UP-TO-DATE
> Task :src:examples:checkstyleTest NO-SOURCE
> Task :src:protocol:jdbc:test
> Task :src:protocol:jdbc:check

> Task :src:functions:compileJava
Note: <https://builds.apache.org/job/JMeter%20Ubuntu/ws/src/functions/src/main/java/org/apache/jmeter/functions/StringFromFile.java>
uses or overrides a deprecated API.
Note: Recompile with -Xlint:deprecation for details.

> Task :src:functions:compileGroovy NO-SOURCE
> Task :src:functions:classes
> Task :src:functions:jar
> Task :src:functions:checkstyleMain

> Task :src:protocol:http:compileJava
Note: Some input files use or override a deprecated API.
Note: Recompile with -Xlint:deprecation for details.
Note: <https://builds.apache.org/job/JMeter%20Ubuntu/ws/src/protocol/http/src/main/java/org/apache/jmeter/protocol/http/sampler/HTTPHC4Impl.java>
uses unchecked or unsafe operations.
Note: Recompile with -Xlint:unchecked for details.

> Task :src:protocol:http:compileGroovy NO-SOURCE
> Task :src:protocol:http:classes
> Task :src:dist:compileJava NO-SOURCE
> Task :src:dist:classes UP-TO-DATE
> Task :src:dist-check:compileJava NO-SOURCE
> Task :src:dist:checkstyleMain NO-SOURCE
> Task :src:dist-check:compileGroovy NO-SOURCE
> Task :src:dist-check:classes UP-TO-DATE
> Task :src:dist-check:checkstyleMain NO-SOURCE
> Task :src:dist:jar
> Task :src:protocol:http:jar
> Task :src:core:checkstyleMain
> Task :src:components:checkstyleMain
> Task :src:core:checkstyleTest
> Task :src:core:spotbugsMain SKIPPED
> Task :src:core:spotbugsTest SKIPPED

> Task :src:components:compileTestJava
Note: Some input files use or override a deprecated API.
Note: Recompile with -Xlint:deprecation for details.

> Task :src:components:compileTestGroovy
> Task :src:components:testClasses
> Task :src:components:checkstyleTest
> Task :src:components:spotbugsMain SKIPPED
> Task :src:components:spotbugsTest SKIPPED
> Task :src:protocol:http:checkstyleMain

> Task :src:core:test

org.apache.jorphan.reflect.TestFunctor STANDARD_OUT
    Setting JMeterHome: <https://builds.apache.org/job/JMeter%20Ubuntu/ws/src/core/../../.>
    Initializing Properties: ../.././bin/jmeter.properties
    JMeterVersion=5.2.0-SNAPSHOT 23fa6df
    java.version=1.8.0_191
    java.vm.name=Java HotSpot(TM) 64-Bit Server VM
    java.vendor=Oracle Corporation
    java.home=/usr/local/asfpackages/java/jdk1.8.0_191/jre
    file.encoding=ISO-8859-1
    default encoding=ISO-8859-1
    user.home=/home/jenkins
    user.dir=<https://builds.apache.org/job/JMeter%20Ubuntu/ws/src/core>
    user.language=en
    user.region=null
    user.country=US
    user.variant=
    Locale=en_US
    java.class.version=52.0
    java.awt.headless=true
    os.name=Linux
    os.version=4.15.0-58-generic
    os.arch=amd64

> Task :src:jorphan:check

> Task :src:components:test

org.apache.jmeter.assertions.SizeAssertionTest STANDARD_OUT
    Setting JMeterHome: <https://builds.apache.org/job/JMeter%20Ubuntu/ws/src/components/../../.>
    Initializing Properties: ../.././bin/jmeter.properties
    JMeterVersion=5.2.0-SNAPSHOT 23fa6df
    java.version=1.8.0_191
    java.vm.name=Java HotSpot(TM) 64-Bit Server VM
    java.vendor=Oracle Corporation
    java.home=/usr/local/asfpackages/java/jdk1.8.0_191/jre
    file.encoding=ISO-8859-1
    default encoding=ISO-8859-1
    user.home=/home/jenkins
    user.dir=<https://builds.apache.org/job/JMeter%20Ubuntu/ws/src/components>
    user.language=en
    user.region=null
    user.country=US
    user.variant=
    Locale=en_US
    java.class.version=52.0
    java.awt.headless=true
    os.name=Linux
    os.version=4.15.0-58-generic
    os.arch=amd64

> Task :src:core:test

org.apache.jmeter.testbeans.gui.TestFieldStringEditor > testSetGetAsText STANDARD_OUT
    JMeterUtils.getJMeterVe rsion() = 5.2.0-SNAPSHOT 23fa6df
    JMeterUtils.getJMeterVe rsion() = 5.2.0-SNAPSHOT 23fa6df
    JMeterUtils.getJMeterVe rsion() = 5.2.0-SNAPSHOT 23fa6df

org.apache.jmeter.resources.PackageTest > checkI18n STANDARD_OUT
    Ignoring missing junit_failure_default_code=0001 in org/apache/jmeter/resources/messages_fr.properties
    Ignoring missing aggregate_report_90=90% in org/apache/jmeter/resources/messages_fr.properties
    Ignoring missing junit_error_default_code=9999 in org/apache/jmeter/resources/messages_fr.properties
    Ignoring missing junit_success_default_code=1000 in org/apache/jmeter/resources/messages_fr.properties

org.apache.jmeter.engine.LocalHostTest > testLocalHost STANDARD_ERROR
    java.rmi.server.hostname=null
    asf922.gq1.ygridcore.net/67.195.81.142
    isSiteLocalAddress:false
    isAnyLocalAddress:false
    isLinkLocalAddress:false
    isLoopbackAddress:false
    isMulticastAddress:false
    localhost/127.0.0.1
    isSiteLocalAddress:false
    isAnyLocalAddress:false
    isLinkLocalAddress:false
    isLoopbackAddress:true
    isMulticastAddress:false
    ====================
    asf922.gq1.ygridcore.net/67.195.81.142
    isSiteLocalAddress:false
    isAnyLocalAddress:false
    isLinkLocalAddress:false
    isLoopbackAddress:false
    isMulticastAddress:false

org.apache.jmeter.engine.LocalHostTest > testInterfaces STANDARD_ERROR
    Interfaces: {name:docker0 (docker0) => [/fe80:0:0:0:42:9aff:feaf:298f%docker0/64 [null],
/172.17.0.1/16 [/172.17.255.255]], name:eno1 (eno1) => [/2001:4998:c:c34:92b1:1cff:fe38:93f4%eno1/64
[null], /fe80:0:0:0:92b1:1cff:fe38:93f4%eno1/64 [null], /67.195.81.142/26 [/67.195.81.191]],
name:lo (lo) => [/0:0:0:0:0:0:0:1%lo/128 [null], /127.0.0.1/8 [null]]}
    Choose 172.17.0.1 to talk to external services
    java.rmi.server.hostname=null

org.apache.jmeter.JMeterTest > testSuccessWhenJmxExists STANDARD_OUT
    Created the tree successfully using /tmp/testPlan3695411013571896368.jmx
    Starting the test @ Sat Sep 07 13:50:56 UTC 2019 (1567864256114)

org.apache.jmeter.JMeterTest STANDARD_OUT
    Waiting for possible Shutdown/StopTestNow/HeapDump/ThreadDump message on port 4445

org.apache.jmeter.JMeterTest > testFailureWithMissingPlugin STANDARD_OUT
    Tidying up ...    @ Sat Sep 07 13:50:56 UTC 2019 (1567864256129)
    ... end of run
    Error in NonGUIDriver java.lang.IllegalArgumentException: Problem loading XML from:'/tmp/testPlan4450590464170566850.jmx'.

    Cause:
    CannotResolveClassException: kg.apc.jmeter.samplers.DummySampler

     Detail:com.thoughtworks.xstream.converters.ConversionException: 
    ---- Debugging information ----
    cause-exception     : com.thoughtworks.xstream.converters.ConversionException
    cause-message       : 
    first-jmeter-class  : org.apache.jmeter.save.converters.HashTreeConverter.unmarshal(HashTreeConverter.java:67)
    class               : org.apache.jmeter.save.ScriptWrapper
    required-type       : org.apache.jmeter.save.ScriptWrapper
    converter-type      : org.apache.jmeter.save.ScriptWrapperConverter
    path                : /jmeterTestPlan/hashTree/hashTree/hashTree/kg.apc.jmeter.samplers.DummySampler
    line number         : 16
    version             : not available
    -------------------------------

> Task :src:core:check

> Task :src:components:test

org.apache.jmeter.assertions.CompareAssertionSpec > content 'OK' with compareContent==true,
skip=null, elapsed=110 and compareTime==10 FAILED
    Condition not satisfied:

    assertionResult.isFailure() == isFailure
    |               |           |  |
    myName          true        |  false
                                false
        at org.apache.jmeter.assertions.CompareAssertionSpec.content '#content' with compareContent==#compareContent,
skip=#skip, elapsed=#elapsed and compareTime==#compareTime(CompareAssertionSpec.groovy:58)

393 tests completed, 1 failed, 3 skipped

> Task :src:components:test FAILED
Checksum computation time: 1257, files processed: 162, bytes processed: 104179273

FAILURE: Build failed with an exception.

* What went wrong:
Execution failed for task ':src:components:test'.
> There were failing tests. See the report at: file:///home/jenkins/jenkins-slave/workspace/JMeter%20Ubuntu/src/components/build/reports/tests/test/index.html

* Try:
Run with --stacktrace option to get the stack trace. Run with --info or --debug option to
get more log output. Run with --scan to get full insights.

* Get more help at https://help.gradle.org

Deprecated Gradle features were used in this build, making it incompatible with Gradle 6.0.
Use '--warning-mode all' to show the individual deprecation warnings.
See https://docs.gradle.org/5.5.1/userguide/command_line_interface.html#sec:command_line_warnings

BUILD FAILED in 2m 54s
135 actionable tasks: 135 executed
Build step 'Invoke Gradle script' changed build result to FAILURE
Build step 'Invoke Gradle script' marked build as failure
WARN: Unable to locate 'report-task.txt' in the workspace. Did the SonarScanner succeeded?
[locks-and-latches] Releasing all the locks
[locks-and-latches] All the locks released

Mime
View raw message