jmeter-dev mailing list archives

Site index · List index
Message view « Date » · « Thread »
Top « Date » · « Thread »
From Apache Jenkins Server <jenk...@builds.apache.org>
Subject Build failed in Jenkins: JMeter Ubuntu #854
Date Mon, 30 Sep 2019 10:51:16 GMT
See <https://builds.apache.org/job/JMeter%20Ubuntu/854/display/redirect>

Changes:


------------------------------------------
[...truncated 50.64 KB...]
	at org.gradle.api.internal.tasks.execution.ValidatingTaskExecuter.execute(ValidatingTaskExecuter.java:62)
	at org.gradle.api.internal.tasks.execution.SkipEmptySourceFilesTaskExecuter.execute(SkipEmptySourceFilesTaskExecuter.java:108)
	at org.gradle.api.internal.tasks.execution.ResolveBeforeExecutionOutputsTaskExecuter.execute(ResolveBeforeExecutionOutputsTaskExecuter.java:67)
	at org.gradle.api.internal.tasks.execution.ResolveAfterPreviousExecutionStateTaskExecuter.execute(ResolveAfterPreviousExecutionStateTaskExecuter.java:46)
	at org.gradle.api.internal.tasks.execution.CleanupStaleOutputsExecuter.execute(CleanupStaleOutputsExecuter.java:94)
	at org.gradle.api.internal.tasks.execution.FinalizePropertiesTaskExecuter.execute(FinalizePropertiesTaskExecuter.java:46)
	at org.gradle.api.internal.tasks.execution.ResolveTaskExecutionModeExecuter.execute(ResolveTaskExecutionModeExecuter.java:95)
	at org.gradle.api.internal.tasks.execution.SkipTaskWithNoActionsExecuter.execute(SkipTaskWithNoActionsExecuter.java:57)
	at org.gradle.api.internal.tasks.execution.SkipOnlyIfTaskExecuter.execute(SkipOnlyIfTaskExecuter.java:56)
	at org.gradle.api.internal.tasks.execution.CatchExceptionTaskExecuter.execute(CatchExceptionTaskExecuter.java:36)
	at org.gradle.api.internal.tasks.execution.EventFiringTaskExecuter$1.executeTask(EventFiringTaskExecuter.java:77)
	at org.gradle.api.internal.tasks.execution.EventFiringTaskExecuter$1.call(EventFiringTaskExecuter.java:55)
	at org.gradle.api.internal.tasks.execution.EventFiringTaskExecuter$1.call(EventFiringTaskExecuter.java:52)
	at org.gradle.internal.operations.DefaultBuildOperationExecutor$CallableBuildOperationWorker.execute(DefaultBuildOperationExecutor.java:416)
	at org.gradle.internal.operations.DefaultBuildOperationExecutor$CallableBuildOperationWorker.execute(DefaultBuildOperationExecutor.java:406)
	at org.gradle.internal.operations.DefaultBuildOperationExecutor$1.execute(DefaultBuildOperationExecutor.java:165)
	at org.gradle.internal.operations.DefaultBuildOperationExecutor.execute(DefaultBuildOperationExecutor.java:250)
	at org.gradle.internal.operations.DefaultBuildOperationExecutor.execute(DefaultBuildOperationExecutor.java:158)
	at org.gradle.internal.operations.DefaultBuildOperationExecutor.call(DefaultBuildOperationExecutor.java:102)
	at org.gradle.internal.operations.DelegatingBuildOperationExecutor.call(DelegatingBuildOperationExecutor.java:36)
	at org.gradle.api.internal.tasks.execution.EventFiringTaskExecuter.execute(EventFiringTaskExecuter.java:52)
	at org.gradle.execution.plan.LocalTaskNodeExecutor.execute(LocalTaskNodeExecutor.java:43)
	at org.gradle.execution.taskgraph.DefaultTaskExecutionGraph$InvokeNodeExecutorsAction.execute(DefaultTaskExecutionGraph.java:355)
	at org.gradle.execution.taskgraph.DefaultTaskExecutionGraph$InvokeNodeExecutorsAction.execute(DefaultTaskExecutionGraph.java:343)
	at org.gradle.execution.taskgraph.DefaultTaskExecutionGraph$BuildOperationAwareExecutionAction.execute(DefaultTaskExecutionGraph.java:336)
	at org.gradle.execution.taskgraph.DefaultTaskExecutionGraph$BuildOperationAwareExecutionAction.execute(DefaultTaskExecutionGraph.java:322)
	at org.gradle.execution.plan.DefaultPlanExecutor$ExecutorWorker$1.execute(DefaultPlanExecutor.java:134)
	at org.gradle.execution.plan.DefaultPlanExecutor$ExecutorWorker$1.execute(DefaultPlanExecutor.java:129)
	at org.gradle.execution.plan.DefaultPlanExecutor$ExecutorWorker.execute(DefaultPlanExecutor.java:202)
	at org.gradle.execution.plan.DefaultPlanExecutor$ExecutorWorker.executeNextNode(DefaultPlanExecutor.java:193)
	at org.gradle.execution.plan.DefaultPlanExecutor$ExecutorWorker.run(DefaultPlanExecutor.java:129)
	at org.gradle.internal.concurrent.ExecutorPolicy$CatchAndRecordFailures.onExecute(ExecutorPolicy.java:64)
	at org.gradle.internal.concurrent.ManagedExecutorImpl$1.run(ManagedExecutorImpl.java:48)
	at java.util.concurrent.ThreadPoolExecutor.runWorker(ThreadPoolExecutor.java:1149)
	at java.util.concurrent.ThreadPoolExecutor$Worker.run(ThreadPoolExecutor.java:624)
	at org.gradle.internal.concurrent.ThreadFactoryImpl$ManagedThreadRunnable.run(ThreadFactoryImpl.java:56)
	at java.lang.Thread.run(Thread.java:748)

> Task :src:config:spotlessJava

> Task :src:licenses:spotlessJava
You probably need to add a repository containing the '[com.google.googlejavaformat:google-java-format:1.7]'
artifact in the 'build.gradle' of your root project.
E.g.: 'buildscript { repositories { mavenCentral() }}'
Note that included buildscripts (using 'apply from') do not share their buildscript repositories
with the underlying project.
You have to specify the missing repository explicitly in the buildscript of the root project.

org.gradle.api.InvalidUserDataException: You must specify a base url or at least one artifact
pattern for an Ivy repository.
	at org.gradle.api.internal.artifacts.repositories.DefaultIvyArtifactRepository.validate(DefaultIvyArtifactRepository.java:212)
	at org.gradle.api.internal.artifacts.repositories.DefaultIvyArtifactRepository.createDescriptor(DefaultIvyArtifactRepository.java:162)
	at org.gradle.api.internal.artifacts.repositories.AbstractResolutionAwareArtifactRepository.getDescriptor(AbstractResolutionAwareArtifactRepository.java:32)
	at org.gradle.api.internal.artifacts.configurations.ResolveConfigurationResolutionBuildOperationDetails$RepositoryImpl$1.transform(ResolveConfigurationResolutionBuildOperationDetails.java:168)
	at org.gradle.api.internal.artifacts.configurations.ResolveConfigurationResolutionBuildOperationDetails$RepositoryImpl$1.transform(ResolveConfigurationResolutionBuildOperationDetails.java:165)
	at org.gradle.util.CollectionUtils.collect(CollectionUtils.java:207)
	at org.gradle.util.CollectionUtils.collect(CollectionUtils.java:199)
	at org.gradle.api.internal.artifacts.configurations.ResolveConfigurationResolutionBuildOperationDetails$RepositoryImpl.transform(ResolveConfigurationResolutionBuildOperationDetails.java:165)
	at org.gradle.api.internal.artifacts.configurations.ResolveConfigurationResolutionBuildOperationDetails$RepositoryImpl.access$000(ResolveConfigurationResolutionBuildOperationDetails.java:160)
	at org.gradle.api.internal.artifacts.configurations.ResolveConfigurationResolutionBuildOperationDetails.<init>(ResolveConfigurationResolutionBuildOperationDetails.java:64)
	at org.gradle.api.internal.artifacts.configurations.DefaultConfiguration$7.description(DefaultConfiguration.java:656)
	at org.gradle.internal.operations.DefaultBuildOperationExecutor.execute(DefaultBuildOperationExecutor.java:157)
	at org.gradle.internal.operations.DefaultBuildOperationExecutor.run(DefaultBuildOperationExecutor.java:92)
	at org.gradle.internal.operations.DelegatingBuildOperationExecutor.run(DelegatingBuildOperationExecutor.java:31)
	at org.gradle.api.internal.artifacts.configurations.DefaultConfiguration.resolveGraphIfRequired(DefaultConfiguration.java:603)
	at org.gradle.api.internal.artifacts.configurations.DefaultConfiguration.access$600(DefaultConfiguration.java:139)
	at org.gradle.api.internal.artifacts.configurations.DefaultConfiguration$6.run(DefaultConfiguration.java:583)
	at org.gradle.api.internal.project.DefaultProjectStateRegistry$SafeExclusiveLockImpl.withLock(DefaultProjectStateRegistry.java:245)
	at org.gradle.api.internal.artifacts.configurations.DefaultConfiguration.resolveExclusively(DefaultConfiguration.java:579)
	at org.gradle.api.internal.artifacts.configurations.DefaultConfiguration.access$500(DefaultConfiguration.java:139)
	at org.gradle.api.internal.artifacts.configurations.DefaultConfiguration$5.run(DefaultConfiguration.java:570)
	at org.gradle.internal.Factories$1.create(Factories.java:26)
	at org.gradle.api.internal.project.DefaultProjectStateRegistry.withLenientState(DefaultProjectStateRegistry.java:133)
	at org.gradle.api.internal.project.DefaultProjectStateRegistry.withLenientState(DefaultProjectStateRegistry.java:125)
	at org.gradle.api.internal.artifacts.transform.DomainObjectProjectStateHandler.withLenientState(DomainObjectProjectStateHandler.java:59)
	at org.gradle.api.internal.artifacts.configurations.DefaultConfiguration.resolveToStateOrLater(DefaultConfiguration.java:567)
	at org.gradle.api.internal.artifacts.configurations.DefaultConfiguration.getResolvedConfiguration(DefaultConfiguration.java:556)
	at org.gradle.api.internal.artifacts.configurations.DefaultConfiguration_Decorated.getResolvedConfiguration(Unknown
Source)
	at com.github.vlsi.gradle.checksum.ChecksumDependency.verifyDependencies(ChecksumDependency.kt:206)
	at com.github.vlsi.gradle.checksum.ChecksumDependency.access$verifyDependencies(ChecksumDependency.kt:58)
	at com.github.vlsi.gradle.checksum.ChecksumDependency$resolutionListener$1$beforeResolve$4$1.invoke(ChecksumDependency.kt:98)
	at com.github.vlsi.gradle.checksum.ChecksumDependency$resolutionListener$1$beforeResolve$4$1.invoke(ChecksumDependency.kt:88)
	at com.github.vlsi.gradle.checksum.Stopwatch.invoke(Stopwatch.kt:36)
	at com.github.vlsi.gradle.checksum.Stopwatch.invoke$default(Stopwatch.kt:31)
	at com.github.vlsi.gradle.checksum.ChecksumDependency$resolutionListener$1$beforeResolve$4.execute(ChecksumDependency.kt:97)
	at com.github.vlsi.gradle.checksum.ChecksumDependency$resolutionListener$1$beforeResolve$4.execute(ChecksumDependency.kt:88)
	at org.gradle.internal.event.BroadcastDispatch$ActionInvocationHandler.dispatch(BroadcastDispatch.java:92)
	at org.gradle.internal.event.BroadcastDispatch$ActionInvocationHandler.dispatch(BroadcastDispatch.java:80)
	at org.gradle.internal.event.AbstractBroadcastDispatch.dispatch(AbstractBroadcastDispatch.java:42)
	at org.gradle.internal.event.BroadcastDispatch$SingletonDispatch.dispatch(BroadcastDispatch.java:231)
	at org.gradle.internal.event.BroadcastDispatch$SingletonDispatch.dispatch(BroadcastDispatch.java:150)
	at org.gradle.internal.event.AbstractBroadcastDispatch.dispatch(AbstractBroadcastDispatch.java:58)
	at org.gradle.internal.event.BroadcastDispatch$CompositeDispatch.dispatch(BroadcastDispatch.java:325)
	at org.gradle.internal.event.BroadcastDispatch$CompositeDispatch.dispatch(BroadcastDispatch.java:235)
	at org.gradle.internal.event.ListenerBroadcast.dispatch(ListenerBroadcast.java:141)
	at org.gradle.internal.event.ListenerBroadcast.dispatch(ListenerBroadcast.java:37)
	at org.gradle.internal.dispatch.ProxyDispatchAdapter$DispatchingInvocationHandler.invoke(ProxyDispatchAdapter.java:94)
	at com.sun.proxy.$Proxy41.afterResolve(Unknown Source)
	at org.gradle.api.internal.artifacts.configurations.DefaultConfiguration$7.run(DefaultConfiguration.java:621)
	at org.gradle.internal.operations.DefaultBuildOperationExecutor$RunnableBuildOperationWorker.execute(DefaultBuildOperationExecutor.java:402)
	at org.gradle.internal.operations.DefaultBuildOperationExecutor$RunnableBuildOperationWorker.execute(DefaultBuildOperationExecutor.java:394)
	at org.gradle.internal.operations.DefaultBuildOperationExecutor$1.execute(DefaultBuildOperationExecutor.java:165)
	at org.gradle.internal.operations.DefaultBuildOperationExecutor.execute(DefaultBuildOperationExecutor.java:250)
	at org.gradle.internal.operations.DefaultBuildOperationExecutor.execute(DefaultBuildOperationExecutor.java:158)
	at org.gradle.internal.operations.DefaultBuildOperationExecutor.run(DefaultBuildOperationExecutor.java:92)
	at org.gradle.internal.operations.DelegatingBuildOperationExecutor.run(DelegatingBuildOperationExecutor.java:31)
	at org.gradle.api.internal.artifacts.configurations.DefaultConfiguration.resolveGraphIfRequired(DefaultConfiguration.java:603)
	at org.gradle.api.internal.artifacts.configurations.DefaultConfiguration.access$600(DefaultConfiguration.java:139)
	at org.gradle.api.internal.artifacts.configurations.DefaultConfiguration$6.run(DefaultConfiguration.java:583)
	at org.gradle.api.internal.project.DefaultProjectStateRegistry$SafeExclusiveLockImpl.withLock(DefaultProjectStateRegistry.java:245)
	at org.gradle.api.internal.artifacts.configurations.DefaultConfiguration.resolveExclusively(DefaultConfiguration.java:579)
	at org.gradle.api.internal.artifacts.configurations.DefaultConfiguration.resolveToStateOrLater(DefaultConfiguration.java:574)
	at org.gradle.api.internal.artifacts.configurations.DefaultConfiguration.access$2300(DefaultConfiguration.java:139)
	at org.gradle.api.internal.artifacts.configurations.DefaultConfiguration$ConfigurationFileCollection.getSelectedArtifacts(DefaultConfiguration.java:1241)
	at org.gradle.api.internal.artifacts.configurations.DefaultConfiguration$ConfigurationFileCollection.getFiles(DefaultConfiguration.java:1230)
	at org.gradle.api.internal.artifacts.configurations.DefaultConfiguration.getFiles(DefaultConfiguration.java:491)
	at org.gradle.api.internal.artifacts.configurations.DefaultConfiguration_Decorated.getFiles(Unknown
Source)
	at org.gradle.api.internal.artifacts.configurations.DefaultConfiguration.resolve(DefaultConfiguration.java:481)
	at com.diffplug.gradle.spotless.GradleProvisioner.lambda$fromProject$1(GradleProvisioner.java:50)
	at com.diffplug.spotless.JarState.provisionWithTransitives(JarState.java:87)
	at com.diffplug.spotless.JarState.from(JarState.java:76)
	at com.diffplug.spotless.JarState.from(JarState.java:71)
	at com.diffplug.spotless.java.GoogleJavaFormatStep$State.<init>(GoogleJavaFormatStep.java:99)
	at com.diffplug.spotless.java.GoogleJavaFormatStep$State.<init>(GoogleJavaFormatStep.java:95)
	at com.diffplug.spotless.java.RemoveUnusedImportsStep.lambda$create$0(RemoveUnusedImportsStep.java:33)
	at com.diffplug.spotless.FormatterStepImpl.calculateState(FormatterStepImpl.java:56)
	at com.diffplug.spotless.LazyForwardingEquality.state(LazyForwardingEquality.java:56)
	at com.diffplug.spotless.LazyForwardingEquality.writeObject(LazyForwardingEquality.java:68)
	at sun.reflect.NativeMethodAccessorImpl.invoke0(Native Method)
	at sun.reflect.NativeMethodAccessorImpl.invoke(NativeMethodAccessorImpl.java:62)
	at sun.reflect.DelegatingMethodAccessorImpl.invoke(DelegatingMethodAccessorImpl.java:43)
	at java.lang.reflect.Method.invoke(Method.java:498)
	at java.io.ObjectStreamClass.invokeWriteObject(ObjectStreamClass.java:1140)
	at java.io.ObjectOutputStream.writeSerialData(ObjectOutputStream.java:1496)
	at java.io.ObjectOutputStream.writeOrdinaryObject(ObjectOutputStream.java:1432)
	at java.io.ObjectOutputStream.writeObject0(ObjectOutputStream.java:1178)
	at java.io.ObjectOutputStream.writeObject(ObjectOutputStream.java:348)
	at org.gradle.internal.snapshot.impl.DefaultValueSnapshotter.serialize(DefaultValueSnapshotter.java:171)
	at org.gradle.internal.snapshot.impl.DefaultValueSnapshotter.processValue(DefaultValueSnapshotter.java:163)
	at org.gradle.internal.snapshot.impl.DefaultValueSnapshotter.processValue(DefaultValueSnapshotter.java:88)
	at org.gradle.internal.snapshot.impl.DefaultValueSnapshotter.snapshot(DefaultValueSnapshotter.java:53)
	at org.gradle.internal.execution.steps.CaptureStateBeforeExecutionStep.lambda$fingerprintInputProperties$2(CaptureStateBeforeExecutionStep.java:135)
	at org.gradle.api.internal.tasks.execution.ExecuteActionsTaskExecuter$TaskExecution.visitInputProperties(ExecuteActionsTaskExecuter.java:266)
	at org.gradle.internal.execution.steps.CaptureStateBeforeExecutionStep.fingerprintInputProperties(CaptureStateBeforeExecutionStep.java:131)
	at org.gradle.internal.execution.steps.CaptureStateBeforeExecutionStep.createExecutionState(CaptureStateBeforeExecutionStep.java:113)
	at org.gradle.internal.execution.steps.CaptureStateBeforeExecutionStep.execute(CaptureStateBeforeExecutionStep.java:67)
	at org.gradle.internal.execution.steps.CaptureStateBeforeExecutionStep.execute(CaptureStateBeforeExecutionStep.java:47)
	at org.gradle.internal.execution.impl.DefaultWorkExecutor.execute(DefaultWorkExecutor.java:33)
	at org.gradle.api.internal.tasks.execution.ExecuteActionsTaskExecuter.execute(ExecuteActionsTaskExecuter.java:140)
	at org.gradle.api.internal.tasks.execution.ValidatingTaskExecuter.execute(ValidatingTaskExecuter.java:62)
	at org.gradle.api.internal.tasks.execution.SkipEmptySourceFilesTaskExecuter.execute(SkipEmptySourceFilesTaskExecuter.java:108)
	at org.gradle.api.internal.tasks.execution.ResolveBeforeExecutionOutputsTaskExecuter.execute(ResolveBeforeExecutionOutputsTaskExecuter.java:67)
	at org.gradle.api.internal.tasks.execution.ResolveAfterPreviousExecutionStateTaskExecuter.execute(ResolveAfterPreviousExecutionStateTaskExecuter.java:46)
	at org.gradle.api.internal.tasks.execution.CleanupStaleOutputsExecuter.execute(CleanupStaleOutputsExecuter.java:94)
	at org.gradle.api.internal.tasks.execution.FinalizePropertiesTaskExecuter.execute(FinalizePropertiesTaskExecuter.java:46)
	at org.gradle.api.internal.tasks.execution.ResolveTaskExecutionModeExecuter.execute(ResolveTaskExecutionModeExecuter.java:95)
	at org.gradle.api.internal.tasks.execution.SkipTaskWithNoActionsExecuter.execute(SkipTaskWithNoActionsExecuter.java:57)
	at org.gradle.api.internal.tasks.execution.SkipOnlyIfTaskExecuter.execute(SkipOnlyIfTaskExecuter.java:56)
	at org.gradle.api.internal.tasks.execution.CatchExceptionTaskExecuter.execute(CatchExceptionTaskExecuter.java:36)
	at org.gradle.api.internal.tasks.execution.EventFiringTaskExecuter$1.executeTask(EventFiringTaskExecuter.java:77)
	at org.gradle.api.internal.tasks.execution.EventFiringTaskExecuter$1.call(EventFiringTaskExecuter.java:55)
	at org.gradle.api.internal.tasks.execution.EventFiringTaskExecuter$1.call(EventFiringTaskExecuter.java:52)
	at org.gradle.internal.operations.DefaultBuildOperationExecutor$CallableBuildOperationWorker.execute(DefaultBuildOperationExecutor.java:416)
	at org.gradle.internal.operations.DefaultBuildOperationExecutor$CallableBuildOperationWorker.execute(DefaultBuildOperationExecutor.java:406)
	at org.gradle.internal.operations.DefaultBuildOperationExecutor$1.execute(DefaultBuildOperationExecutor.java:165)
	at org.gradle.internal.operations.DefaultBuildOperationExecutor.execute(DefaultBuildOperationExecutor.java:250)
	at org.gradle.internal.operations.DefaultBuildOperationExecutor.execute(DefaultBuildOperationExecutor.java:158)
	at org.gradle.internal.operations.DefaultBuildOperationExecutor.call(DefaultBuildOperationExecutor.java:102)
	at org.gradle.internal.operations.DelegatingBuildOperationExecutor.call(DelegatingBuildOperationExecutor.java:36)
	at org.gradle.api.internal.tasks.execution.EventFiringTaskExecuter.execute(EventFiringTaskExecuter.java:52)
	at org.gradle.execution.plan.LocalTaskNodeExecutor.execute(LocalTaskNodeExecutor.java:43)
	at org.gradle.execution.taskgraph.DefaultTaskExecutionGraph$InvokeNodeExecutorsAction.execute(DefaultTaskExecutionGraph.java:355)
	at org.gradle.execution.taskgraph.DefaultTaskExecutionGraph$InvokeNodeExecutorsAction.execute(DefaultTaskExecutionGraph.java:343)
	at org.gradle.execution.taskgraph.DefaultTaskExecutionGraph$BuildOperationAwareExecutionAction.execute(DefaultTaskExecutionGraph.java:336)
	at org.gradle.execution.taskgraph.DefaultTaskExecutionGraph$BuildOperationAwareExecutionAction.execute(DefaultTaskExecutionGraph.java:322)
	at org.gradle.execution.plan.DefaultPlanExecutor$ExecutorWorker$1.execute(DefaultPlanExecutor.java:134)
	at org.gradle.execution.plan.DefaultPlanExecutor$ExecutorWorker$1.execute(DefaultPlanExecutor.java:129)
	at org.gradle.execution.plan.DefaultPlanExecutor$ExecutorWorker.execute(DefaultPlanExecutor.java:202)
	at org.gradle.execution.plan.DefaultPlanExecutor$ExecutorWorker.executeNextNode(DefaultPlanExecutor.java:193)
	at org.gradle.execution.plan.DefaultPlanExecutor$ExecutorWorker.run(DefaultPlanExecutor.java:129)
	at org.gradle.internal.concurrent.ExecutorPolicy$CatchAndRecordFailures.onExecute(ExecutorPolicy.java:64)
	at org.gradle.internal.concurrent.ManagedExecutorImpl$1.run(ManagedExecutorImpl.java:48)
	at java.util.concurrent.ThreadPoolExecutor.runWorker(ThreadPoolExecutor.java:1149)
	at java.util.concurrent.ThreadPoolExecutor$Worker.run(ThreadPoolExecutor.java:624)
	at org.gradle.internal.concurrent.ThreadFactoryImpl$ManagedThreadRunnable.run(ThreadFactoryImpl.java:56)
	at java.lang.Thread.run(Thread.java:748)

> Task :src:dist:spotlessJava
> Task :src:protocol:spotlessJava
> Task :src:licenses:spotlessJava FAILED
> Task :src:generator:spotlessJava
> Task :src:examples:spotlessJava
> Task :src:protocol:junit-sample:spotlessJava
> Task :src:protocol:ftp:spotlessJava
> Task :src:protocol:junit:spotlessJava
> Task :src:dist-check:spotlessJava
> Task :src:protocol:jdbc:spotlessJava
> Task :src:protocol:jms:spotlessJava
> Task :src:protocol:http:processTestResources
> Task :src:protocol:java:spotlessJava
> Task :src:functions:spotlessJava
> Task :src:components:spotlessJava
> Task :src:core:spotlessJava
> Task :src:bshclient:checkstyleMain
> Task :src:testkit:checkstyleMain
> Task :src:launcher:checkstyleMain
SocketTimeoutException: Downloading key f6bc09712c8df6ec for net.minidev:json-smart:2.3@jar.asc
(attempt 1 of 40, 2001:4c80:40:628:5c70:d1ff:fe44:1424, hkp://pool.sks-keyservers.net)
SocketTimeoutException: Downloading key 8ea48d105232855d for com.github.jknack:handlebars-helpers:4.1.2@jar.asc
(attempt 1 of 40, 78.46.239.68, hkp://pool.sks-keyservers.net)
SocketTimeoutException: Downloading key bede11eaf1164480 for org.hamcrest:hamcrest-core:2.1@jar.asc
(attempt 1 of 40, 2a01:4f8:1c17:5140:0:0:0:1, hkp://pool.sks-keyservers.net)
SocketTimeoutException: Downloading key bede11eaf1164480 for org.hamcrest:hamcrest-core:2.1@jar.asc
(attempt 2 of 40, 140.211.169.207, https://keys.fedoraproject.org)
> Task :rat
> Task :src:testkit-wiremock:compileJava
checksum-dependency elapsed time: 76635ms, configurations processed: 132
    SHA-512 computation time: 5282ms (goes in parallel, it might exceed wall-clock time),
files processed: 17, processed: 5MiB, skipped: 187MiB
    PGP key resolution time: 8933ms (wall-clock), resolution requests: 35, download time:
22489ms (goes in parallel, it might exceed wall-clock time), keys downloaded: 51
        PGP signature verification time: 22989ms (goes in parallel, it might exceed wall-clock
time), files processed: 169, processed: 150MiB, skipped: 25MiB

FAILURE: Build completed with 2 failures.

1: Task failed with an exception.
-----------
* What went wrong:
Execution failed for task ':src:release:spotlessJava'.
> Unable to store input properties for task ':src:release:spotlessJava'. Property 'steps'
with value '[com.diffplug.spotless.FilterByFileFormatterStep@dc2ced46, com.diffplug.spotless.FormatterStepImpl$Standard@d06259d4,
com.diffplug.spotless.FormatterStepImpl$Standard@c5ca0bb5, com.diffplug.spotless.FormatterStepImpl$Standard@91f0afcc,
com.diffplug.spotless.FormatterStepImpl$Standard@c61541d0, com.diffplug.spotless.FormatterStepImpl$Standard@6dd40f0a]'
cannot be serialized.

* Try:
Run with --stacktrace option to get the stack trace. Run with --info or --debug option to
get more log output. Run with --scan to get full insights.
==============================================================================

2: Task failed with an exception.
-----------
* What went wrong:
Execution failed for task ':src:licenses:spotlessJava'.
> Unable to store input properties for task ':src:licenses:spotlessJava'. Property 'steps'
with value '[com.diffplug.spotless.FilterByFileFormatterStep@dc2ced46, com.diffplug.spotless.FormatterStepImpl$Standard@d06259d4,
com.diffplug.spotless.FormatterStepImpl$Standard@c5ca0bb5, com.diffplug.spotless.FormatterStepImpl$Standard@91f0afcc,
com.diffplug.spotless.FormatterStepImpl$Standard@c61541d0, com.diffplug.spotless.FormatterStepImpl$Standard@6dd40f0a]'
cannot be serialized.

* Try:
Run with --stacktrace option to get the stack trace. Run with --info or --debug option to
get more log output. Run with --scan to get full insights.
==============================================================================

* Get more help at https://help.gradle.org

Deprecated Gradle features were used in this build, making it incompatible with Gradle 6.0.
Use '--warning-mode all' to show the individual deprecation warnings.
See https://docs.gradle.org/5.6.2/userguide/command_line_interface.html#sec:command_line_warnings

BUILD FAILED in 2m 52s
51 actionable tasks: 51 executed
Build step 'Invoke Gradle script' changed build result to FAILURE
Build step 'Invoke Gradle script' marked build as failure
WARN: Unable to locate 'report-task.txt' in the workspace. Did the SonarScanner succeeded?
[locks-and-latches] Releasing all the locks
[locks-and-latches] All the locks released

Mime
View raw message