jmeter-dev mailing list archives

Site index · List index
Message view « Date » · « Thread »
Top « Date » · « Thread »
From Apache Jenkins Server <jenk...@builds.apache.org>
Subject Build failed in Jenkins: JMeter Ubuntu #834
Date Tue, 03 Sep 2019 14:50:37 GMT
See <https://builds.apache.org/job/JMeter%20Ubuntu/834/display/redirect?page=changes>

Changes:

[pmouawad] Add support for InfluxDB 2 (#487)

[pmouawad] BackendListener: InfluxDBBackendListenerClient Add support for InfluxDB

------------------------------------------
[...truncated 93.59 KB...]
    isSiteLocalAddress:false
    isAnyLocalAddress:false
    isLinkLocalAddress:false
    isLoopbackAddress:false
    isMulticastAddress:false

org.apache.jmeter.engine.LocalHostTest > testInterfaces STANDARD_ERROR
    Interfaces: {name:docker0 (docker0) => [/fe80:0:0:0:42:c0ff:fe5b:d4d2%docker0/64 [null],
/172.17.0.1/16 [/0.0.0.0]], name:enp5s0f0 (enp5s0f0) => [/fe80:0:0:0:28c:faff:fe5b:4048%enp5s0f0/64
[null], /67.195.81.170/26 [/67.195.81.191]], name:lo (lo) => [/0:0:0:0:0:0:0:1%lo/128 [null],
/127.0.0.1/8 [null]]}
    Choose 172.17.0.1 to talk to external services
    java.rmi.server.hostname=null

org.apache.jmeter.testbeans.gui.TestFieldStringEditor > testSetGetAsText STANDARD_OUT
    JMeterUtils.getJMeterVe rsion() = 5.2.0-SNAPSHOT 06fae10
    The JVM should have exited but did not.
    The following non-daemon threads are still running (DestroyJavaVM is OK):
    Thread[AWT-Shutdown,5,system], stackTrace:java.lang.Object#wait
    sun.awt.AWTAutoShutdown#run at line:314
    java.lang.Thread#run at line:748

    Thread[main,5,main], stackTrace:sun.misc.Unsafe#park
    java.util.concurrent.locks.LockSupport#park at line:175
    java.util.concurrent.locks.AbstractQueuedSynchronizer#parkAndCheckInterrupt at line:836
    java.util.concurrent.locks.AbstractQueuedSynchronizer#doAcquireSharedInterruptibly at
line:997
    java.util.concurrent.locks.AbstractQueuedSynchronizer#acquireSharedInterruptibly at line:1304
    java.util.concurrent.CountDownLatch#await at line:231
    org.gradle.api.internal.tasks.testing.worker.TestWorker#execute at line:72
    org.gradle.api.internal.tasks.testing.worker.TestWorker#execute at line:46
    org.gradle.process.internal.worker.child.ActionExecutionWorker#execute at line:86
    org.gradle.process.internal.worker.child.ActionExecutionWorker#execute at line:34
    org.gradle.process.internal.worker.child.SystemApplicationClassLoaderWorker#call at line:132
    org.gradle.process.internal.worker.child.SystemApplicationClassLoaderWorker#call at line:68
    worker.org.gradle.process.internal.worker.GradleWorkerMain#run at line:68
    worker.org.gradle.process.internal.worker.GradleWorkerMain#main at line:73

    Thread[/0:0:0:0:0:0:0:1:50386 to /0:0:0:0:0:0:0:1:36071 workers Thread 2,5,main], stackTrace:java.util.concurrent.locks.ReentrantLock$Sync#nonfairTryAcquire
at line:130
    java.util.concurrent.locks.ReentrantLock$NonfairSync#tryAcquire at line:213
    java.util.concurrent.locks.AbstractQueuedSynchronizer#acquireQueued at line:863
    java.util.concurrent.locks.AbstractQueuedSynchronizer$ConditionObject#await at line:2043
    org.gradle.internal.remote.internal.hub.queue.EndPointQueue#take at line:48
    org.gradle.internal.remote.internal.hub.MessageHub$ConnectionDispatch#run at line:314
    org.gradle.internal.concurrent.ExecutorPolicy$CatchAndRecordFailures#onExecute at line:63
    org.gradle.internal.concurrent.ManagedExecutorImpl$1#run at line:46
    java.util.concurrent.ThreadPoolExecutor#runWorker at line:1149
    java.util.concurrent.ThreadPoolExecutor$Worker#run at line:624
    org.gradle.internal.concurrent.ThreadFactoryImpl$ManagedThreadRunnable#run at line:55
    java.lang.Thread#run at line:748

    Thread[/0:0:0:0:0:0:0:1:50386 to /0:0:0:0:0:0:0:1:36071 workers Thread 3,5,main], stackTrace:sun.nio.ch.EPollArrayWrapper#epollWait
    sun.nio.ch.EPollArrayWrapper#poll at line:269
    sun.nio.ch.EPollSelectorImpl#doSelect at line:93
    sun.nio.ch.SelectorImpl#lockAndDoSelect at line:86
    sun.nio.ch.SelectorImpl#select at line:97
    sun.nio.ch.SelectorImpl#select at line:101
    org.gradle.internal.remote.internal.inet.SocketConnection$SocketInputStream#read at line:179
    com.esotericsoftware.kryo.io.Input#fill at line:146
    com.esotericsoftware.kryo.io.Input#require at line:178
    com.esotericsoftware.kryo.io.Input#readByte at line:295
    org.gradle.internal.serialize.kryo.KryoBackedDecoder#readByte at line:80
    org.gradle.internal.remote.internal.hub.InterHubMessageSerializer$MessageReader#read at
line:63
    org.gradle.internal.remote.internal.hub.InterHubMessageSerializer$MessageReader#read at
line:52
    org.gradle.internal.remote.internal.inet.SocketConnection#receive at line:80
    org.gradle.internal.remote.internal.hub.MessageHub$ConnectionReceive#run at line:263
    org.gradle.internal.concurrent.ExecutorPolicy$CatchAndRecordFailures#onExecute at line:63
    org.gradle.internal.concurrent.ManagedExecutorImpl$1#run at line:46
    java.util.concurrent.ThreadPoolExecutor#runWorker at line:1149
    java.util.concurrent.ThreadPoolExecutor$Worker#run at line:624
    org.gradle.internal.concurrent.ThreadFactoryImpl$ManagedThreadRunnable#run at line:55
    java.lang.Thread#run at line:748

    Thread[Test worker,5,main], stackTrace:sun.nio.ch.FileDispatcherImpl#read0
    sun.nio.ch.FileDispatcherImpl#read at line:46
    sun.nio.ch.IOUtil#readIntoNativeBuffer at line:223
    sun.nio.ch.IOUtil#read at line:197
    sun.nio.ch.FileChannelImpl#read at line:159
    sun.font.TrueTypeFont#readBlock at line:472
    sun.font.TrueTypeFont#init at line:518
    sun.font.TrueTypeFont#<init> at line:198
    sun.font.TrueTypeFont#<init> at line:178
    sun.font.SunFontManager#registerFontFile at line:1147
    sun.font.SunFontManager#initialiseDeferredFont at line:1086
    sun.font.CompositeFont#doDeferredInitialisation at line:287
    sun.font.CompositeFont#getSlotFont at line:376
    sun.font.CompositeStrike#getStrikeForSlot at line:82
    sun.font.CompositeStrike#getFontMetrics at line:97
    sun.font.FontDesignMetrics#initMatrixAndMetrics at line:359
    sun.font.FontDesignMetrics#<init> at line:350
    sun.font.FontDesignMetrics#getMetrics at line:302
    sun.swing.SwingUtilities2#getFontMetrics at line:1113
    javax.swing.JComponent#getFontMetrics at line:1626
    javax.swing.text.PlainView#calculateLongestLine at line:639
    javax.swing.text.PlainView#updateMetrics at line:209
    javax.swing.text.PlainView#updateDamage at line:527
    javax.swing.text.PlainView#insertUpdate at line:451
    javax.swing.text.FieldView#insertUpdate at line:293
    javax.swing.plaf.basic.BasicTextUI$RootView#insertUpdate at line:1610
    javax.swing.plaf.basic.BasicTextUI$UpdateHandler#insertUpdate at line:1869
    javax.swing.text.AbstractDocument#fireInsertUpdate at line:201
    javax.swing.text.AbstractDocument#handleInsertString at line:748
    javax.swing.text.AbstractDocument#insertString at line:707
    javax.swing.text.PlainDocument#insertString at line:130
    javax.swing.text.AbstractDocument#replace at line:669
    javax.swing.text.JTextComponent#setText at line:1669
    javax.swing.plaf.metal.MetalComboBoxEditor$1#setText at line:61
    javax.swing.plaf.basic.BasicComboBoxEditor#setItem at line:87
    javax.swing.JComboBox#configureEditor at line:1404
    javax.swing.plaf.basic.BasicComboBoxUI#configureEditor at line:787
    javax.swing.plaf.metal.MetalComboBoxUI#configureEditor at line:312
    javax.swing.plaf.basic.BasicComboBoxUI#addEditor at line:736
    javax.swing.plaf.basic.BasicComboBoxUI$Handler#propertyChange at line:1716
    javax.swing.plaf.basic.BasicComboBoxUI$PropertyChangeHandler#propertyChange at line:635
    javax.swing.plaf.metal.MetalComboBoxUI$MetalPropertyChangeListener#propertyChange at line:207
    java.beans.PropertyChangeSupport#fire at line:335
    java.beans.PropertyChangeSupport#firePropertyChange at line:327
    java.beans.PropertyChangeSupport#firePropertyChange at line:263
    java.beans.PropertyChangeSupport#firePropertyChange at line:303
    java.awt.Component#firePropertyChange at line:8454
    javax.swing.JComponent#firePropertyChange at line:4491
    javax.swing.JComboBox#setEditable at line:401
    org.apache.jmeter.testbeans.gui.ComboStringEditor#setAsText at line:202
    org.apache.jmeter.testbeans.gui.TestFieldStringEditor#testSetGetAsText at line:33
    org.apache.jmeter.testbeans.gui.TestFieldStringEditor#testSetGetAsText at line:52
    sun.reflect.NativeMethodAccessorImpl#invoke0
    sun.reflect.NativeMethodAccessorImpl#invoke at line:62
    sun.reflect.DelegatingMethodAccessorImpl#invoke at line:43
    java.lang.reflect.Method#invoke at line:498
    org.junit.runners.model.FrameworkMethod$1#runReflectiveCall at line:50
    org.junit.internal.runners.model.ReflectiveCallable#run at line:12
    org.junit.runners.model.FrameworkMethod#invokeExplosively at line:47
    org.junit.internal.runners.statements.InvokeMethod#evaluate at line:17
    org.junit.runners.ParentRunner#runLeaf at line:325
    org.junit.runners.BlockJUnit4ClassRunner#runChild at line:78
    org.junit.runners.BlockJUnit4ClassRunner#runChild at line:57
    org.junit.runners.ParentRunner$3#run at line:290
    org.junit.runners.ParentRunner$1#schedule at line:71
    org.junit.runners.ParentRunner#runChildren at line:288
    org.junit.runners.ParentRunner#access$000 at line:58
    org.junit.runners.ParentRunner$2#evaluate at line:268
    org.junit.runners.ParentRunner#run at line:363
    org.gradle.api.internal.tasks.testing.junit.JUnitTestClassExecutor#runTestClass at line:110
    org.gradle.api.internal.tasks.testing.junit.JUnitTestClassExecutor#execute at line:58
    org.gradle.api.internal.tasks.testing.junit.JUnitTestClassExecutor#execute at line:38
    org.gradle.api.internal.tasks.testing.junit.AbstractJUnitTestClassProcessor#processTestClass
at line:62
    org.gradle.api.internal.tasks.testing.SuiteTestClassProcessor#processTestClass at line:51
    sun.reflect.GeneratedMethodAccessor7#invoke
    sun.reflect.DelegatingMethodAccessorImpl#invoke at line:43
    java.lang.reflect.Method#invoke at line:498
    org.gradle.internal.dispatch.ReflectionDispatch#dispatch at line:35
    org.gradle.internal.dispatch.ReflectionDispatch#dispatch at line:24
    org.gradle.internal.dispatch.ContextClassLoaderDispatch#dispatch at line:32
    org.gradle.internal.dispatch.ProxyDispatchAdapter$DispatchingInvocationHandler#invoke
at line:93
    com.sun.proxy.$Proxy2#processTestClass
    org.gradle.api.internal.tasks.testing.worker.TestWorker#processTestClass at line:118
    sun.reflect.GeneratedMethodAccessor6#invoke
    sun.reflect.DelegatingMethodAccessorImpl#invoke at line:43
    java.lang.reflect.Method#invoke at line:498
    org.gradle.internal.dispatch.ReflectionDispatch#dispatch at line:35
    org.gradle.internal.dispatch.ReflectionDispatch#dispatch at line:24
    org.gradle.internal.remote.internal.hub.MessageHubBackedObjectConnection$DispatchWrapper#dispatch
at line:175
    org.gradle.internal.remote.internal.hub.MessageHubBackedObjectConnection$DispatchWrapper#dispatch
at line:157
    org.gradle.internal.remote.internal.hub.MessageHub$Handler#run at line:404
    org.gradle.internal.concurrent.ExecutorPolicy$CatchAndRecordFailures#onExecute at line:63
    org.gradle.internal.concurrent.ManagedExecutorImpl$1#run at line:46
    java.util.concurrent.ThreadPoolExecutor#runWorker at line:1149
    java.util.concurrent.ThreadPoolExecutor$Worker#run at line:624
    org.gradle.internal.concurrent.ThreadFactoryImpl$ManagedThreadRunnable#run at line:55
    java.lang.Thread#run at line:748

    Thread[AWT-EventQueue-0,6,main], stackTrace:sun.misc.Unsafe#park
    java.util.concurrent.locks.LockSupport#park at line:175
    java.util.concurrent.locks.AbstractQueuedSynchronizer$ConditionObject#await at line:2039
    java.awt.EventQueue#getNextEvent at line:554
    java.awt.EventDispatchThread#pumpOneEventForFilters at line:187
    java.awt.EventDispatchThread#pumpEventsForFilter at line:116
    java.awt.EventDispatchThread#pumpEventsForHierarchy at line:105
    java.awt.EventDispatchThread#pumpEvents at line:101
    java.awt.EventDispatchThread#pumpEvents at line:93
    java.awt.EventDispatchThread#run at line:82

    JMeterUtils.getJMeterVe rsion() = 5.2.0-SNAPSHOT 06fae10
    JMeterUtils.getJMeterVe rsion() = 5.2.0-SNAPSHOT 06fae10

org.apache.jmeter.resources.PackageTest > checkI18n STANDARD_OUT
    Ignoring missing junit_failure_default_code=0001 in org/apache/jmeter/resources/messages_fr.properties
    Ignoring missing aggregate_report_90=90% in org/apache/jmeter/resources/messages_fr.properties
    Ignoring missing junit_error_default_code=9999 in org/apache/jmeter/resources/messages_fr.properties
    Ignoring missing junit_success_default_code=1000 in org/apache/jmeter/resources/messages_fr.properties

> Task :src:components:test

org.apache.jmeter.config.TestCVSDataSet STANDARD_OUT
    Setting JMeterHome: <https://builds.apache.org/job/JMeter%20Ubuntu/ws/src/components/../../.>
    Initializing Properties: ../.././bin/jmeter.properties
    JMeterVersion=5.2.0-SNAPSHOT 06fae10
    java.version=1.8.0_191
    java.vm.name=Java HotSpot(TM) 64-Bit Server VM
    java.vendor=Oracle Corporation
    java.home=/usr/local/asfpackages/java/jdk1.8.0_191/jre
    file.encoding=ISO-8859-1
    default encoding=ISO-8859-1
    user.home=/home/jenkins
    user.dir=<https://builds.apache.org/job/JMeter%20Ubuntu/ws/src/components>
    user.language=en
    user.region=null
    user.country=US
    user.variant=
    Locale=en_US
    java.class.version=52.0
    java.awt.headless=true
    os.name=Linux
    os.version=4.4.0-138-generic
    os.arch=amd64

org.apache.jmeter.timers.SyncTimerTest > testTimerWithLongerScheduledEndpointThanTimeoutForTimer
FAILED
    java.lang.AssertionError: Calculating delay takes less then 400 ms (took: 586 ms)
        at org.junit.Assert.fail(Assert.java:88)
        at org.junit.Assert.assertTrue(Assert.java:41)
        at org.apache.jmeter.timers.SyncTimerTest.testTimerWithLongerScheduledEndpointThanTimeoutForTimer(SyncTimerTest.java:54)

> Task :src:core:check

> Task :src:components:test

392 tests completed, 1 failed, 3 skipped

> Task :src:components:test FAILED
Checksum computation time: 1025, files processed: 162, bytes processed: 104179273

FAILURE: Build failed with an exception.

* What went wrong:
Execution failed for task ':src:components:test'.
> There were failing tests. See the report at: file:///home/jenkins/jenkins-slave/workspace/JMeter%20Ubuntu/src/components/build/reports/tests/test/index.html

* Try:
Run with --stacktrace option to get the stack trace. Run with --info or --debug option to
get more log output. Run with --scan to get full insights.

* Get more help at https://help.gradle.org

Deprecated Gradle features were used in this build, making it incompatible with Gradle 6.0.
Use '--warning-mode all' to show the individual deprecation warnings.
See https://docs.gradle.org/5.5.1/userguide/command_line_interface.html#sec:command_line_warnings

BUILD FAILED in 5m 33s
135 actionable tasks: 135 executed
Build step 'Invoke Gradle script' changed build result to FAILURE
Build step 'Invoke Gradle script' marked build as failure
WARN: Unable to locate 'report-task.txt' in the workspace. Did the SonarScanner succeeded?
[locks-and-latches] Releasing all the locks
[locks-and-latches] All the locks released

Mime
View raw message