jmeter-dev mailing list archives

Site index · List index
Message view « Date » · « Thread »
Top « Date » · « Thread »
From Apache Jenkins Server <jenk...@builds.apache.org>
Subject Build failed in Jenkins: JMeter-trunk #7351
Date Mon, 23 Sep 2019 12:16:19 GMT
See <https://builds.apache.org/job/JMeter-trunk/7351/display/redirect?page=changes>

Changes:

[pmouawad] Modify 2 tests to test custom port setting

------------------------------------------
[...truncated 49.91 KB...]
> Task :jar UP-TO-DATE
> Task :assemble UP-TO-DATE
> Task :src:jorphan:compileTestJava UP-TO-DATE
> Task :src:jorphan:compileTestGroovy UP-TO-DATE
> Task :src:jorphan:processTestResources NO-SOURCE
> Task :src:jorphan:testClasses UP-TO-DATE
> Task :src:jorphan:testJar UP-TO-DATE
> Task :src:jorphan:checkstyleMain UP-TO-DATE
> Task :src:jorphan:checkstyleTest UP-TO-DATE
> Task :src:bshclient:spotbugsMain UP-TO-DATE
> Task :src:launcher:spotbugsMain UP-TO-DATE
> Task :src:bshclient:spotbugsTest NO-SOURCE
> Task :src:launcher:spotbugsTest NO-SOURCE
> Task :src:bshclient:test NO-SOURCE
> Task :src:bshclient:check UP-TO-DATE
> Task :src:jorphan:spotbugsMain UP-TO-DATE
> Task :src:bshclient:jar UP-TO-DATE
> Task :src:bshclient:assemble UP-TO-DATE
> Task :src:launcher:test NO-SOURCE
> Task :src:launcher:check UP-TO-DATE
> Task :src:launcher:assemble UP-TO-DATE
> Task :src:jorphan:spotbugsTest UP-TO-DATE
> Task :rat
> Task :check

> Task :src:jorphan:test

org.apache.jorphan.exec.TestKeyToolUtils > testDNSNameBasedCert STANDARD_ERROR
    SLF4J: Failed to load class "org.slf4j.impl.StaticLoggerBinder".
    SLF4J: Defaulting to no-operation (NOP) logger implementation
    SLF4J: See http://www.slf4j.org/codes.html#StaticLoggerBinder for further details.

> Task :src:core:compileJava
Note: Some input files use or override a deprecated API.
Note: Recompile with -Xlint:deprecation for details.
Note: <https://builds.apache.org/job/JMeter-trunk/ws/src/core/src/main/java/org/apache/jmeter/save/converters/TestElementPropertyConverter.java>
uses unchecked or unsafe operations.
Note: Recompile with -Xlint:unchecked for details.

> Task :src:core:compileGroovy NO-SOURCE
> Task :src:core:classes
> Task :src:protocol:native:compileJava UP-TO-DATE
> Task :src:protocol:tcp:compileJava UP-TO-DATE
> Task :src:protocol:jms:compileJava UP-TO-DATE
> Task :src:protocol:java:compileJava UP-TO-DATE
> Task :src:protocol:ldap:compileJava UP-TO-DATE
> Task :src:protocol:native:classes UP-TO-DATE
> Task :src:protocol:junit-sample:compileJava UP-TO-DATE
> Task :src:protocol:jms:classes UP-TO-DATE
> Task :src:protocol:tcp:classes UP-TO-DATE
> Task :src:protocol:junit-sample:classes UP-TO-DATE
> Task :src:protocol:ldap:classes UP-TO-DATE
> Task :src:protocol:java:classes UP-TO-DATE
> Task :src:protocol:native:jar UP-TO-DATE
> Task :src:protocol:jms:jar UP-TO-DATE
> Task :src:protocol:tcp:jar UP-TO-DATE
> Task :src:protocol:ldap:jar UP-TO-DATE
> Task :src:protocol:java:jar UP-TO-DATE
> Task :src:protocol:junit-sample:jar UP-TO-DATE
> Task :src:protocol:ftp:compileJava UP-TO-DATE
> Task :src:protocol:ftp:classes UP-TO-DATE
> Task :src:protocol:ftp:jar UP-TO-DATE
> Task :src:protocol:jdbc:compileJava UP-TO-DATE
> Task :src:protocol:jdbc:compileGroovy NO-SOURCE
> Task :src:protocol:jdbc:classes UP-TO-DATE
> Task :src:protocol:mongodb:compileJava UP-TO-DATE
> Task :src:protocol:mongodb:classes UP-TO-DATE
> Task :src:protocol:mongodb:jar UP-TO-DATE
> Task :src:protocol:jdbc:jar UP-TO-DATE
> Task :src:protocol:junit:compileJava UP-TO-DATE
> Task :src:protocol:junit:classes UP-TO-DATE
> Task :src:protocol:junit:jar UP-TO-DATE
> Task :src:protocol:mail:compileJava UP-TO-DATE
> Task :src:protocol:mail:classes UP-TO-DATE
> Task :src:protocol:mail:jar UP-TO-DATE
> Task :src:components:compileJava UP-TO-DATE
> Task :src:components:compileGroovy NO-SOURCE
> Task :src:components:classes UP-TO-DATE
> Task :src:generator:compileJava UP-TO-DATE
> Task :src:generator:classes UP-TO-DATE
> Task :src:examples:compileJava UP-TO-DATE
> Task :src:examples:classes UP-TO-DATE
> Task :src:generator:jar UP-TO-DATE
> Task :src:functions:compileJava UP-TO-DATE
> Task :src:functions:compileGroovy NO-SOURCE
> Task :src:functions:classes UP-TO-DATE
> Task :src:functions:jar UP-TO-DATE
> Task :src:protocol:java:checkstyleMain
> Task :src:protocol:native:checkstyleMain
> Task :src:generator:checkstyleMain
> Task :src:protocol:ftp:checkstyleMain
> Task :src:protocol:mongodb:checkstyleMain
> Task :src:protocol:junit-sample:checkstyleMain
> Task :src:protocol:jdbc:checkstyleMain
> Task :src:examples:checkstyleMain
> Task :src:protocol:tcp:checkstyleMain
> Task :src:protocol:ldap:checkstyleMain
> Task :src:protocol:java:assemble UP-TO-DATE
> Task :src:protocol:native:assemble UP-TO-DATE
> Task :src:protocol:ldap:assemble UP-TO-DATE
> Task :src:protocol:tcp:assemble UP-TO-DATE
> Task :src:protocol:jdbc:assemble UP-TO-DATE
> Task :src:protocol:mongodb:assemble UP-TO-DATE
> Task :src:protocol:ftp:assemble UP-TO-DATE
> Task :src:protocol:junit-sample:assemble UP-TO-DATE
> Task :src:protocol:junit:checkstyleMain
> Task :src:protocol:junit:assemble UP-TO-DATE
> Task :src:generator:compileTestJava NO-SOURCE
> Task :src:examples:compileTestJava NO-SOURCE
> Task :src:generator:testClasses UP-TO-DATE
> Task :src:protocol:mail:checkstyleMain
> Task :src:examples:testClasses UP-TO-DATE
> Task :src:protocol:mail:assemble UP-TO-DATE
> Task :src:generator:checkstyleTest NO-SOURCE
> Task :src:generator:assemble UP-TO-DATE
> Task :src:examples:checkstyleTest NO-SOURCE
> Task :src:examples:jar UP-TO-DATE
> Task :src:examples:assemble UP-TO-DATE
> Task :src:functions:checkstyleMain
> Task :src:functions:assemble UP-TO-DATE
> Task :src:protocol:jms:checkstyleMain
> Task :src:protocol:jms:assemble UP-TO-DATE
> Task :src:protocol:http:compileJava
> Task :src:protocol:http:compileGroovy NO-SOURCE
> Task :src:protocol:http:classes
> Task :src:protocol:http:jar
> Task :src:core:jar
> Task :src:core:compileTestJava UP-TO-DATE
> Task :src:dist:distTarSource
> Task :src:components:checkstyleMain
> Task :src:jorphan:check
> Task :src:jorphan:assemble UP-TO-DATE
> Task :src:dist:compileJava NO-SOURCE
> Task :src:dist:classes UP-TO-DATE
> Task :src:dist-check:compileJava NO-SOURCE
> Task :src:dist:checkstyleMain NO-SOURCE
> Task :src:dist-check:compileGroovy NO-SOURCE
> Task :src:dist-check:classes UP-TO-DATE
> Task :src:dist-check:checkstyleMain NO-SOURCE
> Task :src:dist:jar UP-TO-DATE
> Task :src:dist-check:jar UP-TO-DATE
> Task :src:dist-check:assemble UP-TO-DATE

> Task :src:protocol:http:checkstyleMain
[ant:checkstyle] [ERROR] <https://builds.apache.org/job/JMeter-trunk/ws/src/protocol/http/src/main/java/org/apache/jmeter/protocol/http/gui/action/ParseCurlCommandAction.java>:212:
Line is longer than 160 characters (found 236). [LineLength]

> Task :src:protocol:http:checkstyleMain FAILED
> Task :src:core:compileTestGroovy

> Task :src:protocol:junit-sample:spotbugsMain
SpotBugs rule violations were found. See the report at: file://<https://builds.apache.org/job/JMeter-trunk/ws/src/protocol/junit-sample/build/reports/spotbugs/main.xml>

> Task :src:protocol:ftp:spotbugsMain
> Task :src:protocol:java:spotbugsMain
> Task :src:protocol:jdbc:spotbugsMain
> Task :src:protocol:jms:spotbugsMain
> Task :src:protocol:junit:spotbugsMain
> Task :src:protocol:ldap:spotbugsMain
> Task :src:protocol:mail:spotbugsMain
> Task :src:protocol:mongodb:spotbugsMain
> Task :src:protocol:native:spotbugsMain
> Task :src:protocol:tcp:spotbugsMain
> Task :src:components:spotbugsMain

> Task :src:protocol:mongodb:spotbugsMain
SpotBugs rule violations were found. See the report at: file://<https://builds.apache.org/job/JMeter-trunk/ws/src/protocol/mongodb/build/reports/spotbugs/main.xml>

> Task :src:dist:javadocAggregate

> Task :src:protocol:jdbc:spotbugsMain
SpotBugs rule violations were found. See the report at: file://<https://builds.apache.org/job/JMeter-trunk/ws/src/protocol/jdbc/build/reports/spotbugs/main.xml>

> Task :src:protocol:ftp:spotbugsMain
SpotBugs rule violations were found. See the report at: file://<https://builds.apache.org/job/JMeter-trunk/ws/src/protocol/ftp/build/reports/spotbugs/main.xml>

> Task :src:protocol:junit:spotbugsMain
SpotBugs rule violations were found. See the report at: file://<https://builds.apache.org/job/JMeter-trunk/ws/src/protocol/junit/build/reports/spotbugs/main.xml>

> Task :src:protocol:native:spotbugsMain
SpotBugs rule violations were found. See the report at: file://<https://builds.apache.org/job/JMeter-trunk/ws/src/protocol/native/build/reports/spotbugs/main.xml>

> Task :src:protocol:tcp:spotbugsMain
SpotBugs rule violations were found. See the report at: file://<https://builds.apache.org/job/JMeter-trunk/ws/src/protocol/tcp/build/reports/spotbugs/main.xml>

> Task :src:protocol:mail:spotbugsMain
SpotBugs rule violations were found. See the report at: file://<https://builds.apache.org/job/JMeter-trunk/ws/src/protocol/mail/build/reports/spotbugs/main.xml>

> Task :src:protocol:jms:spotbugsMain
SpotBugs rule violations were found. See the report at: file://<https://builds.apache.org/job/JMeter-trunk/ws/src/protocol/jms/build/reports/spotbugs/main.xml>

> Task :src:components:spotbugsMain
The following classes needed for analysis were missing:
  org.bouncycastle.asn1.x500.style.BCStyle
  org.bouncycastle.asn1.ASN1ObjectIdentifier
  org.bouncycastle.asn1.ASN1Encodable
  org.bouncycastle.asn1.x509.Extension
  org.bouncycastle.operator.DigestCalculatorProvider
  org.bouncycastle.util.Selector
  org.bouncycastle.cert.X509CertificateHolder
  org.bouncycastle.cms.SignerInformationVerifier
  org.bouncycastle.mail.smime.SMIMESignedParser
  org.bouncycastle.operator.bc.BcDigestCalculatorProvider
  org.bouncycastle.cms.CMSException
  org.bouncycastle.mail.smime.SMIMEException
  org.bouncycastle.cms.SignerInformationStore
  org.bouncycastle.cms.SignerInformation
  org.bouncycastle.util.Store
  org.bouncycastle.cms.jcajce.JcaSimpleSignerInfoVerifierBuilder
  org.bouncycastle.asn1.x500.X500Name
  org.bouncycastle.cert.jcajce.JcaX509CertificateHolder
  org.bouncycastle.asn1.x500.RDN
  org.bouncycastle.asn1.x500.AttributeTypeAndValue
  org.bouncycastle.asn1.x500.style.IETFUtils
  org.bouncycastle.asn1.x509.GeneralNames
  org.bouncycastle.asn1.x509.GeneralName
  org.bouncycastle.jce.provider.BouncyCastleProvider
  org.bouncycastle.operator.OperatorCreationException
SpotBugs rule violations were found. See the report at: file://<https://builds.apache.org/job/JMeter-trunk/ws/src/components/build/reports/spotbugs/main.xml>
checksum-dependency elapsed time: 26331ms, configurations processed: 301
    SHA-512 computation time: 2937ms (goes in parallel, it might exceed wall-clock time),
files processed: 33, processed: 6MiB, skipped: 1049MiB
    PGP key resolution time: 19846ms (wall-clock), resolution requests: 82, download time:
0ms (goes in parallel, it might exceed wall-clock time), keys downloaded: 0
        PGP signature verification time: 65646ms (goes in parallel, it might exceed wall-clock
time), files processed: 198, processed: 142MiB, skipped: 888MiB

FAILURE: Build failed with an exception.

* What went wrong:
Execution failed for task ':src:protocol:http:checkstyleMain'.
> Checkstyle rule violations were found. See the report at: file://<https://builds.apache.org/job/JMeter-trunk/ws/src/protocol/http/build/reports/checkstyle/main.html>
  Checkstyle files with violations: 1
  Checkstyle violations by severity: [error:1]


* Try:
Run with --stacktrace option to get the stack trace. Run with --info or --debug option to
get more log output. Run with --scan to get full insights.

* Get more help at https://help.gradle.org

Deprecated Gradle features were used in this build, making it incompatible with Gradle 6.0.
Use '--warning-mode all' to show the individual deprecation warnings.
See https://docs.gradle.org/5.5.1/userguide/command_line_interface.html#sec:command_line_warnings

BUILD FAILED in 3m 13s
147 actionable tasks: 58 executed, 89 up-to-date
Build step 'Invoke Gradle script' changed build result to FAILURE
Build step 'Invoke Gradle script' marked build as failure
[locks-and-latches] Releasing all the locks
[locks-and-latches] All the locks released
Archiving artifacts
[Fast Archiver] Compressed 176.64 MB of artifacts by 63.5% relative to #7348
Recording test results

Mime
View raw message