jmeter-dev mailing list archives

Site index · List index
Message view « Date » · « Thread »
Top « Date » · « Thread »
From Apache Jenkins Server <jenk...@builds.apache.org>
Subject Build failed in Jenkins: JMeter-trunk #7354
Date Tue, 24 Sep 2019 19:40:00 GMT
See <https://builds.apache.org/job/JMeter-trunk/7354/display/redirect?page=changes>

Changes:

[pmouawad] Suite

[pmouawad] Correct cleanup

[pmouawad] Use Parameterized test Fix some bugs

[pmouawad] Full rework More tests Improve docs

[pmouawad] Fix performance issue related to ObjectMapper instanciation (thanks

[pmouawad] Replace boolean by enum for better readability as per Vladimir

[pmouawad] Fix SaveService hash Improve failure messages

[pmouawad] Mention implementor in release notes

------------------------------------------
[...truncated 111.71 KB...]
    isAnyLocalAddress:false
    isLinkLocalAddress:false
    isLoopbackAddress:true
    isMulticastAddress:false
    ====================
    asf944.gq1.ygridcore.net/67.195.81.190
    isSiteLocalAddress:false
    isAnyLocalAddress:false
    isLinkLocalAddress:false
    isLoopbackAddress:false
    isMulticastAddress:false

org.apache.jmeter.engine.LocalHostTest > testInterfaces STANDARD_ERROR
    Interfaces: {name:docker0 (docker0) => [/fe80:0:0:0:42:bbff:fe10:bedc%docker0/64 [null],
/172.17.0.1/16 [/172.17.255.255]], name:enp7s0f0 (enp7s0f0) => [/fe80:0:0:0:7ae3:b5ff:fe17:8984%enp7s0f0/64
[null], /2001:4998:c:c34:7ae3:b5ff:fe17:8984%enp7s0f0/64 [null], /67.195.81.190/26 [/67.195.81.191]],
name:lo (lo) => [/0:0:0:0:0:0:0:1%lo/128 [null], /127.0.0.1/8 [null]]}
    Choose 172.17.0.1 to talk to external services
    java.rmi.server.hostname=null

org.apache.jmeter.engine.util.TestValueReplacer STANDARD_OUT
    Setting JMeterHome: <https://builds.apache.org/job/JMeter-trunk/ws/src/core/../../.>
    Initializing Properties: ../.././bin/jmeter.properties

> Task :src:dist:javadocAggregate
<https://builds.apache.org/job/JMeter-trunk/ws/src/components/src/main/java/org/apache/jmeter/assertions/jmespath/gui/JMESPathAssertionGui.java>:31:
error: invalid end tag: </br>
 * JMeter</br>
         ^

> Task :src:components:test

> Task :src:dist:javadocAggregate FAILED
3 errors

> Task :src:components:test

org.apache.jmeter.config.TestRandomVariableConfig STANDARD_OUT
    Setting JMeterHome: <https://builds.apache.org/job/JMeter-trunk/ws/src/components/../../.>
    Initializing Properties: ../.././bin/jmeter.properties
    JMeterVersion=5.2.0-SNAPSHOT 18c95a8
    java.version=1.8.0_191
    java.vm.name=Java HotSpot(TM) 64-Bit Server VM
    java.vendor=Oracle Corporation
    java.home=/usr/local/asfpackages/java/jdk1.8.0_191/jre
    file.encoding=ISO-8859-1
    default encoding=ISO-8859-1
    user.home=/home/jenkins
    user.dir=<https://builds.apache.org/job/JMeter-trunk/ws/src/components>
    user.language=en
    user.region=null
    user.country=US
    user.variant=
    Locale=en_US
    java.class.version=52.0
    java.awt.headless=true
    os.name=Linux
    os.version=4.15.0-58-generic
    os.arch=amd64

> Task :src:core:test
    JMeterVersion=5.2.0-SNAPSHOT 18c95a8
    java.version=1.8.0_191
    java.vm.name=Java HotSpot(TM) 64-Bit Server VM
    java.vendor=Oracle Corporation
    java.home=/usr/local/asfpackages/java/jdk1.8.0_191/jre
    file.encoding=ISO-8859-1
    default encoding=ISO-8859-1
    user.home=/home/jenkins
    user.dir=<https://builds.apache.org/job/JMeter-trunk/ws/src/core>
    user.language=en
    user.region=null
    user.country=US
    user.variant=
    Locale=en_US
    java.class.version=52.0
    java.awt.headless=true
    os.name=Linux
    os.version=4.15.0-58-generic
    os.arch=amd64

org.apache.jmeter.resources.PackageTest > checkI18n STANDARD_OUT
    Ignoring missing junit_failure_default_code=0001 in org/apache/jmeter/resources/messages_fr.properties
    Ignoring missing aggregate_report_90=90% in org/apache/jmeter/resources/messages_fr.properties
    Ignoring missing junit_error_default_code=9999 in org/apache/jmeter/resources/messages_fr.properties
    Ignoring missing junit_success_default_code=1000 in org/apache/jmeter/resources/messages_fr.properties

org.apache.jmeter.JMeterTest > testSuccessWhenJmxExists STANDARD_OUT
    Creating summariser <summary>
    Created the tree successfully using /tmp/testPlan7499692403203388550.jmx
    Starting the test @ Tue Sep 24 19:39:04 UTC 2019 (1569353944688)
    Waiting for possible Shutdown/StopTestNow/HeapDump/ThreadDump message on port 4445

org.apache.jmeter.JMeterTest > testFailureWithMissingPlugin STANDARD_OUT
    Error in NonGUIDriver java.lang.IllegalArgumentException: Problem loading XML from:'/tmp/testPlan6006748209469404759.jmx'.

    Cause:
    CannotResolveClassException: kg.apc.jmeter.samplers.DummySampler

     Detail:com.thoughtworks.xstream.converters.ConversionException: 
    ---- Debugging information ----
    cause-exception     : com.thoughtworks.xstream.converters.ConversionException
    cause-message       : 
    first-jmeter-class  : org.apache.jmeter.save.converters.HashTreeConverter.unmarshal(HashTreeConverter.java:67)
    class               : org.apache.jmeter.save.ScriptWrapper
    required-type       : org.apache.jmeter.save.ScriptWrapper
    converter-type      : org.apache.jmeter.save.ScriptWrapperConverter
    path                : /jmeterTestPlan/hashTree/hashTree/hashTree/kg.apc.jmeter.samplers.DummySampler
    line number         : 16
    version             : not available
    -------------------------------

org.apache.jmeter.testbeans.gui.TestComboStringEditor > testSetGetAsText STANDARD_OUT
    summary =      0 in 00:00:00 = ******/s Avg:     0 Min: 9223372036854775807 Max: -9223372036854775808
Err:     0 (0.00%)
    Tidying up ...    @ Tue Sep 24 19:39:04 UTC 2019 (1569353944859)
    ... end of run

org.apache.jmeter.testbeans.gui.TestFieldStringEditor > testSetGetAsText STANDARD_OUT
    JMeterUtils.getJMeterVe rsion() = 5.2.0-SNAPSHOT 18c95a8
    JMeterUtils.getJMeterVe rsion() = 5.2.0-SNAPSHOT 18c95a8
    JMeterUtils.getJMeterVe rsion() = 5.2.0-SNAPSHOT 18c95a8

org.apache.jmeter.samplers.TestSampleResult > testSubResultsFalsePauseThread STANDARD_OUT
    The JVM should have exited but did not.
    The following non-daemon threads are still running (DestroyJavaVM is OK):
    Thread[/0:0:0:0:0:0:0:1:48172 to /0:0:0:0:0:0:0:1:46497 workers Thread 2,5,main], stackTrace:sun.nio.ch.NativeThread#current
    sun.nio.ch.SocketChannelImpl#write at line:468
    org.gradle.internal.remote.internal.inet.SocketConnection$SocketOutputStream#writeWithNonBlockingRetry
at line:273
    org.gradle.internal.remote.internal.inet.SocketConnection$SocketOutputStream#writeBufferToChannel
at line:261
    org.gradle.internal.remote.internal.inet.SocketConnection$SocketOutputStream#flush at
line:255
    org.gradle.internal.remote.internal.inet.SocketConnection#flush at line:133
    org.gradle.internal.remote.internal.hub.MessageHub$ConnectionDispatch#run at line:329
    org.gradle.internal.concurrent.ExecutorPolicy$CatchAndRecordFailures#onExecute at line:63
    org.gradle.internal.concurrent.ManagedExecutorImpl$1#run at line:46
    java.util.concurrent.ThreadPoolExecutor#runWorker at line:1149
    java.util.concurrent.ThreadPoolExecutor$Worker#run at line:624
    org.gradle.internal.concurrent.ThreadFactoryImpl$ManagedThreadRunnable#run at line:55
    java.lang.Thread#run at line:748

    Thread[main,5,main], stackTrace:sun.misc.Unsafe#park
    java.util.concurrent.locks.LockSupport#park at line:175
    java.util.concurrent.locks.AbstractQueuedSynchronizer#parkAndCheckInterrupt at line:836
    java.util.concurrent.locks.AbstractQueuedSynchronizer#doAcquireSharedInterruptibly at
line:997
    java.util.concurrent.locks.AbstractQueuedSynchronizer#acquireSharedInterruptibly at line:1304
    java.util.concurrent.CountDownLatch#await at line:231
    org.gradle.api.internal.tasks.testing.worker.TestWorker#execute at line:72
    org.gradle.api.internal.tasks.testing.worker.TestWorker#execute at line:46
    org.gradle.process.internal.worker.child.ActionExecutionWorker#execute at line:86
    org.gradle.process.internal.worker.child.ActionExecutionWorker#execute at line:34
    org.gradle.process.internal.worker.child.SystemApplicationClassLoaderWorker#call at line:132
    org.gradle.process.internal.worker.child.SystemApplicationClassLoaderWorker#call at line:68
    worker.org.gradle.process.internal.worker.GradleWorkerMain#run at line:68
    worker.org.gradle.process.internal.worker.GradleWorkerMain#main at line:73

    Thread[/0:0:0:0:0:0:0:1:48172 to /0:0:0:0:0:0:0:1:46497 workers Thread 3,5,main], stackTrace:sun.nio.ch.EPollArrayWrapper#epollWait
    sun.nio.ch.EPollArrayWrapper#poll at line:269
    sun.nio.ch.EPollSelectorImpl#doSelect at line:93
    sun.nio.ch.SelectorImpl#lockAndDoSelect at line:86
    sun.nio.ch.SelectorImpl#select at line:97
    sun.nio.ch.SelectorImpl#select at line:101
    org.gradle.internal.remote.internal.inet.SocketConnection$SocketInputStream#read at line:179
    com.esotericsoftware.kryo.io.Input#fill at line:146
    com.esotericsoftware.kryo.io.Input#require at line:178
    com.esotericsoftware.kryo.io.Input#readByte at line:295
    org.gradle.internal.serialize.kryo.KryoBackedDecoder#readByte at line:80
    org.gradle.internal.remote.internal.hub.InterHubMessageSerializer$MessageReader#read at
line:63
    org.gradle.internal.remote.internal.hub.InterHubMessageSerializer$MessageReader#read at
line:52
    org.gradle.internal.remote.internal.inet.SocketConnection#receive at line:80
    org.gradle.internal.remote.internal.hub.MessageHub$ConnectionReceive#run at line:263
    org.gradle.internal.concurrent.ExecutorPolicy$CatchAndRecordFailures#onExecute at line:63
    org.gradle.internal.concurrent.ManagedExecutorImpl$1#run at line:46
    java.util.concurrent.ThreadPoolExecutor#runWorker at line:1149
    java.util.concurrent.ThreadPoolExecutor$Worker#run at line:624
    org.gradle.internal.concurrent.ThreadFactoryImpl$ManagedThreadRunnable#run at line:55
    java.lang.Thread#run at line:748

    Thread[Test worker,5,main], stackTrace:java.lang.Thread#sleep
    org.apache.jmeter.samplers.TestSampleResult#testSubResults at line:241
    org.apache.jmeter.samplers.TestSampleResult#testSubResultsFalsePauseThread at line:186
    sun.reflect.NativeMethodAccessorImpl#invoke0
    sun.reflect.NativeMethodAccessorImpl#invoke at line:62
    sun.reflect.DelegatingMethodAccessorImpl#invoke at line:43
    java.lang.reflect.Method#invoke at line:498
    org.junit.runners.model.FrameworkMethod$1#runReflectiveCall at line:50
    org.junit.internal.runners.model.ReflectiveCallable#run at line:12
    org.junit.runners.model.FrameworkMethod#invokeExplosively at line:47
    org.junit.internal.runners.statements.InvokeMethod#evaluate at line:17
    org.junit.runners.ParentRunner#runLeaf at line:325
    org.junit.runners.BlockJUnit4ClassRunner#runChild at line:78
    org.junit.runners.BlockJUnit4ClassRunner#runChild at line:57
    org.junit.runners.ParentRunner$3#run at line:290
    org.junit.runners.ParentRunner$1#schedule at line:71
    org.junit.runners.ParentRunner#runChildren at line:288
    org.junit.runners.ParentRunner#access$000 at line:58
    org.junit.runners.ParentRunner$2#evaluate at line:268
    org.junit.runners.ParentRunner#run at line:363
    org.gradle.api.internal.tasks.testing.junit.JUnitTestClassExecutor#runTestClass at line:110
    org.gradle.api.internal.tasks.testing.junit.JUnitTestClassExecutor#execute at line:58
    org.gradle.api.internal.tasks.testing.junit.JUnitTestClassExecutor#execute at line:38
    org.gradle.api.internal.tasks.testing.junit.AbstractJUnitTestClassProcessor#processTestClass
at line:62
    org.gradle.api.internal.tasks.testing.SuiteTestClassProcessor#processTestClass at line:51
    sun.reflect.GeneratedMethodAccessor6#invoke
    sun.reflect.DelegatingMethodAccessorImpl#invoke at line:43
    java.lang.reflect.Method#invoke at line:498
    org.gradle.internal.dispatch.ReflectionDispatch#dispatch at line:35
    org.gradle.internal.dispatch.ReflectionDispatch#dispatch at line:24
    org.gradle.internal.dispatch.ContextClassLoaderDispatch#dispatch at line:32
    org.gradle.internal.dispatch.ProxyDispatchAdapter$DispatchingInvocationHandler#invoke
at line:93
    com.sun.proxy.$Proxy2#processTestClass
    org.gradle.api.internal.tasks.testing.worker.TestWorker#processTestClass at line:118
    sun.reflect.GeneratedMethodAccessor5#invoke
    sun.reflect.DelegatingMethodAccessorImpl#invoke at line:43
    java.lang.reflect.Method#invoke at line:498
    org.gradle.internal.dispatch.ReflectionDispatch#dispatch at line:35
    org.gradle.internal.dispatch.ReflectionDispatch#dispatch at line:24
    org.gradle.internal.remote.internal.hub.MessageHubBackedObjectConnection$DispatchWrapper#dispatch
at line:175
    org.gradle.internal.remote.internal.hub.MessageHubBackedObjectConnection$DispatchWrapper#dispatch
at line:157
    org.gradle.internal.remote.internal.hub.MessageHub$Handler#run at line:404
    org.gradle.internal.concurrent.ExecutorPolicy$CatchAndRecordFailures#onExecute at line:63
    org.gradle.internal.concurrent.ManagedExecutorImpl$1#run at line:46
    java.util.concurrent.ThreadPoolExecutor#runWorker at line:1149
    java.util.concurrent.ThreadPoolExecutor$Worker#run at line:624
    org.gradle.internal.concurrent.ThreadFactoryImpl$ManagedThreadRunnable#run at line:55
    java.lang.Thread#run at line:748

checksum-dependency elapsed time: 85682ms, configurations processed: 430
    SHA-512 computation time: 7248ms (goes in parallel, it might exceed wall-clock time),
files processed: 33, processed: 6MiB, skipped: 1695MiB
    PGP key resolution time: 17755ms (wall-clock), resolution requests: 121, download time:
25829ms (goes in parallel, it might exceed wall-clock time), keys downloaded: 83
        PGP signature verification time: 44692ms (goes in parallel, it might exceed wall-clock
time), files processed: 193, processed: 156MiB, skipped: 1514MiB

FAILURE: Build failed with an exception.

* What went wrong:
Execution failed for task ':src:dist:javadocAggregate'.
> Javadoc generation failed. Generated Javadoc options file (useful for troubleshooting):
'<https://builds.apache.org/job/JMeter-trunk/ws/src/dist/build/tmp/javadocAggregate/javadoc.options'>

* Try:
Run with --stacktrace option to get the stack trace. Run with --info or --debug option to
get more log output. Run with --scan to get full insights.

* Get more help at https://help.gradle.org

Deprecated Gradle features were used in this build, making it incompatible with Gradle 6.0.
Use '--warning-mode all' to show the individual deprecation warnings.
See https://docs.gradle.org/5.5.1/userguide/command_line_interface.html#sec:command_line_warnings

BUILD FAILED in 23m 21s
212 actionable tasks: 147 executed, 65 up-to-date
Build step 'Invoke Gradle script' changed build result to FAILURE
Build step 'Invoke Gradle script' marked build as failure
[locks-and-latches] Releasing all the locks
[locks-and-latches] All the locks released
Archiving artifacts
[Fast Archiver] Compressed 146.44 MB of artifacts by 47.9% relative to #7348
Recording test results

Mime
View raw message