jmeter-dev mailing list archives

Site index · List index
Message view « Date » · « Thread »
Top « Date » · « Thread »
From Apache Jenkins Server <jenk...@builds.apache.org>
Subject Build failed in Jenkins: JMeter Windows #1530
Date Sun, 06 Oct 2019 22:07:42 GMT
See <https://builds.apache.org/job/JMeter%20Windows/1530/display/redirect?page=changes>

Changes:

[sitnikov.vladimir] Make release scripts compatible with Gradle 5.6

[sitnikov.vladimir] Use rel/v${version} and v${version}-rc${rc} tags

[sitnikov.vladimir] Case for a force push: removing unused import


------------------------------------------
[...truncated 175.90 KB...]
    org.gradle.internal.concurrent.ManagedExecutorImpl$1#run at line:48
    java.util.concurrent.ThreadPoolExecutor#runWorker at line:1149
    java.util.concurrent.ThreadPoolExecutor$Worker#run at line:624
    org.gradle.internal.concurrent.ThreadFactoryImpl$ManagedThreadRunnable#run at line:56
    java.lang.Thread#run at line:748


> Task :src:dist:copyLibs
> Task :src:dist:createDist

> Task :src:core:test

org.apache.jmeter.resources.PackageTest > checkI18n fr: messages STANDARD_OUT
    Ignoring missing junit_failure_default_code=0001 in org/apache/jmeter/resources/messages_fr.properties
    Ignoring missing aggregate_report_90=90% in org/apache/jmeter/resources/messages_fr.properties
    Ignoring missing junit_error_default_code=9999 in org/apache/jmeter/resources/messages_fr.properties
    Ignoring missing junit_success_default_code=1000 in org/apache/jmeter/resources/messages_fr.properties

> Task :src:dist-check:copyExtraTestLibs

> Task :src:dist:javadocAggregate
javadoc: warning - Multiple sources of package comments found for package "org.apache.jmeter.assertions"
javadoc: warning - Multiple sources of package comments found for package "org.apache.jmeter.visualizers"

> Task :src:core:check
> Task :src:core:assemble

> Task :src:dist-check:batchBUG_62847
Oct 06, 2019 3:05:55 PM java.util.prefs.WindowsPreferences <init>
WARNING: Could not open/create prefs root node Software\JavaSoft\Prefs at root 0x80000002.
Windows RegCreateKeyEx(...) returned error code 5.
Creating summariser <summary>
Created the tree successfully using F:\jenkins\jenkins-slave\workspace\JMeter Windows\bin\testfiles\BUG_62847.jmx
Starting standalone test @ Sun Oct 06 15:05:55 PDT 2019 (1570399555886)
Waiting for possible Shutdown/StopTestNow/HeapDump/ThreadDump message on port 4445
summary =      6 in 00:00:00 =   15.0/s Avg:     0 Min:     0 Max:     1 Err:     0 (0.00%)
Tidying up ...    @ Sun Oct 06 15:05:56 PDT 2019 (1570399556417)
... end of run
No errors present in the logfile F:\jenkins\jenkins-slave\workspace\JMeter Windows\bin\BUG_62847.log
(the file is empty)

> Task :src:components:check
> Task :src:components:testJar UP-TO-DATE
> Task :src:functions:compileTestJava UP-TO-DATE
> Task :src:protocol:http:compileTestJava UP-TO-DATE

> Task :src:dist:javadocAggregate
javadoc: warning - Multiple sources of package comments found for package "org.apache.jmeter.report.config"
javadoc: warning - Multiple sources of package comments found for package "org.apache.jmeter.report.core"
javadoc: warning - Multiple sources of package comments found for package "org.apache.jmeter.report.dashboard"
javadoc: warning - Multiple sources of package comments found for package "org.apache.jmeter.report.processor"
javadoc: warning - Multiple sources of package comments found for package "org.apache.jmeter.report.processor.graph"
javadoc: warning - Multiple sources of package comments found for package "org.apache.jmeter.report.processor.graph.impl"
javadoc: warning - Multiple sources of package comments found for package "org.apache.commons.cli.avalon"

> Task :src:functions:compileTestGroovy
> Task :src:functions:testClasses
> Task :src:functions:testJar UP-TO-DATE
> Task :src:protocol:http:compileTestGroovy
> Task :src:protocol:http:testClasses
> Task :src:protocol:http:testJar UP-TO-DATE
> Task :src:functions:checkstyleTest
> Task :src:functions:spotbugsTest SKIPPED

> Task :src:dist-check:batchBatchTestLocal
Oct 06, 2019 3:05:59 PM java.util.prefs.WindowsPreferences <init>
WARNING: Could not open/create prefs root node Software\JavaSoft\Prefs at root 0x80000002.
Windows RegCreateKeyEx(...) returned error code 5.
Creating summariser <summary>
Created the tree successfully using F:\jenkins\jenkins-slave\workspace\JMeter Windows\bin\testfiles\BatchTestLocal.jmx
Starting standalone test @ Sun Oct 06 15:05:59 PDT 2019 (1570399559284)
Waiting for possible Shutdown/StopTestNow/HeapDump/ThreadDump message on port 4445

> Task :src:protocol:http:checkstyleTest
> Task :src:protocol:http:spotbugsTest SKIPPED

> Task :src:functions:test

Gradle Test Executor 18 STANDARD_OUT
    Setting JMeterHome: F:\jenkins\jenkins-slave\workspace\JMeter Windows\src\functions\..\..\.
    Initializing Properties: ../.././bin/jmeter.properties

Gradle Test Executor 18 STANDARD_ERROR
    Oct 06, 2019 3:06:00 PM java.util.prefs.WindowsPreferences <init>
    WARNING: Could not open/create prefs root node Software\JavaSoft\Prefs at root 0x80000002.
Windows RegCreateKeyEx(...) returned error code 5.

Gradle Test Executor 18 STANDARD_OUT
    JMeterVersion=5.2-SNAPSHOT 94397b1
    java.version=1.8.0_152
    java.vm.name=Java HotSpot(TM) 64-Bit Server VM
    java.vendor=Oracle Corporation
    java.home=F:\jenkins\tools\java\latest1.8\jre
    file.encoding=windows-1252
    default encoding=windows-1252
    user.home=C:\Users\jenkins
    user.dir=F:\jenkins\jenkins-slave\workspace\JMeter Windows\src\functions
    user.language=en
    user.region=null
    user.country=US
    user.variant=
    Locale=en_US
    java.class.version=52.0
    java.awt.headless=
    os.name=Windows Server 2016
    os.version=10.0
    os.arch=amd64

org.apache.jmeter.functions.TestStringtoFile > testWriteToFileIOException(Path) STANDARD_ERROR
    Oct 06, 2019 3:06:02 PM org.junit.jupiter.engine.execution.JupiterEngineExecutionContext
close
    SEVERE: Caught exception while closing extension context: org.junit.jupiter.engine.descriptor.MethodExtensionContext@23c1d81a
    java.io.IOException: Failed to delete temp directory C:\Users\jenkins\AppData\Local\Temp\2\junit4877224876769494483.
The following paths could not be deleted (see suppressed exceptions for details): , output.txt
    	at org.junit.jupiter.engine.extension.TempDirectory$CloseablePath.createIOExceptionWithAttachedFailures(TempDirectory.java:211)
    	at org.junit.jupiter.engine.extension.TempDirectory$CloseablePath.close(TempDirectory.java:168)
    	at org.junit.platform.engine.support.hierarchical.ThrowableCollector.execute(ThrowableCollector.java:73)
    	at org.junit.jupiter.engine.execution.ExtensionValuesStore.closeAllStoredCloseableValues(ExtensionValuesStore.java:61)
    	at org.junit.jupiter.engine.descriptor.AbstractExtensionContext.close(AbstractExtensionContext.java:73)
    	at org.junit.jupiter.engine.execution.JupiterEngineExecutionContext.close(JupiterEngineExecutionContext.java:53)
    	at org.junit.jupiter.engine.descriptor.JupiterTestDescriptor.cleanUp(JupiterTestDescriptor.java:222)
    	at org.junit.jupiter.engine.descriptor.JupiterTestDescriptor.cleanUp(JupiterTestDescriptor.java:57)
    	at org.junit.platform.engine.support.hierarchical.NodeTestTask.lambda$cleanUp$9(NodeTestTask.java:151)
    	at org.junit.platform.engine.support.hierarchical.ThrowableCollector.execute(ThrowableCollector.java:73)
    	at org.junit.platform.engine.support.hierarchical.NodeTestTask.cleanUp(NodeTestTask.java:151)
    	at org.junit.platform.engine.support.hierarchical.NodeTestTask.execute(NodeTestTask.java:83)
    	at org.junit.platform.engine.support.hierarchical.ForkJoinPoolHierarchicalTestExecutorService$ExclusiveTask.compute(ForkJoinPoolHierarchicalTestExecutorService.java:171)
    	at org.junit.platform.engine.support.hierarchical.ForkJoinPoolHierarchicalTestExecutorService.executeNonConcurrentTasks(ForkJoinPoolHierarchicalTestExecutorService.java:141)
    	at org.junit.platform.engine.support.hierarchical.ForkJoinPoolHierarchicalTestExecutorService.invokeAll(ForkJoinPoolHierarchicalTestExecutorService.java:121)
    	at org.junit.platform.engine.support.hierarchical.NodeTestTask.lambda$executeRecursively$5(NodeTestTask.java:139)
    	at org.junit.platform.engine.support.hierarchical.ThrowableCollector.execute(ThrowableCollector.java:73)
    	at org.junit.platform.engine.support.hierarchical.NodeTestTask.lambda$executeRecursively$7(NodeTestTask.java:125)
    	at org.junit.platform.engine.support.hierarchical.Node.around(Node.java:135)
    	at org.junit.platform.engine.support.hierarchical.NodeTestTask.lambda$executeRecursively$8(NodeTestTask.java:123)
    	at org.junit.platform.engine.support.hierarchical.ThrowableCollector.execute(ThrowableCollector.java:73)
    	at org.junit.platform.engine.support.hierarchical.NodeTestTask.executeRecursively(NodeTestTask.java:122)
    	at org.junit.platform.engine.support.hierarchical.NodeTestTask.execute(NodeTestTask.java:80)
    	at org.junit.platform.engine.support.hierarchical.ForkJoinPoolHierarchicalTestExecutorService$ExclusiveTask.compute(ForkJoinPoolHierarchicalTestExecutorService.java:171)
    	at org.junit.platform.engine.support.hierarchical.ForkJoinPoolHierarchicalTestExecutorService.executeNonConcurrentTasks(ForkJoinPoolHierarchicalTestExecutorService.java:141)
    	at org.junit.platform.engine.support.hierarchical.ForkJoinPoolHierarchicalTestExecutorService.invokeAll(ForkJoinPoolHierarchicalTestExecutorService.java:121)
    	at org.junit.platform.engine.support.hierarchical.NodeTestTask.lambda$executeRecursively$5(NodeTestTask.java:139)
    	at org.junit.platform.engine.support.hierarchical.ThrowableCollector.execute(ThrowableCollector.java:73)
    	at org.junit.platform.engine.support.hierarchical.NodeTestTask.lambda$executeRecursively$7(NodeTestTask.java:125)
    	at org.junit.platform.engine.support.hierarchical.Node.around(Node.java:135)
    	at org.junit.platform.engine.support.hierarchical.NodeTestTask.lambda$executeRecursively$8(NodeTestTask.java:123)
    	at org.junit.platform.engine.support.hierarchical.ThrowableCollector.execute(ThrowableCollector.java:73)
    	at org.junit.platform.engine.support.hierarchical.NodeTestTask.executeRecursively(NodeTestTask.java:122)
    	at org.junit.platform.engine.support.hierarchical.NodeTestTask.execute(NodeTestTask.java:80)
    	at org.junit.platform.engine.support.hierarchical.ForkJoinPoolHierarchicalTestExecutorService$ExclusiveTask.compute(ForkJoinPoolHierarchicalTestExecutorService.java:171)
    	at java.util.concurrent.RecursiveAction.exec(RecursiveAction.java:189)
    	at java.util.concurrent.ForkJoinTask.doExec(ForkJoinTask.java:289)
    	at java.util.concurrent.ForkJoinPool$WorkQueue.runTask(ForkJoinPool.java:1056)
    	at java.util.concurrent.ForkJoinPool.runWorker(ForkJoinPool.java:1692)
    	at java.util.concurrent.ForkJoinWorkerThread.run(ForkJoinWorkerThread.java:157)
    	Suppressed: java.nio.file.DirectoryNotEmptyException: C:\Users\jenkins\AppData\Local\Temp\2\junit4877224876769494483
    		at sun.nio.fs.WindowsFileSystemProvider.implDelete(WindowsFileSystemProvider.java:266)
    		at sun.nio.fs.AbstractFileSystemProvider.delete(AbstractFileSystemProvider.java:103)
    		at java.nio.file.Files.delete(Files.java:1126)
    		at org.junit.jupiter.engine.extension.TempDirectory$CloseablePath$1.deleteAndContinue(TempDirectory.java:192)
    		at org.junit.jupiter.engine.extension.TempDirectory$CloseablePath$1.postVisitDirectory(TempDirectory.java:187)
    		at org.junit.jupiter.engine.extension.TempDirectory$CloseablePath$1.postVisitDirectory(TempDirectory.java:178)
    		at java.nio.file.Files.walkFileTree(Files.java:2688)
    		at java.nio.file.Files.walkFileTree(Files.java:2742)
    		at org.junit.jupiter.engine.extension.TempDirectory$CloseablePath.deleteAllFilesAndDirectories(TempDirectory.java:178)
    		at org.junit.jupiter.engine.extension.TempDirectory$CloseablePath.close(TempDirectory.java:166)
    		... 38 more
    	Suppressed: java.nio.file.AccessDeniedException: C:\Users\jenkins\AppData\Local\Temp\2\junit4877224876769494483\output.txt
    		at sun.nio.fs.WindowsException.translateToIOException(WindowsException.java:83)
    		at sun.nio.fs.WindowsException.rethrowAsIOException(WindowsException.java:97)
    		at sun.nio.fs.WindowsException.rethrowAsIOException(WindowsException.java:102)
    		at sun.nio.fs.WindowsFileSystemProvider.implDelete(WindowsFileSystemProvider.java:269)
    		at sun.nio.fs.AbstractFileSystemProvider.delete(AbstractFileSystemProvider.java:103)
    		at java.nio.file.Files.delete(Files.java:1126)
    		at org.junit.jupiter.engine.extension.TempDirectory$CloseablePath$1.deleteAndContinue(TempDirectory.java:192)
    		at org.junit.jupiter.engine.extension.TempDirectory$CloseablePath$1.visitFile(TempDirectory.java:182)
    		at org.junit.jupiter.engine.extension.TempDirectory$CloseablePath$1.visitFile(TempDirectory.java:178)
    		at java.nio.file.Files.walkFileTree(Files.java:2670)
    		at java.nio.file.Files.walkFileTree(Files.java:2742)
    		at org.junit.jupiter.engine.extension.TempDirectory$CloseablePath.deleteAllFilesAndDirectories(TempDirectory.java:178)
    		at org.junit.jupiter.engine.extension.TempDirectory$CloseablePath.close(TempDirectory.java:166)
    		... 38 more


org.apache.jmeter.functions.TestStringtoFile > testWriteToFileIOException(Path) FAILED
    java.io.IOException: Failed to delete temp directory C:\Users\jenkins\AppData\Local\Temp\2\junit4877224876769494483.
The following paths could not be deleted (see suppressed exceptions for details): , output.txt

> Task :src:dist-check:batchBatchTestLocal
summary +     10 in 00:00:00 =   31.2/s Avg:     3 Min:     1 Max:     7 Err:     0 (0.00%)
Active: 1 Started: 1 Finished: 0
summary +    122 in 00:00:06 =   21.4/s Avg:     5 Min:     0 Max:    81 Err:    16 (13.11%)
Active: 0 Started: 1 Finished: 1
summary =    132 in 00:00:06 =   22.0/s Avg:     5 Min:     0 Max:    81 Err:    16 (12.12%)
Tidying up ...    @ Sun Oct 06 15:06:05 PDT 2019 (1570399565694)
... end of run
No errors present in the logfile F:\jenkins\jenkins-slave\workspace\JMeter Windows\bin\BatchTestLocal.log
(the file is empty)

> Task :src:protocol:http:test

Gradle Test Executor 19 STANDARD_OUT
    Setting JMeterHome: F:\jenkins\jenkins-slave\workspace\JMeter Windows\src\protocol\http\..\..\..\.
    Initializing Properties: ../../.././bin/jmeter.properties

Gradle Test Executor 19 STANDARD_ERROR
    Oct 06, 2019 3:06:02 PM java.util.prefs.WindowsPreferences <init>
    WARNING: Could not open/create prefs root node Software\JavaSoft\Prefs at root 0x80000002.
Windows RegCreateKeyEx(...) returned error code 5.

Gradle Test Executor 19 STANDARD_OUT
    JMeterVersion=5.2-SNAPSHOT 94397b1
    java.version=1.8.0_152
    java.vm.name=Java HotSpot(TM) 64-Bit Server VM
    java.vendor=Oracle Corporation
    java.home=F:\jenkins\tools\java\latest1.8\jre
    file.encoding=windows-1252
    default encoding=windows-1252
    user.home=C:\Users\jenkins
    user.dir=F:\jenkins\jenkins-slave\workspace\JMeter Windows\src\protocol\http
    user.language=en
    user.region=null
    user.country=US
    user.variant=
    Locale=en_US
    java.class.version=52.0
    java.awt.headless=
    os.name=Windows Server 2016
    os.version=10.0
    os.arch=amd64

> Task :src:functions:test FAILED

263 tests completed, 1 failed, 5 skipped

> Task :src:dist-check:compileTestJava

> Task :src:dist:javadocAggregate
9 warnings
checksum-dependency elapsed time: 8861ms, configurations processed: 266 (add -PchecksumTimingsPrint
to print detailed timings)

FAILURE: Build failed with an exception.

* What went wrong:
Execution failed for task ':src:functions:test'.
> There were failing tests. See the report at: file:///F:/jenkins/jenkins-slave/workspace/JMeter%20Windows/src/functions/build/reports/tests/test/index.html

* Try:
Run with --stacktrace option to get the stack trace. Run with --info or --debug option to
get more log output. Run with --scan to get full insights.

* Get more help at https://help.gradle.org

Deprecated Gradle features were used in this build, making it incompatible with Gradle 6.0.
Use '--warning-mode all' to show the individual deprecation warnings.
See https://docs.gradle.org/5.6.2/userguide/command_line_interface.html#sec:command_line_warnings

BUILD FAILED in 3m 57s
263 actionable tasks: 150 executed, 113 up-to-date
Could not open/create prefs root node Software\JavaSoft\Prefs at root 0x80000002. Windows
RegCreateKeyEx(...) returned error code 5.
Build step 'Invoke Gradle script' changed build result to FAILURE
Build step 'Invoke Gradle script' marked build as failure

Mime
View raw message