jmeter-dev mailing list archives

Site index · List index
Message view « Date » · « Thread »
Top « Date » · « Thread »
From Apache Jenkins Server <jenk...@builds.apache.org>
Subject Build failed in Jenkins: JMeter-trunk #7484
Date Sun, 06 Oct 2019 21:08:17 GMT
See <https://builds.apache.org/job/JMeter-trunk/7484/display/redirect?page=changes>

Changes:

[pmouawad] Mention Graham in PR

[pmouawad] DigestEncodeFunction: Fix import order


------------------------------------------
[...truncated 174.90 KB...]
    org.spockframework.runtime.BaseSpecRunner#invokeRaw at line:484
    org.spockframework.runtime.BaseSpecRunner#invoke at line:467
    org.spockframework.runtime.BaseSpecRunner#runSpec at line:73
    org.spockframework.runtime.BaseSpecRunner#run at line:64
    org.spockframework.runtime.Sputnik#run at line:63
    org.junit.runner.JUnitCore#run at line:137
    org.junit.runner.JUnitCore#run at line:115
    org.junit.vintage.engine.execution.RunnerExecutor#execute at line:40
    org.junit.vintage.engine.VintageTestEngine$$Lambda$410/1386346488#accept
    java.util.stream.ForEachOps$ForEachOp$OfRef#accept at line:184
    java.util.stream.ReferencePipeline$3$1#accept at line:193
    java.util.Iterator#forEachRemaining at line:116
    java.util.Spliterators$IteratorSpliterator#forEachRemaining at line:1801
    java.util.stream.AbstractPipeline#copyInto at line:481
    java.util.stream.AbstractPipeline#wrapAndCopyInto at line:471
    java.util.stream.ForEachOps$ForEachOp#evaluateSequential at line:151
    java.util.stream.ForEachOps$ForEachOp$OfRef#evaluateSequential at line:174
    java.util.stream.AbstractPipeline#evaluate at line:234
    java.util.stream.ReferencePipeline#forEach at line:418
    org.junit.vintage.engine.VintageTestEngine#executeAllChildren at line:80
    org.junit.vintage.engine.VintageTestEngine#execute at line:71
    org.junit.platform.launcher.core.DefaultLauncher#execute at line:220
    org.junit.platform.launcher.core.DefaultLauncher#lambda$execute$6 at line:188
    org.junit.platform.launcher.core.DefaultLauncher$$Lambda$165/1061829687#accept
    org.junit.platform.launcher.core.DefaultLauncher#withInterceptedStreams at line:202
    org.junit.platform.launcher.core.DefaultLauncher#execute at line:181
    org.junit.platform.launcher.core.DefaultLauncher#execute at line:128
    org.gradle.api.internal.tasks.testing.junitplatform.JUnitPlatformTestClassProcessor$CollectAllTestClassesExecutor#processAllTestClasses
at line:102
    org.gradle.api.internal.tasks.testing.junitplatform.JUnitPlatformTestClassProcessor$CollectAllTestClassesExecutor#access$000
at line:82
    org.gradle.api.internal.tasks.testing.junitplatform.JUnitPlatformTestClassProcessor#stop
at line:78
    org.gradle.api.internal.tasks.testing.SuiteTestClassProcessor#stop at line:61
    sun.reflect.NativeMethodAccessorImpl#invoke0
    sun.reflect.NativeMethodAccessorImpl#invoke at line:62
    sun.reflect.DelegatingMethodAccessorImpl#invoke at line:43
    java.lang.reflect.Method#invoke at line:498
    org.gradle.internal.dispatch.ReflectionDispatch#dispatch at line:36
    org.gradle.internal.dispatch.ReflectionDispatch#dispatch at line:24
    org.gradle.internal.dispatch.ContextClassLoaderDispatch#dispatch at line:33
    org.gradle.internal.dispatch.ProxyDispatchAdapter$DispatchingInvocationHandler#invoke
at line:94
    com.sun.proxy.$Proxy2#stop
    org.gradle.api.internal.tasks.testing.worker.TestWorker#stop at line:132
    sun.reflect.NativeMethodAccessorImpl#invoke0
    sun.reflect.NativeMethodAccessorImpl#invoke at line:62
    sun.reflect.DelegatingMethodAccessorImpl#invoke at line:43
    java.lang.reflect.Method#invoke at line:498
    org.gradle.internal.dispatch.ReflectionDispatch#dispatch at line:36
    org.gradle.internal.dispatch.ReflectionDispatch#dispatch at line:24
    org.gradle.internal.remote.internal.hub.MessageHubBackedObjectConnection$DispatchWrapper#dispatch
at line:182
    org.gradle.internal.remote.internal.hub.MessageHubBackedObjectConnection$DispatchWrapper#dispatch
at line:164
    org.gradle.internal.remote.internal.hub.MessageHub$Handler#run at line:412
    org.gradle.internal.concurrent.ExecutorPolicy$CatchAndRecordFailures#onExecute at line:64
    org.gradle.internal.concurrent.ManagedExecutorImpl$1#run at line:48
    java.util.concurrent.ThreadPoolExecutor#runWorker at line:1149
    java.util.concurrent.ThreadPoolExecutor$Worker#run at line:624
    org.gradle.internal.concurrent.ThreadFactoryImpl$ManagedThreadRunnable#run at line:56
    java.lang.Thread#run at line:748

    Thread[/0:0:0:0:0:0:0:1:42116 to /0:0:0:0:0:0:0:1:39619 workers Thread 3,5,main], stackTrace:sun.nio.ch.EPollArrayWrapper#epollWait
    sun.nio.ch.EPollArrayWrapper#poll at line:269
    sun.nio.ch.EPollSelectorImpl#doSelect at line:93
    sun.nio.ch.SelectorImpl#lockAndDoSelect at line:86
    sun.nio.ch.SelectorImpl#select at line:97
    sun.nio.ch.SelectorImpl#select at line:101
    org.gradle.internal.remote.internal.inet.SocketConnection$SocketInputStream#read at line:182
    com.esotericsoftware.kryo.io.Input#fill at line:146
    com.esotericsoftware.kryo.io.Input#require at line:178
    com.esotericsoftware.kryo.io.Input#readByte at line:295
    org.gradle.internal.serialize.kryo.KryoBackedDecoder#readByte at line:81
    org.gradle.internal.remote.internal.hub.InterHubMessageSerializer$MessageReader#read at
line:64
    org.gradle.internal.remote.internal.hub.InterHubMessageSerializer$MessageReader#read at
line:52
    org.gradle.internal.remote.internal.inet.SocketConnection#receive at line:81
    org.gradle.internal.remote.internal.hub.MessageHub$ConnectionReceive#run at line:268
    org.gradle.internal.concurrent.ExecutorPolicy$CatchAndRecordFailures#onExecute at line:64
    org.gradle.internal.concurrent.ManagedExecutorImpl$1#run at line:48
    java.util.concurrent.ThreadPoolExecutor#runWorker at line:1149
    java.util.concurrent.ThreadPoolExecutor$Worker#run at line:624
    org.gradle.internal.concurrent.ThreadFactoryImpl$ManagedThreadRunnable#run at line:56
    java.lang.Thread#run at line:748

    Thread[AWT-Shutdown,5,system], stackTrace:java.lang.Object#wait
    sun.awt.AWTAutoShutdown#run at line:314
    java.lang.Thread#run at line:748

    Thread[main,5,main], stackTrace:sun.misc.Unsafe#park
    java.util.concurrent.locks.LockSupport#park at line:175
    java.util.concurrent.locks.AbstractQueuedSynchronizer#parkAndCheckInterrupt at line:836
    java.util.concurrent.locks.AbstractQueuedSynchronizer#doAcquireSharedInterruptibly at
line:997
    java.util.concurrent.locks.AbstractQueuedSynchronizer#acquireSharedInterruptibly at line:1304
    java.util.concurrent.CountDownLatch#await at line:231
    org.gradle.api.internal.tasks.testing.worker.TestWorker#execute at line:72
    org.gradle.api.internal.tasks.testing.worker.TestWorker#execute at line:46
    org.gradle.process.internal.worker.child.ActionExecutionWorker#execute at line:91
    org.gradle.process.internal.worker.child.ActionExecutionWorker#execute at line:34
    org.gradle.process.internal.worker.child.SystemApplicationClassLoaderWorker#call at line:133
    org.gradle.process.internal.worker.child.SystemApplicationClassLoaderWorker#call at line:70
    worker.org.gradle.process.internal.worker.GradleWorkerMain#run at line:68
    worker.org.gradle.process.internal.worker.GradleWorkerMain#main at line:73


> Task :src:examples:spotbugsMain
> Task :src:generator:spotbugsMain
checksum-dependency elapsed time: 14271ms, configurations processed: 344 (add -PchecksumTimingsPrint
to print detailed timings)

FAILURE: Build failed with an exception.

* What went wrong:
Execution failed for task ':src:functions:compileJava'.
> Compilation failed; see the compiler error output for details.

* Try:
Run with --info or --debug option to get more log output. Run with --scan to get full insights.

* Exception is:
org.gradle.api.tasks.TaskExecutionException: Execution failed for task ':src:functions:compileJava'.
	at org.gradle.api.internal.tasks.execution.ExecuteActionsTaskExecuter$3.accept(ExecuteActionsTaskExecuter.java:166)
	at org.gradle.api.internal.tasks.execution.ExecuteActionsTaskExecuter$3.accept(ExecuteActionsTaskExecuter.java:163)
	at org.gradle.internal.Try$Failure.ifSuccessfulOrElse(Try.java:191)
	at org.gradle.api.internal.tasks.execution.ExecuteActionsTaskExecuter.execute(ExecuteActionsTaskExecuter.java:156)
	at org.gradle.api.internal.tasks.execution.ValidatingTaskExecuter.execute(ValidatingTaskExecuter.java:62)
	at org.gradle.api.internal.tasks.execution.SkipEmptySourceFilesTaskExecuter.execute(SkipEmptySourceFilesTaskExecuter.java:108)
	at org.gradle.api.internal.tasks.execution.ResolveBeforeExecutionOutputsTaskExecuter.execute(ResolveBeforeExecutionOutputsTaskExecuter.java:67)
	at org.gradle.api.internal.tasks.execution.ResolveAfterPreviousExecutionStateTaskExecuter.execute(ResolveAfterPreviousExecutionStateTaskExecuter.java:46)
	at org.gradle.api.internal.tasks.execution.CleanupStaleOutputsExecuter.execute(CleanupStaleOutputsExecuter.java:94)
	at org.gradle.api.internal.tasks.execution.FinalizePropertiesTaskExecuter.execute(FinalizePropertiesTaskExecuter.java:46)
	at org.gradle.api.internal.tasks.execution.ResolveTaskExecutionModeExecuter.execute(ResolveTaskExecutionModeExecuter.java:95)
	at org.gradle.api.internal.tasks.execution.SkipTaskWithNoActionsExecuter.execute(SkipTaskWithNoActionsExecuter.java:57)
	at org.gradle.api.internal.tasks.execution.SkipOnlyIfTaskExecuter.execute(SkipOnlyIfTaskExecuter.java:56)
	at org.gradle.api.internal.tasks.execution.CatchExceptionTaskExecuter.execute(CatchExceptionTaskExecuter.java:36)
	at org.gradle.api.internal.tasks.execution.EventFiringTaskExecuter$1.executeTask(EventFiringTaskExecuter.java:77)
	at org.gradle.api.internal.tasks.execution.EventFiringTaskExecuter$1.call(EventFiringTaskExecuter.java:55)
	at org.gradle.api.internal.tasks.execution.EventFiringTaskExecuter$1.call(EventFiringTaskExecuter.java:52)
	at org.gradle.internal.operations.DefaultBuildOperationExecutor$CallableBuildOperationWorker.execute(DefaultBuildOperationExecutor.java:416)
	at org.gradle.internal.operations.DefaultBuildOperationExecutor$CallableBuildOperationWorker.execute(DefaultBuildOperationExecutor.java:406)
	at org.gradle.internal.operations.DefaultBuildOperationExecutor$1.execute(DefaultBuildOperationExecutor.java:165)
	at org.gradle.internal.operations.DefaultBuildOperationExecutor.execute(DefaultBuildOperationExecutor.java:250)
	at org.gradle.internal.operations.DefaultBuildOperationExecutor.execute(DefaultBuildOperationExecutor.java:158)
	at org.gradle.internal.operations.DefaultBuildOperationExecutor.call(DefaultBuildOperationExecutor.java:102)
	at org.gradle.internal.operations.DelegatingBuildOperationExecutor.call(DelegatingBuildOperationExecutor.java:36)
	at org.gradle.api.internal.tasks.execution.EventFiringTaskExecuter.execute(EventFiringTaskExecuter.java:52)
	at org.gradle.execution.plan.LocalTaskNodeExecutor.execute(LocalTaskNodeExecutor.java:43)
	at org.gradle.execution.taskgraph.DefaultTaskExecutionGraph$InvokeNodeExecutorsAction.execute(DefaultTaskExecutionGraph.java:355)
	at org.gradle.execution.taskgraph.DefaultTaskExecutionGraph$InvokeNodeExecutorsAction.execute(DefaultTaskExecutionGraph.java:343)
	at org.gradle.execution.taskgraph.DefaultTaskExecutionGraph$BuildOperationAwareExecutionAction.execute(DefaultTaskExecutionGraph.java:336)
	at org.gradle.execution.taskgraph.DefaultTaskExecutionGraph$BuildOperationAwareExecutionAction.execute(DefaultTaskExecutionGraph.java:322)
	at org.gradle.execution.plan.DefaultPlanExecutor$ExecutorWorker$1.execute(DefaultPlanExecutor.java:134)
	at org.gradle.execution.plan.DefaultPlanExecutor$ExecutorWorker$1.execute(DefaultPlanExecutor.java:129)
	at org.gradle.execution.plan.DefaultPlanExecutor$ExecutorWorker.execute(DefaultPlanExecutor.java:202)
	at org.gradle.execution.plan.DefaultPlanExecutor$ExecutorWorker.executeNextNode(DefaultPlanExecutor.java:193)
	at org.gradle.execution.plan.DefaultPlanExecutor$ExecutorWorker.run(DefaultPlanExecutor.java:129)
	at org.gradle.internal.concurrent.ExecutorPolicy$CatchAndRecordFailures.onExecute(ExecutorPolicy.java:64)
	at org.gradle.internal.concurrent.ManagedExecutorImpl$1.run(ManagedExecutorImpl.java:48)
	at org.gradle.internal.concurrent.ThreadFactoryImpl$ManagedThreadRunnable.run(ThreadFactoryImpl.java:56)
Caused by: org.gradle.api.internal.tasks.compile.CompilationFailedException: Compilation failed;
see the compiler error output for details.
	at org.gradle.api.internal.tasks.compile.JdkJavaCompiler.execute(JdkJavaCompiler.java:56)
	at org.gradle.api.internal.tasks.compile.JdkJavaCompiler.execute(JdkJavaCompiler.java:39)
	at org.gradle.api.internal.tasks.compile.NormalizingJavaCompiler.delegateAndHandleErrors(NormalizingJavaCompiler.java:100)
	at org.gradle.api.internal.tasks.compile.NormalizingJavaCompiler.execute(NormalizingJavaCompiler.java:52)
	at org.gradle.api.internal.tasks.compile.NormalizingJavaCompiler.execute(NormalizingJavaCompiler.java:38)
	at org.gradle.api.internal.tasks.compile.AnnotationProcessorDiscoveringCompiler.execute(AnnotationProcessorDiscoveringCompiler.java:51)
	at org.gradle.api.internal.tasks.compile.AnnotationProcessorDiscoveringCompiler.execute(AnnotationProcessorDiscoveringCompiler.java:37)
	at org.gradle.api.internal.tasks.compile.incremental.SelectiveCompiler.execute(SelectiveCompiler.java:81)
	at org.gradle.api.internal.tasks.compile.incremental.SelectiveCompiler.execute(SelectiveCompiler.java:36)
	at org.gradle.api.internal.tasks.compile.incremental.IncrementalResultStoringCompiler.execute(IncrementalResultStoringCompiler.java:60)
	at org.gradle.api.internal.tasks.compile.incremental.IncrementalResultStoringCompiler.execute(IncrementalResultStoringCompiler.java:44)
	at org.gradle.api.internal.tasks.compile.CompileJavaBuildOperationReportingCompiler$2.call(CompileJavaBuildOperationReportingCompiler.java:59)
	at org.gradle.api.internal.tasks.compile.CompileJavaBuildOperationReportingCompiler$2.call(CompileJavaBuildOperationReportingCompiler.java:51)
	at org.gradle.internal.operations.DefaultBuildOperationExecutor$CallableBuildOperationWorker.execute(DefaultBuildOperationExecutor.java:416)
	at org.gradle.internal.operations.DefaultBuildOperationExecutor$CallableBuildOperationWorker.execute(DefaultBuildOperationExecutor.java:406)
	at org.gradle.internal.operations.DefaultBuildOperationExecutor$1.execute(DefaultBuildOperationExecutor.java:165)
	at org.gradle.internal.operations.DefaultBuildOperationExecutor.execute(DefaultBuildOperationExecutor.java:250)
	at org.gradle.internal.operations.DefaultBuildOperationExecutor.execute(DefaultBuildOperationExecutor.java:158)
	at org.gradle.internal.operations.DefaultBuildOperationExecutor.call(DefaultBuildOperationExecutor.java:102)
	at org.gradle.internal.operations.DelegatingBuildOperationExecutor.call(DelegatingBuildOperationExecutor.java:36)
	at org.gradle.api.internal.tasks.compile.CompileJavaBuildOperationReportingCompiler.execute(CompileJavaBuildOperationReportingCompiler.java:51)
	at org.gradle.api.tasks.compile.JavaCompile.performCompilation(JavaCompile.java:158)
	at org.gradle.api.tasks.compile.JavaCompile.compile(JavaCompile.java:126)
	at org.gradle.internal.reflect.JavaMethod.invoke(JavaMethod.java:103)
	at org.gradle.api.internal.project.taskfactory.IncrementalTaskInputsTaskAction.doExecute(IncrementalTaskInputsTaskAction.java:47)
	at org.gradle.api.internal.project.taskfactory.StandardTaskAction.execute(StandardTaskAction.java:42)
	at org.gradle.api.internal.project.taskfactory.AbstractIncrementalTaskAction.execute(AbstractIncrementalTaskAction.java:25)
	at org.gradle.api.internal.project.taskfactory.StandardTaskAction.execute(StandardTaskAction.java:28)
	at org.gradle.api.internal.tasks.execution.ExecuteActionsTaskExecuter$5.run(ExecuteActionsTaskExecuter.java:476)
	at org.gradle.internal.operations.DefaultBuildOperationExecutor$RunnableBuildOperationWorker.execute(DefaultBuildOperationExecutor.java:402)
	at org.gradle.internal.operations.DefaultBuildOperationExecutor$RunnableBuildOperationWorker.execute(DefaultBuildOperationExecutor.java:394)
	at org.gradle.internal.operations.DefaultBuildOperationExecutor$1.execute(DefaultBuildOperationExecutor.java:165)
	at org.gradle.internal.operations.DefaultBuildOperationExecutor.execute(DefaultBuildOperationExecutor.java:250)
	at org.gradle.internal.operations.DefaultBuildOperationExecutor.execute(DefaultBuildOperationExecutor.java:158)
	at org.gradle.internal.operations.DefaultBuildOperationExecutor.run(DefaultBuildOperationExecutor.java:92)
	at org.gradle.internal.operations.DelegatingBuildOperationExecutor.run(DelegatingBuildOperationExecutor.java:31)
	at org.gradle.api.internal.tasks.execution.ExecuteActionsTaskExecuter.executeAction(ExecuteActionsTaskExecuter.java:461)
	at org.gradle.api.internal.tasks.execution.ExecuteActionsTaskExecuter.executeActions(ExecuteActionsTaskExecuter.java:444)
	at org.gradle.api.internal.tasks.execution.ExecuteActionsTaskExecuter.access$200(ExecuteActionsTaskExecuter.java:93)
	at org.gradle.api.internal.tasks.execution.ExecuteActionsTaskExecuter$TaskExecution.execute(ExecuteActionsTaskExecuter.java:237)
	at org.gradle.internal.execution.steps.ExecuteStep.lambda$execute$0(ExecuteStep.java:32)
	at org.gradle.internal.execution.steps.ExecuteStep.execute(ExecuteStep.java:32)
	at org.gradle.internal.execution.steps.ExecuteStep.execute(ExecuteStep.java:26)
	at org.gradle.internal.execution.steps.CleanupOutputsStep.execute(CleanupOutputsStep.java:58)
	at org.gradle.internal.execution.steps.CleanupOutputsStep.execute(CleanupOutputsStep.java:35)
	at org.gradle.internal.execution.steps.ResolveInputChangesStep.execute(ResolveInputChangesStep.java:48)
	at org.gradle.internal.execution.steps.ResolveInputChangesStep.execute(ResolveInputChangesStep.java:33)
	at org.gradle.internal.execution.steps.CancelExecutionStep.execute(CancelExecutionStep.java:39)
	at org.gradle.internal.execution.steps.TimeoutStep.executeWithoutTimeout(TimeoutStep.java:73)
	at org.gradle.internal.execution.steps.TimeoutStep.execute(TimeoutStep.java:54)
	at org.gradle.internal.execution.steps.CatchExceptionStep.execute(CatchExceptionStep.java:35)
	at org.gradle.internal.execution.steps.CreateOutputsStep.execute(CreateOutputsStep.java:51)
	at org.gradle.internal.execution.steps.SnapshotOutputsStep.execute(SnapshotOutputsStep.java:45)
	at org.gradle.internal.execution.steps.SnapshotOutputsStep.execute(SnapshotOutputsStep.java:31)
	at org.gradle.internal.execution.steps.CacheStep.executeWithoutCache(CacheStep.java:208)
	at org.gradle.internal.execution.steps.CacheStep.execute(CacheStep.java:70)
	at org.gradle.internal.execution.steps.CacheStep.execute(CacheStep.java:45)
	at org.gradle.internal.execution.steps.BroadcastChangingOutputsStep.execute(BroadcastChangingOutputsStep.java:49)
	at org.gradle.internal.execution.steps.StoreSnapshotsStep.execute(StoreSnapshotsStep.java:43)
	at org.gradle.internal.execution.steps.StoreSnapshotsStep.execute(StoreSnapshotsStep.java:32)
	at org.gradle.internal.execution.steps.RecordOutputsStep.execute(RecordOutputsStep.java:38)
	at org.gradle.internal.execution.steps.RecordOutputsStep.execute(RecordOutputsStep.java:24)
	at org.gradle.internal.execution.steps.SkipUpToDateStep.executeBecause(SkipUpToDateStep.java:96)
	at org.gradle.internal.execution.steps.SkipUpToDateStep.lambda$execute$0(SkipUpToDateStep.java:89)
	at org.gradle.internal.execution.steps.SkipUpToDateStep.execute(SkipUpToDateStep.java:54)
	at org.gradle.internal.execution.steps.SkipUpToDateStep.execute(SkipUpToDateStep.java:38)
	at org.gradle.internal.execution.steps.ResolveChangesStep.execute(ResolveChangesStep.java:76)
	at org.gradle.internal.execution.steps.ResolveChangesStep.execute(ResolveChangesStep.java:37)
	at org.gradle.internal.execution.steps.legacy.MarkSnapshottingInputsFinishedStep.execute(MarkSnapshottingInputsFinishedStep.java:36)
	at org.gradle.internal.execution.steps.legacy.MarkSnapshottingInputsFinishedStep.execute(MarkSnapshottingInputsFinishedStep.java:26)
	at org.gradle.internal.execution.steps.ResolveCachingStateStep.execute(ResolveCachingStateStep.java:90)
	at org.gradle.internal.execution.steps.ResolveCachingStateStep.execute(ResolveCachingStateStep.java:48)
	at org.gradle.internal.execution.steps.CaptureStateBeforeExecutionStep.execute(CaptureStateBeforeExecutionStep.java:69)
	at org.gradle.internal.execution.steps.CaptureStateBeforeExecutionStep.execute(CaptureStateBeforeExecutionStep.java:47)
	at org.gradle.internal.execution.impl.DefaultWorkExecutor.execute(DefaultWorkExecutor.java:33)
	at org.gradle.api.internal.tasks.execution.ExecuteActionsTaskExecuter.execute(ExecuteActionsTaskExecuter.java:140)
	... 34 more


* Get more help at https://help.gradle.org

Deprecated Gradle features were used in this build, making it incompatible with Gradle 6.0.
Use '--warning-mode all' to show the individual deprecation warnings.
See https://docs.gradle.org/5.6.2/userguide/command_line_interface.html#sec:command_line_warnings

BUILD FAILED in 3m 21s
300 actionable tasks: 185 executed, 115 up-to-date

See the profiling report at: file://<https://builds.apache.org/job/JMeter-trunk/ws/build/reports/profile/profile-2019-10-06-21-04-37.html>
A fine-grained performance profile is available: use the --scan option.
Build step 'Invoke Gradle script' changed build result to FAILURE
Build step 'Invoke Gradle script' marked build as failure
Xvfb stopping
Archiving artifacts
[Fast Archiver] Compressed 308.75 MB of artifacts by 95.2% relative to #7480
Recording test results

Mime
View raw message