jmeter-dev mailing list archives

Site index · List index
Message view « Date » · « Thread »
Top « Date » · « Thread »
From Apache Jenkins Server <jenk...@builds.apache.org>
Subject Build failed in Jenkins: JMeter-trunk #7468
Date Fri, 04 Oct 2019 09:13:31 GMT
See <https://builds.apache.org/job/JMeter-trunk/7468/display/redirect?page=changes>

Changes:

[sitnikov.vladimir] Suppress Convert2Lambda warning in MenuScrollTimer


------------------------------------------
[...truncated 212.83 KB...]
... end of run
No errors present in the logfile <https://builds.apache.org/job/JMeter-trunk/ws/bin/OS_TESTS.log>
(the file is empty)

> Task :src:dist-check:batchResponseDecompression
Creating summariser <summary>
Created the tree successfully using <https://builds.apache.org/job/JMeter-trunk/ws/bin/testfiles/ResponseDecompression.jmx>
Starting standalone test @ Fri Oct 04 09:11:48 UTC 2019 (1570180308983)
Waiting for possible Shutdown/StopTestNow/HeapDump/ThreadDump message on port 4445
summary =      2 in 00:00:02 =    1.2/s Avg:   435 Min:   312 Max:   559 Err:     0 (0.00%)
Tidying up ...    @ Fri Oct 04 09:11:51 UTC 2019 (1570180311282)
... end of run
No errors present in the logfile <https://builds.apache.org/job/JMeter-trunk/ws/bin/ResponseDecompression.log>
(the file is empty)
[server] Created remote object: UnicastServerRef2 [liveRef: [endpoint:[asf921.gq1.ygridcore.net:44737,SSLRMIServerSocketFactory(host=asf921.gq1.ygridcore.net/67.195.81.141,
keyStoreLocation=rmi_keystore.jks, type=JKS, trustStoreLocation=rmi_keystore.jks, type=JKS,
alias=rmi),SSLRMIClientSocketFactory(keyStoreLocation=rmi_keystore.jks, type=JKS, trustStoreLocation=rmi_keystore.jks,
type=JKS, alias=rmi)](local),objID:[5f81fd24:16d960a31d0:-7fff, 3977365804587298884]]][server]


> Task :src:dist-check:batchServerBatchTestLocal
Creating summariser <summary>
Created the tree successfully using <https://builds.apache.org/job/JMeter-trunk/ws/bin/testfiles/BatchTestLocal.jmx>
Configuring remote engine: asf921.gq1.ygridcore.net:37427
Starting distributed test with remote engines:[asf921.gq1.ygridcore.net:37427] @ Fri Oct 04
09:11:57 UTC 2019 (1570180317135)

[server] Starting the test on host asf921.gq1.ygridcore.net:37427 @ Fri Oct 04 09:12:00 UTC
2019 (1570180320465)

> Task :src:dist-check:batchServerBatchTestLocal
Remote engines have been started:{asf921.gq1.ygridcore.net:37427=ClientJMeterEngine [hostAndPort=asf921.gq1.ygridcore.net:37427]}
Waiting for possible Shutdown/StopTestNow/HeapDump/ThreadDump message on port 4445
summary +      1 in 00:00:00 =    7.5/s Avg:     3 Min:     3 Max:     3 Err:     0 (0.00%)
Active: 1 Started: 1 Finished: 0
summary +    131 in 00:00:07 =   18.2/s Avg:     4 Min:     1 Max:    98 Err:    16 (12.21%)
Active: 0 Started: 11 Finished: 11
summary =    132 in 00:00:07 =   18.0/s Avg:     4 Min:     1 Max:    98 Err:    16 (12.12%)
Tidying up remote @ Fri Oct 04 09:12:08 UTC 2019 (1570180328517)

[server] Finished the test on host asf921.gq1.ygridcore.net:37427 @ Fri Oct 04 09:12:08 UTC
2019 (1570180328517) - exit requested.

> Task :src:dist-check:batchServerBatchTestLocal
... end of run
No errors present in the logfile <https://builds.apache.org/job/JMeter-trunk/ws/bin/BatchTestLocal.log>
(the file is empty)
No errors present in the logfile <https://builds.apache.org/job/JMeter-trunk/ws/bin/BatchTestLocalServer.log>
(the file is empty)

> Task :src:dist-check:batchSlowCharsFeatureHttpClient4
Creating summariser <summary>
Created the tree successfully using <https://builds.apache.org/job/JMeter-trunk/ws/bin/testfiles/SlowCharsFeature.jmx>
Starting standalone test @ Fri Oct 04 09:12:16 UTC 2019 (1570180336136)
Waiting for possible Shutdown/StopTestNow/HeapDump/ThreadDump message on port 4445
summary =      5 in 00:00:32 =    0.2/s Avg:  6254 Min:   426 Max: 13855 Err:     0 (0.00%)
Tidying up ...    @ Fri Oct 04 09:12:48 UTC 2019 (1570180368292)
... end of run
No errors present in the logfile <https://builds.apache.org/job/JMeter-trunk/ws/bin/SlowCharsFeature.log>
(the file is empty)

> Task :src:dist-check:batchSlowCharsFeatureJava
Creating summariser <summary>
Created the tree successfully using <https://builds.apache.org/job/JMeter-trunk/ws/bin/testfiles/SlowCharsFeature.jmx>
Starting standalone test @ Fri Oct 04 09:12:51 UTC 2019 (1570180371042)
Waiting for possible Shutdown/StopTestNow/HeapDump/ThreadDump message on port 4445
summary +      3 in 00:00:10 =    0.3/s Avg:  3169 Min:   432 Max:  5798 Err:     1 (33.33%)
Active: 1 Started: 1 Finished: 0
summary +      1 in 00:00:06 =    0.2/s Avg:  5601 Min:  5601 Max:  5601 Err:     0 (0.00%)
Active: 0 Started: 1 Finished: 1
summary =      4 in 00:00:16 =    0.3/s Avg:  3777 Min:   432 Max:  5798 Err:     1 (25.00%)
Tidying up ...    @ Fri Oct 04 09:13:07 UTC 2019 (1570180387109)
... end of run
ERROR: unexpected output for SlowCharsFeature_Java.csv:
  - expected 327 bytes, <https://builds.apache.org/job/JMeter-trunk/ws/bin/testfiles/SlowCharsFeature_Java.csv>
  + actual 409 bytes, <https://builds.apache.org/job/JMeter-trunk/ws/bin/SlowCharsFeature_Java.csv>
@@ -1,5 +1,5 @@
 label,responseCode,responseMessage,threadName,dataType,success
 JSS_setCPS,200,OK,setUp Thread Group 1-1,text,true
-ApacheJMeter-HP-Secure,206,Partial Content,Thread Group 1-1,text,true
+ApacheJMeter-HP-Secure,Non HTTP response code: java.net.SocketTimeoutException,Non HTTP response
message: connect timed out,Thread Group 1-1,text,false
 HTTPS-SNI-without-timeout,206,Partial Content,Thread Group 1-1,text,true
 HTTPS-SNI-with-timeout,206,Partial Content,Thread Group 1-1,text,true
ERROR: unexpected output for SlowCharsFeature_Java.xml:
  - expected 2738 bytes, <https://builds.apache.org/job/JMeter-trunk/ws/bin/testfiles/SlowCharsFeature_Java.xml>
  + actual 3417 bytes, <https://builds.apache.org/job/JMeter-trunk/ws/bin/SlowCharsFeature_Java.xml>
@@ -1,31 +1,42 @@
 <?xml version="1.0" encoding="UTF-8"?>
 <testResults version="1.2">
 <sample s="true" lb="JSS_setCPS" rc="200" rm="OK" tn="setUp Thread Group 1-1" dt="text"/>
-<httpSample s="true" lb="ApacheJMeter-HP-Secure" rc="206" rm="Partial Content" tn="Thread
Group 1-1" dt="text">
+<httpSample s="false" lb="ApacheJMeter-HP-Secure" rc="Non HTTP response code: java.net.SocketTimeoutException"
rm="Non HTTP response message: connect timed out" tn="Thread Group 1-1" dt="text">
   <assertionResult>
     <name>JSA-CheckResponseTimeHigherThan5s</name>
-    <failure>false</failure>
+    <failure>true</failure>
     <error>false</error>
+    <failureMessage>Sampler should have taken more than 5 seconds</failureMessage>
   </assertionResult>
   <assertionResult>
     <name>RA_Size</name>
-    <failure>false</failure>
+    <failure>true</failure>
     <error>false</error>
+    <failureMessage>The result was the wrong size: It was 2,183 bytes, but should have
been equal to 7,001 bytes.</failureMessage>
   </assertionResult>
   <assertionResult>
     <name>RA_206</name>
-    <failure>false</failure>
+    <failure>true</failure>
     <error>false</error>
+    <failureMessage>Test failed: code expected to equal /
+
+****** received  : [[[Non HTTP response code: java.net.SocketTimeoutException]]]
+
+****** comparison: [[[206                                                    ]]]
+
+/</failureMessage>
   </assertionResult>
   <assertionResult>
     <name>RA_PartialContent</name>
-    <failure>false</failure>
+    <failure>true</failure>
     <error>false</error>
+    <failureMessage>Response was null</failureMessage>
   </assertionResult>
   <assertionResult>
     <name>RA</name>
-    <failure>false</failure>
+    <failure>true</failure>
     <error>false</error>
+    <failureMessage>Test failed: text expected to contain /Apache JMeter/</failureMessage>
   </assertionResult>
 </httpSample>
 <httpSample s="true" lb="HTTPS-SNI-without-timeout" rc="206" rm="Partial Content" tn="Thread
Group 1-1" dt="text">
No errors present in the logfile <https://builds.apache.org/job/JMeter-trunk/ws/bin/SlowCharsFeature.log>
(the file is empty)

> Task :src:dist-check:batchSlowCharsFeatureJava FAILED
checksum-dependency elapsed time: 15287ms, configurations processed: 757 (add -PchecksumTimingsPrint
to print detailed timings)

FAILURE: Build failed with an exception.

* What went wrong:
Execution failed for task ':src:dist-check:batchSlowCharsFeatureJava'.
> Failures detected while testing <https://builds.apache.org/job/JMeter-trunk/ws/bin/testfiles/SlowCharsFeature.jmx>:
[unexpected output SlowCharsFeature_Java.csv, unexpected output SlowCharsFeature_Java.xml]

* Try:
Run with --info or --debug option to get more log output. Run with --scan to get full insights.

* Exception is:
org.gradle.api.tasks.TaskExecutionException: Execution failed for task ':src:dist-check:batchSlowCharsFeatureJava'.
	at org.gradle.api.internal.tasks.execution.ExecuteActionsTaskExecuter$3.accept(ExecuteActionsTaskExecuter.java:166)
	at org.gradle.api.internal.tasks.execution.ExecuteActionsTaskExecuter$3.accept(ExecuteActionsTaskExecuter.java:163)
	at org.gradle.internal.Try$Failure.ifSuccessfulOrElse(Try.java:191)
	at org.gradle.api.internal.tasks.execution.ExecuteActionsTaskExecuter.execute(ExecuteActionsTaskExecuter.java:156)
	at org.gradle.api.internal.tasks.execution.ValidatingTaskExecuter.execute(ValidatingTaskExecuter.java:62)
	at org.gradle.api.internal.tasks.execution.SkipEmptySourceFilesTaskExecuter.execute(SkipEmptySourceFilesTaskExecuter.java:108)
	at org.gradle.api.internal.tasks.execution.ResolveBeforeExecutionOutputsTaskExecuter.execute(ResolveBeforeExecutionOutputsTaskExecuter.java:67)
	at org.gradle.api.internal.tasks.execution.ResolveAfterPreviousExecutionStateTaskExecuter.execute(ResolveAfterPreviousExecutionStateTaskExecuter.java:46)
	at org.gradle.api.internal.tasks.execution.CleanupStaleOutputsExecuter.execute(CleanupStaleOutputsExecuter.java:94)
	at org.gradle.api.internal.tasks.execution.FinalizePropertiesTaskExecuter.execute(FinalizePropertiesTaskExecuter.java:46)
	at org.gradle.api.internal.tasks.execution.ResolveTaskExecutionModeExecuter.execute(ResolveTaskExecutionModeExecuter.java:95)
	at org.gradle.api.internal.tasks.execution.SkipTaskWithNoActionsExecuter.execute(SkipTaskWithNoActionsExecuter.java:57)
	at org.gradle.api.internal.tasks.execution.SkipOnlyIfTaskExecuter.execute(SkipOnlyIfTaskExecuter.java:56)
	at org.gradle.api.internal.tasks.execution.CatchExceptionTaskExecuter.execute(CatchExceptionTaskExecuter.java:36)
	at org.gradle.api.internal.tasks.execution.EventFiringTaskExecuter$1.executeTask(EventFiringTaskExecuter.java:77)
	at org.gradle.api.internal.tasks.execution.EventFiringTaskExecuter$1.call(EventFiringTaskExecuter.java:55)
	at org.gradle.api.internal.tasks.execution.EventFiringTaskExecuter$1.call(EventFiringTaskExecuter.java:52)
	at org.gradle.internal.operations.DefaultBuildOperationExecutor$CallableBuildOperationWorker.execute(DefaultBuildOperationExecutor.java:416)
	at org.gradle.internal.operations.DefaultBuildOperationExecutor$CallableBuildOperationWorker.execute(DefaultBuildOperationExecutor.java:406)
	at org.gradle.internal.operations.DefaultBuildOperationExecutor$1.execute(DefaultBuildOperationExecutor.java:165)
	at org.gradle.internal.operations.DefaultBuildOperationExecutor.execute(DefaultBuildOperationExecutor.java:250)
	at org.gradle.internal.operations.DefaultBuildOperationExecutor.execute(DefaultBuildOperationExecutor.java:158)
	at org.gradle.internal.operations.DefaultBuildOperationExecutor.call(DefaultBuildOperationExecutor.java:102)
	at org.gradle.internal.operations.DelegatingBuildOperationExecutor.call(DelegatingBuildOperationExecutor.java:36)
	at org.gradle.api.internal.tasks.execution.EventFiringTaskExecuter.execute(EventFiringTaskExecuter.java:52)
	at org.gradle.execution.plan.LocalTaskNodeExecutor.execute(LocalTaskNodeExecutor.java:43)
	at org.gradle.execution.taskgraph.DefaultTaskExecutionGraph$InvokeNodeExecutorsAction.execute(DefaultTaskExecutionGraph.java:355)
	at org.gradle.execution.taskgraph.DefaultTaskExecutionGraph$InvokeNodeExecutorsAction.execute(DefaultTaskExecutionGraph.java:343)
	at org.gradle.execution.taskgraph.DefaultTaskExecutionGraph$BuildOperationAwareExecutionAction.execute(DefaultTaskExecutionGraph.java:336)
	at org.gradle.execution.taskgraph.DefaultTaskExecutionGraph$BuildOperationAwareExecutionAction.execute(DefaultTaskExecutionGraph.java:322)
	at org.gradle.execution.plan.DefaultPlanExecutor$ExecutorWorker$1.execute(DefaultPlanExecutor.java:134)
	at org.gradle.execution.plan.DefaultPlanExecutor$ExecutorWorker$1.execute(DefaultPlanExecutor.java:129)
	at org.gradle.execution.plan.DefaultPlanExecutor$ExecutorWorker.execute(DefaultPlanExecutor.java:202)
	at org.gradle.execution.plan.DefaultPlanExecutor$ExecutorWorker.executeNextNode(DefaultPlanExecutor.java:193)
	at org.gradle.execution.plan.DefaultPlanExecutor$ExecutorWorker.run(DefaultPlanExecutor.java:129)
	at org.gradle.internal.concurrent.ExecutorPolicy$CatchAndRecordFailures.onExecute(ExecutorPolicy.java:64)
	at org.gradle.internal.concurrent.ManagedExecutorImpl$1.run(ManagedExecutorImpl.java:48)
	at org.gradle.internal.concurrent.ThreadFactoryImpl$ManagedThreadRunnable.run(ThreadFactoryImpl.java:56)
Caused by: org.gradle.api.GradleException: Failures detected while testing <https://builds.apache.org/job/JMeter-trunk/ws/bin/testfiles/SlowCharsFeature.jmx>:
[unexpected output SlowCharsFeature_Java.csv, unexpected output SlowCharsFeature_Java.xml]
	at org.apache.jmeter.buildtools.batchtest.BatchTest.exec(BatchTest.kt:184)
	at org.gradle.internal.reflect.JavaMethod.invoke(JavaMethod.java:103)
	at org.gradle.api.internal.project.taskfactory.StandardTaskAction.doExecute(StandardTaskAction.java:49)
	at org.gradle.api.internal.project.taskfactory.StandardTaskAction.execute(StandardTaskAction.java:42)
	at org.gradle.api.internal.project.taskfactory.StandardTaskAction.execute(StandardTaskAction.java:28)
	at org.gradle.api.internal.AbstractTask$TaskActionWrapper.execute(AbstractTask.java:717)
	at org.gradle.api.internal.AbstractTask$TaskActionWrapper.execute(AbstractTask.java:684)
	at org.gradle.api.internal.tasks.execution.ExecuteActionsTaskExecuter$5.run(ExecuteActionsTaskExecuter.java:476)
	at org.gradle.internal.operations.DefaultBuildOperationExecutor$RunnableBuildOperationWorker.execute(DefaultBuildOperationExecutor.java:402)
	at org.gradle.internal.operations.DefaultBuildOperationExecutor$RunnableBuildOperationWorker.execute(DefaultBuildOperationExecutor.java:394)
	at org.gradle.internal.operations.DefaultBuildOperationExecutor$1.execute(DefaultBuildOperationExecutor.java:165)
	at org.gradle.internal.operations.DefaultBuildOperationExecutor.execute(DefaultBuildOperationExecutor.java:250)
	at org.gradle.internal.operations.DefaultBuildOperationExecutor.execute(DefaultBuildOperationExecutor.java:158)
	at org.gradle.internal.operations.DefaultBuildOperationExecutor.run(DefaultBuildOperationExecutor.java:92)
	at org.gradle.internal.operations.DelegatingBuildOperationExecutor.run(DelegatingBuildOperationExecutor.java:31)
	at org.gradle.api.internal.tasks.execution.ExecuteActionsTaskExecuter.executeAction(ExecuteActionsTaskExecuter.java:461)
	at org.gradle.api.internal.tasks.execution.ExecuteActionsTaskExecuter.executeActions(ExecuteActionsTaskExecuter.java:444)
	at org.gradle.api.internal.tasks.execution.ExecuteActionsTaskExecuter.access$200(ExecuteActionsTaskExecuter.java:93)
	at org.gradle.api.internal.tasks.execution.ExecuteActionsTaskExecuter$TaskExecution.execute(ExecuteActionsTaskExecuter.java:237)
	at org.gradle.internal.execution.steps.ExecuteStep.lambda$execute$1(ExecuteStep.java:33)
	at org.gradle.internal.execution.steps.ExecuteStep.execute(ExecuteStep.java:33)
	at org.gradle.internal.execution.steps.ExecuteStep.execute(ExecuteStep.java:26)
	at org.gradle.internal.execution.steps.CleanupOutputsStep.execute(CleanupOutputsStep.java:58)
	at org.gradle.internal.execution.steps.CleanupOutputsStep.execute(CleanupOutputsStep.java:35)
	at org.gradle.internal.execution.steps.ResolveInputChangesStep.execute(ResolveInputChangesStep.java:48)
	at org.gradle.internal.execution.steps.ResolveInputChangesStep.execute(ResolveInputChangesStep.java:33)
	at org.gradle.internal.execution.steps.CancelExecutionStep.execute(CancelExecutionStep.java:39)
	at org.gradle.internal.execution.steps.TimeoutStep.executeWithoutTimeout(TimeoutStep.java:73)
	at org.gradle.internal.execution.steps.TimeoutStep.execute(TimeoutStep.java:54)
	at org.gradle.internal.execution.steps.CatchExceptionStep.execute(CatchExceptionStep.java:35)
	at org.gradle.internal.execution.steps.CreateOutputsStep.execute(CreateOutputsStep.java:51)
	at org.gradle.internal.execution.steps.SnapshotOutputsStep.execute(SnapshotOutputsStep.java:45)
	at org.gradle.internal.execution.steps.SnapshotOutputsStep.execute(SnapshotOutputsStep.java:31)
	at org.gradle.internal.execution.steps.CacheStep.executeWithoutCache(CacheStep.java:208)
	at org.gradle.internal.execution.steps.CacheStep.execute(CacheStep.java:70)
	at org.gradle.internal.execution.steps.CacheStep.execute(CacheStep.java:45)
	at org.gradle.internal.execution.steps.BroadcastChangingOutputsStep.execute(BroadcastChangingOutputsStep.java:49)
	at org.gradle.internal.execution.steps.StoreSnapshotsStep.execute(StoreSnapshotsStep.java:43)
	at org.gradle.internal.execution.steps.StoreSnapshotsStep.execute(StoreSnapshotsStep.java:32)
	at org.gradle.internal.execution.steps.RecordOutputsStep.execute(RecordOutputsStep.java:38)
	at org.gradle.internal.execution.steps.RecordOutputsStep.execute(RecordOutputsStep.java:24)
	at org.gradle.internal.execution.steps.SkipUpToDateStep.executeBecause(SkipUpToDateStep.java:96)
	at org.gradle.internal.execution.steps.SkipUpToDateStep.lambda$execute$0(SkipUpToDateStep.java:89)
	at org.gradle.internal.execution.steps.SkipUpToDateStep.execute(SkipUpToDateStep.java:54)
	at org.gradle.internal.execution.steps.SkipUpToDateStep.execute(SkipUpToDateStep.java:38)
	at org.gradle.internal.execution.steps.ResolveChangesStep.execute(ResolveChangesStep.java:76)
	at org.gradle.internal.execution.steps.ResolveChangesStep.execute(ResolveChangesStep.java:37)
	at org.gradle.internal.execution.steps.legacy.MarkSnapshottingInputsFinishedStep.execute(MarkSnapshottingInputsFinishedStep.java:36)
	at org.gradle.internal.execution.steps.legacy.MarkSnapshottingInputsFinishedStep.execute(MarkSnapshottingInputsFinishedStep.java:26)
	at org.gradle.internal.execution.steps.ResolveCachingStateStep.execute(ResolveCachingStateStep.java:90)
	at org.gradle.internal.execution.steps.ResolveCachingStateStep.execute(ResolveCachingStateStep.java:48)
	at org.gradle.internal.execution.steps.CaptureStateBeforeExecutionStep.execute(CaptureStateBeforeExecutionStep.java:69)
	at org.gradle.internal.execution.steps.CaptureStateBeforeExecutionStep.execute(CaptureStateBeforeExecutionStep.java:47)
	at org.gradle.internal.execution.impl.DefaultWorkExecutor.execute(DefaultWorkExecutor.java:33)
	at org.gradle.api.internal.tasks.execution.ExecuteActionsTaskExecuter.execute(ExecuteActionsTaskExecuter.java:140)
	... 34 more


* Get more help at https://help.gradle.org

Deprecated Gradle features were used in this build, making it incompatible with Gradle 6.0.
Use '--warning-mode all' to show the individual deprecation warnings.
See https://docs.gradle.org/5.6.2/userguide/command_line_interface.html#sec:command_line_warnings

BUILD FAILED in 7m 14s
358 actionable tasks: 268 executed, 90 up-to-date

See the profiling report at: file://<https://builds.apache.org/job/JMeter-trunk/ws/build/reports/profile/profile-2019-10-04-09-05-56.html>
A fine-grained performance profile is available: use the --scan option.
Build step 'Invoke Gradle script' changed build result to FAILURE
Build step 'Invoke Gradle script' marked build as failure
Xvfb stopping
Archiving artifacts
[Fast Archiver] Compressed 153.77 MB of artifacts by 79.8% relative to #7467
Recording test results

Mime
View raw message