jmeter-dev mailing list archives

Site index · List index
Message view « Date » · « Thread »
Top « Date » · « Thread »
From Apache Jenkins Server <jenk...@builds.apache.org>
Subject Build failed in Jenkins: JMeter Windows #1528
Date Sun, 06 Oct 2019 20:18:55 GMT
See <https://builds.apache.org/job/JMeter%20Windows/1528/display/redirect?page=changes>

Changes:

[Milamber] Remove my GPG key id, use ~/gradle.properties file to declare my key id.

[pmouawad] Thread Group UI: add missing semicolon to duration and delay as it is

[pmouawad] Normalize jmespath element names

[pmouawad] BasicCurlParser sonar fixes (#527)

[pmouawad] JmeterKeyStore: Improve readability and add spock test (#505)

[pmouawad] DigestEncodeFunction: Reduce code complexity (#516)


------------------------------------------
[...truncated 33.83 KB...]
> Task :src:protocol:jdbc:processResources UP-TO-DATE
> Task :src:protocol:ldap:processResources NO-SOURCE
> Task :src:protocol:mail:processResources UP-TO-DATE
> Task :src:protocol:ldap:processTestResources NO-SOURCE
> Task :src:protocol:jdbc:processTestResources NO-SOURCE
> Task :src:protocol:mail:processTestResources NO-SOURCE
> Task :src:protocol:native:processResources NO-SOURCE
> Task :src:protocol:http:processTestResources UP-TO-DATE
> Task :src:protocol:native:processTestResources NO-SOURCE
> Task :src:protocol:mongodb:processResources UP-TO-DATE
> Task :src:protocol:tcp:processResources NO-SOURCE
> Task :src:dist:processTestResources NO-SOURCE
> Task :src:generator:processResources NO-SOURCE
> Task :src:protocol:junit-sample:processResources NO-SOURCE
> Task :src:protocol:tcp:processTestResources NO-SOURCE
> Task :src:protocol:mongodb:processTestResources NO-SOURCE
> Task :src:dist-check:spotlessGroovy
> Task :src:dist-check:spotlessGroovyCheck
> Task :src:functions:spotlessGroovy
> Task :src:functions:spotlessGroovyCheck
> Task :src:generator:spotlessJava
> Task :src:generator:spotlessJavaCheck
> Task :src:generator:spotlessKotlinGradle
> Task :src:generator:spotlessKotlinGradleCheck
> Task :src:generator:spotlessCheck
> Task :src:generator:processTestResources NO-SOURCE
> Task :src:jorphan:spotlessGroovy
> Task :src:jorphan:spotlessGroovyCheck
> Task :src:dist-check:spotlessJava
> Task :src:dist-check:spotlessJavaCheck
> Task :src:examples:spotlessJava
> Task :src:examples:spotlessJavaCheck
> Task :src:core:processResources
> Task :src:examples:spotlessKotlinGradle
> Task :src:examples:spotlessKotlinGradleCheck
> Task :src:examples:spotlessCheck
> Task :src:dist-check:spotlessKotlinGradle
> Task :src:dist-check:spotlessKotlinGradleCheck
> Task :src:dist-check:spotlessCheck
> Task :src:dist-check:processResources NO-SOURCE
> Task :src:dist-check:processTestResources UP-TO-DATE
> Task :src:examples:processResources UP-TO-DATE
> Task :src:examples:processTestResources NO-SOURCE
> Task :src:bshclient:checkstyleMain UP-TO-DATE
> Task :src:bshclient:compileTestJava NO-SOURCE
> Task :src:bshclient:processTestResources NO-SOURCE
> Task :src:bshclient:testClasses UP-TO-DATE
> Task :src:bshclient:checkstyleTest NO-SOURCE
> Task :src:bshclient:spotbugsMain SKIPPED
> Task :src:bshclient:spotbugsTest SKIPPED
> Task :src:bshclient:test NO-SOURCE
> Task :src:bshclient:check
> Task :src:bshclient:jar UP-TO-DATE
> Task :src:launcher:spotlessJava
> Task :src:launcher:spotlessJavaCheck
> Task :src:licenses:spotlessJava
> Task :src:licenses:spotlessJavaCheck
> Task :src:launcher:spotlessKotlinGradle
> Task :src:launcher:spotlessKotlinGradleCheck
> Task :src:launcher:spotlessCheck
> Task :src:licenses:spotlessKotlinGradle
> Task :src:licenses:spotlessKotlinGradleCheck
> Task :src:licenses:spotlessCheck
> Task :src:licenses:compileJava NO-SOURCE
> Task :src:licenses:processResources NO-SOURCE
> Task :src:licenses:classes UP-TO-DATE
> Task :src:licenses:checkstyleMain NO-SOURCE
> Task :src:licenses:compileTestJava NO-SOURCE
> Task :src:licenses:processTestResources NO-SOURCE
> Task :src:licenses:testClasses UP-TO-DATE
> Task :src:licenses:checkstyleTest NO-SOURCE
> Task :src:licenses:spotbugsMain SKIPPED
> Task :src:licenses:spotbugsTest SKIPPED
> Task :src:launcher:checkstyleMain UP-TO-DATE
> Task :src:licenses:test NO-SOURCE
> Task :src:licenses:check
> Task :src:launcher:compileTestJava NO-SOURCE
> Task :src:launcher:processTestResources NO-SOURCE
> Task :src:launcher:testClasses UP-TO-DATE
> Task :src:launcher:checkstyleTest NO-SOURCE
> Task :src:launcher:spotbugsMain SKIPPED
> Task :src:launcher:spotbugsTest SKIPPED
> Task :src:protocol:spotlessJava
> Task :src:protocol:spotlessJavaCheck
> Task :src:launcher:test NO-SOURCE
> Task :src:launcher:check
> Task :src:release:spotlessJava
> Task :src:release:spotlessJavaCheck
> Task :src:protocol:spotlessKotlinGradle
> Task :src:protocol:spotlessKotlinGradleCheck
> Task :src:protocol:spotlessCheck
> Task :src:release:spotlessKotlinGradle
> Task :src:release:spotlessKotlinGradleCheck
> Task :src:release:spotlessCheck
> Task :src:release:compileJava NO-SOURCE
> Task :src:protocol:compileJava NO-SOURCE
> Task :src:release:processResources NO-SOURCE
> Task :src:release:classes UP-TO-DATE
> Task :src:release:checkstyleMain NO-SOURCE
> Task :src:protocol:processResources NO-SOURCE
> Task :src:release:compileTestJava NO-SOURCE
> Task :src:protocol:classes UP-TO-DATE
> Task :src:release:processTestResources NO-SOURCE
> Task :src:release:testClasses UP-TO-DATE
> Task :src:release:checkstyleTest NO-SOURCE
> Task :src:release:spotbugsMain SKIPPED
> Task :src:release:spotbugsTest SKIPPED
> Task :src:protocol:checkstyleMain NO-SOURCE
> Task :src:release:test NO-SOURCE
> Task :src:protocol:compileTestJava NO-SOURCE
> Task :src:release:check
> Task :src:protocol:processTestResources NO-SOURCE
> Task :src:protocol:testClasses UP-TO-DATE
> Task :src:protocol:checkstyleTest NO-SOURCE
> Task :src:protocol:spotbugsMain SKIPPED
> Task :src:protocol:spotbugsTest SKIPPED
> Task :src:protocol:test NO-SOURCE
> Task :src:protocol:check
> Task :src:testkit:spotlessJava
> Task :src:testkit:spotlessJavaCheck
> Task :src:testkit-wiremock:spotlessJava
> Task :src:testkit-wiremock:spotlessJavaCheck
> Task :src:testkit:spotlessKotlinGradle
> Task :src:testkit:spotlessKotlinGradleCheck
> Task :src:testkit:spotlessCheck
> Task :src:testkit:checkstyleMain UP-TO-DATE
> Task :src:testkit:compileTestJava NO-SOURCE
> Task :src:testkit-wiremock:spotlessKotlinGradle
> Task :src:testkit-wiremock:spotlessKotlinGradleCheck
> Task :src:testkit-wiremock:spotlessCheck
> Task :src:testkit:processTestResources NO-SOURCE
> Task :src:testkit:testClasses UP-TO-DATE
> Task :src:testkit:checkstyleTest NO-SOURCE
> Task :src:testkit:checkstyleTestFixtures NO-SOURCE
> Task :src:testkit:spotbugsMain SKIPPED
> Task :src:testkit:spotbugsTest SKIPPED
> Task :src:testkit:spotbugsTestFixtures SKIPPED
> Task :src:testkit:test NO-SOURCE
> Task :src:testkit:check
> Task :src:protocol:bolt:spotlessGroovy
> Task :src:protocol:bolt:spotlessGroovyCheck
> Task :src:testkit-wiremock:checkstyleMain UP-TO-DATE
> Task :src:testkit-wiremock:compileTestJava NO-SOURCE
> Task :src:testkit-wiremock:processTestResources NO-SOURCE
> Task :src:testkit-wiremock:testClasses UP-TO-DATE
> Task :src:testkit-wiremock:checkstyleTest NO-SOURCE
> Task :src:testkit-wiremock:checkstyleTestFixtures NO-SOURCE
> Task :src:testkit-wiremock:spotbugsMain SKIPPED
> Task :src:testkit-wiremock:spotbugsTest SKIPPED
> Task :src:testkit-wiremock:spotbugsTestFixtures SKIPPED
> Task :src:testkit-wiremock:test NO-SOURCE
> Task :src:testkit-wiremock:check
> Task :src:protocol:ftp:spotlessJava
> Task :src:protocol:ftp:spotlessJavaCheck
> Task :src:protocol:bolt:spotlessJava
> Task :src:protocol:bolt:spotlessJavaCheck
> Task :src:protocol:ftp:spotlessKotlinGradle
> Task :src:protocol:ftp:spotlessKotlinGradleCheck
> Task :src:protocol:ftp:spotlessCheck
> Task :src:dist-check:populateLibs
> Task :src:protocol:bolt:spotlessKotlinGradle
> Task :src:protocol:bolt:spotlessKotlinGradleCheck
> Task :src:protocol:bolt:spotlessCheck
> Task :src:protocol:http:spotlessGroovy
> Task :src:protocol:http:spotlessGroovyCheck
> Task :src:protocol:jdbc:spotlessGroovy
> Task :src:protocol:jdbc:spotlessGroovyCheck
> Task :spotlessMarkdown
> Task :spotlessMarkdownCheck
> Task :spotlessCheck
> Task :compileJava NO-SOURCE
> Task :processResources NO-SOURCE
> Task :classes UP-TO-DATE
> Task :checkstyleMain NO-SOURCE
> Task :compileTestJava NO-SOURCE
> Task :processTestResources NO-SOURCE
> Task :testClasses UP-TO-DATE
> Task :checkstyleTest NO-SOURCE
> Task :src:jorphan:spotlessJava
> Task :src:jorphan:spotlessJavaCheck
> Task :src:jorphan:spotlessKotlinGradle
> Task :src:jorphan:spotlessKotlinGradleCheck
> Task :src:jorphan:spotlessCheck
> Task :src:protocol:jdbc:spotlessJava
> Task :src:protocol:jdbc:spotlessJavaCheck
> Task :src:protocol:java:spotlessJava
> Task :src:protocol:java:spotlessJavaCheck
> Task :src:protocol:jdbc:spotlessKotlinGradle
> Task :src:protocol:jdbc:spotlessKotlinGradleCheck
> Task :src:protocol:jdbc:spotlessCheck
> Task :src:jorphan:checkstyleMain UP-TO-DATE
> Task :src:jorphan:checkstyleTest UP-TO-DATE
> Task :src:jorphan:spotbugsMain SKIPPED
> Task :src:jorphan:spotbugsTest SKIPPED
> Task :src:protocol:java:spotlessKotlinGradle
> Task :src:protocol:java:spotlessKotlinGradleCheck
> Task :src:protocol:java:spotlessCheck
> Task :src:functions:spotlessJava FAILED
> Task :gitProps
> Task :src:protocol:junit:spotlessJava
> Task :src:jorphan:test UP-TO-DATE
> Task :src:protocol:jms:spotlessJava
> Task :src:components:spotlessJava
> Task :src:protocol:http:spotlessJava

> Task :src:core:compileJava
Note: Some input files use or override a deprecated API.
Note: Recompile with -Xlint:deprecation for details.
Note: F:\jenkins\jenkins-slave\workspace\JMeter Windows\src\core\src\main\java\org\apache\jmeter\save\converters\TestElementPropertyConverter.java
uses unchecked or unsafe operations.
Note: Recompile with -Xlint:unchecked for details.
checksum-dependency elapsed time: 12537ms, configurations processed: 111 (add -PchecksumTimingsPrint
to print detailed timings)

FAILURE: Build failed with an exception.

* What went wrong:
Execution failed for task ':src:functions:spotlessJava'.
> The following files had format violations:
      src\functions\src\main\java\org\apache\jmeter\functions\DigestEncodeFunction.java
          @@ -19,6 +19,7 @@
           package·org.apache.jmeter.functions;
           
           import·java.io.UnsupportedEncodingException;
          +import·java.nio.charset.StandardCharsets;
           import·java.security.MessageDigest;
           import·java.security.NoSuchAlgorithmException;
           import·java.util.Collection;
          @@ -33,7 +34,6 @@
           import·org.apache.jmeter.util.JMeterUtils;
           import·org.slf4j.Logger;
           import·org.slf4j.LoggerFactory;
          -import·java.nio.charset.StandardCharsets;
           
           /**
           ·*·Digest·Encode·Function·that·provides·computing·of·different·SHA-XXX,·can
  Run 'gradlew spotlessApply' to fix these violations.

* Try:
Run with --stacktrace option to get the stack trace. Run with --info or --debug option to
get more log output. Run with --scan to get full insights.

* Get more help at https://help.gradle.org

Deprecated Gradle features were used in this build, making it incompatible with Gradle 6.0.
Use '--warning-mode all' to show the individual deprecation warnings.
See https://docs.gradle.org/5.6.2/userguide/command_line_interface.html#sec:command_line_warnings

BUILD FAILED in 1m 24s
91 actionable tasks: 56 executed, 35 up-to-date
Build step 'Invoke Gradle script' changed build result to FAILURE
Build step 'Invoke Gradle script' marked build as failure

Mime
View raw message