jmeter-dev mailing list archives

Site index · List index
Message view « Date » · « Thread »
Top « Date » · « Thread »
From Apache Jenkins Server <jenk...@builds.apache.org>
Subject Build failed in Jenkins: JMeter Windows #1556
Date Sat, 26 Oct 2019 12:15:32 GMT
See <https://builds.apache.org/job/JMeter%20Windows/1556/display/redirect?page=changes>

Changes:

[pmouawad] proxy.number.requests property : update documentation

[felix.schumacher] Update com.github.vlsi.gradle to 1.36.0

[felix.schumacher] Add more links to gradle.md and CONTRIBUTING.md

[felix.schumacher] Add a link to the gradle.md file on github

[felix.schumacher] Spacepolice

[felix.schumacher] It's JMeter with a capital M


------------------------------------------
[...truncated 166.58 KB...]
    Ignoring missing junit_error_default_code=9999 in org/apache/jmeter/resources/messages_fr.properties
    Ignoring missing junit_success_default_code=1000 in org/apache/jmeter/resources/messages_fr.properties

> Task :src:core:check
> Task :src:core:assemble

> Task :src:components:test

Gradle Test Executor 16 STANDARD_OUT
    Setting JMeterHome: F:\jenkins\jenkins-slave\workspace\JMeter Windows\src\components\..\..\.
    Initializing Properties: ../.././bin/jmeter.properties

Gradle Test Executor 16 STANDARD_ERROR
    Oct 26, 2019 5:12:52 AM java.util.prefs.WindowsPreferences <init>
    WARNING: Could not open/create prefs root node Software\JavaSoft\Prefs at root 0x80000002.
Windows RegCreateKeyEx(...) returned error code 5.

Gradle Test Executor 16 STANDARD_OUT
    JMeterVersion=5.2-SNAPSHOT 5bd4650
    java.version=1.8.0_152
    java.vm.name=Java HotSpot(TM) 64-Bit Server VM
    java.vendor=Oracle Corporation
    java.home=F:\jenkins\tools\java\latest1.8\jre
    file.encoding=windows-1252
    default encoding=windows-1252
    user.home=C:\Users\jenkins
    user.dir=F:\jenkins\jenkins-slave\workspace\JMeter Windows\src\components
    user.language=en
    user.region=null
    user.country=US
    user.variant=
    Locale=en_US
    java.class.version=52.0
    java.awt.headless=null
    os.name=Windows Server 2016
    os.version=10.0
    os.arch=amd64

org.apache.jmeter.control.TestIfController > testProcessing(): SKIPPED

> Task :src:components:check
> Task :src:components:jar
> Task :src:examples:spotbugsMain SKIPPED
> Task :src:generator:spotbugsMain SKIPPED
> Task :src:examples:spotbugsTest SKIPPED
> Task :src:generator:spotbugsTest SKIPPED
> Task :src:generator:test NO-SOURCE
> Task :src:generator:check
> Task :src:examples:test NO-SOURCE
> Task :src:examples:check
> Task :src:components:testJar
> Task :src:components:assemble

> Task :src:functions:compileJava
Note: F:\jenkins\jenkins-slave\workspace\JMeter Windows\src\functions\src\main\java\org\apache\jmeter\functions\StringFromFile.java
uses or overrides a deprecated API.
Note: Recompile with -Xlint:deprecation for details.

> Task :src:functions:compileGroovy NO-SOURCE
> Task :src:functions:classes
> Task :src:functions:jar
> Task :src:functions:compileTestJava
> Task :src:functions:compileTestGroovy
> Task :src:functions:testClasses
> Task :src:functions:testJar
> Task :src:functions:checkstyleMain

> Task :src:protocol:http:compileJava
Note: Some input files use or override a deprecated API.
Note: Recompile with -Xlint:deprecation for details.
Note: F:\jenkins\jenkins-slave\workspace\JMeter Windows\src\protocol\http\src\main\java\org\apache\jmeter\protocol\http\sampler\HTTPHC4Impl.java
uses unchecked or unsafe operations.
Note: Recompile with -Xlint:unchecked for details.

> Task :src:protocol:http:compileGroovy NO-SOURCE
> Task :src:protocol:http:classes
> Task :src:dist:compileJava NO-SOURCE
> Task :src:dist:classes UP-TO-DATE
> Task :src:dist:checkstyleMain NO-SOURCE
> Task :src:dist:jar
> Task :src:functions:checkstyleTest
> Task :src:functions:spotbugsMain SKIPPED
> Task :src:functions:spotbugsTest SKIPPED
> Task :src:protocol:http:jar
> Task :src:dist-check:compileJava NO-SOURCE
> Task :src:dist-check:compileGroovy NO-SOURCE
> Task :src:dist-check:classes UP-TO-DATE
> Task :src:dist-check:checkstyleMain NO-SOURCE
> Task :src:dist-check:spotbugsMain SKIPPED
> Task :src:dist-check:jar
> Task :src:dist-check:assemble

> Task :src:protocol:http:compileTestJava
Note: Some input files use or override a deprecated API.
Note: Recompile with -Xlint:deprecation for details.

> Task :src:protocol:http:compileTestGroovy
> Task :src:protocol:http:testClasses
> Task :src:protocol:http:testJar
> Task :src:licenses:gatherBinaryLicenses
> Task :src:licenses:renderLicenseForBinary
> Task :src:licenses:renderLicenseForBinaryCopySpec

> Task :src:functions:test

Gradle Test Executor 17 STANDARD_OUT
    Setting JMeterHome: F:\jenkins\jenkins-slave\workspace\JMeter Windows\src\functions\..\..\.
    Initializing Properties: ../.././bin/jmeter.properties

Gradle Test Executor 17 STANDARD_ERROR
    Oct 26, 2019 5:13:24 AM java.util.prefs.WindowsPreferences <init>
    WARNING: Could not open/create prefs root node Software\JavaSoft\Prefs at root 0x80000002.
Windows RegCreateKeyEx(...) returned error code 5.

Gradle Test Executor 17 STANDARD_OUT
    JMeterVersion=5.2-SNAPSHOT 5bd4650
    java.version=1.8.0_152
    java.vm.name=Java HotSpot(TM) 64-Bit Server VM
    java.vendor=Oracle Corporation
    java.home=F:\jenkins\tools\java\latest1.8\jre
    file.encoding=windows-1252
    default encoding=windows-1252
    user.home=C:\Users\jenkins
    user.dir=F:\jenkins\jenkins-slave\workspace\JMeter Windows\src\functions
    user.language=en
    user.region=null
    user.country=US
    user.variant=
    Locale=en_US
    java.class.version=52.0
    java.awt.headless=null
    os.name=Windows Server 2016
    os.version=10.0
    os.arch=amd64

> Task :src:protocol:http:checkstyleMain
> Task :src:licenses:binLicenseDir
> Task :src:licenses:assemble
> Task :src:dist-check:compileTestJava
> Task :src:protocol:http:checkstyleTest
> Task :src:protocol:http:spotbugsMain SKIPPED
> Task :src:protocol:http:spotbugsTest SKIPPED
> Task :src:dist-check:compileTestGroovy
> Task :src:dist-check:testClasses
> Task :src:dist-check:checkstyleTest
> Task :src:dist-check:spotbugsTest SKIPPED

> Task :src:functions:test

org.apache.jmeter.functions.XPathConcurrencyTest > concurrentRequestsToSameXPath(ReferenceEquality)[2]
[[2] SAME_OBJECTS]: SKIPPED

org.apache.jmeter.functions.XPathConcurrencyTest > concurrentRequestsToSameXPath(ReferenceEquality)[3]
[[3] DIFFERENT_OBJECTS]: SKIPPED

org.apache.jmeter.functions.XPathConcurrencyTest > concurrentRequestsToSameXPath(ReferenceEquality)[4]
[[4] DIFFERENT_OBJECTS]: SKIPPED

org.apache.jmeter.functions.XPathConcurrencyTest > concurrentRequestsToSameXPath(ReferenceEquality)[5]
[[5] SAME_OBJECTS]: SKIPPED

org.apache.jmeter.functions.XPathConcurrencyTest > concurrentRequestsToSameXPath(ReferenceEquality)[6]
[[6] DIFFERENT_OBJECTS]: SKIPPED

> Task :src:functions:check
> Task :src:functions:assemble

> Task :src:dist:javadocAggregate
javadoc: warning - Multiple sources of package comments found for package "org.apache.jmeter.assertions"
javadoc: warning - Multiple sources of package comments found for package "org.apache.jmeter.visualizers"
javadoc: warning - Multiple sources of package comments found for package "org.apache.jmeter.report.config"
javadoc: warning - Multiple sources of package comments found for package "org.apache.jmeter.report.core"
javadoc: warning - Multiple sources of package comments found for package "org.apache.jmeter.report.dashboard"
javadoc: warning - Multiple sources of package comments found for package "org.apache.jmeter.report.processor"
javadoc: warning - Multiple sources of package comments found for package "org.apache.jmeter.report.processor.graph"
javadoc: warning - Multiple sources of package comments found for package "org.apache.jmeter.report.processor.graph.impl"
javadoc: warning - Multiple sources of package comments found for package "org.apache.commons.cli.avalon"

> Task :src:protocol:http:test FAILED

Gradle Test Executor 18 STANDARD_OUT
    Setting JMeterHome: F:\jenkins\jenkins-slave\workspace\JMeter Windows\src\protocol\http\..\..\..\.
    Initializing Properties: ../../.././bin/jmeter.properties

Gradle Test Executor 18 STANDARD_ERROR
    Oct 26, 2019 5:13:34 AM java.util.prefs.WindowsPreferences <init>
    WARNING: Could not open/create prefs root node Software\JavaSoft\Prefs at root 0x80000002.
Windows RegCreateKeyEx(...) returned error code 5.

Gradle Test Executor 18 STANDARD_OUT
    JMeterVersion=5.2-SNAPSHOT 5bd4650
    java.version=1.8.0_152
    java.vm.name=Java HotSpot(TM) 64-Bit Server VM
    java.vendor=Oracle Corporation
    java.home=F:\jenkins\tools\java\latest1.8\jre
    file.encoding=windows-1252
    default encoding=windows-1252
    user.home=C:\Users\jenkins
    user.dir=F:\jenkins\jenkins-slave\workspace\JMeter Windows\src\protocol\http
    user.language=en
    user.region=null
    user.country=US
    user.variant=
    Locale=en_US
    java.class.version=52.0
    java.awt.headless=null
    os.name=Windows Server 2016
    os.version=10.0
    os.arch=amd64

org.apache.jmeter.protocol.http.control.TestCacheManagerUrlConnection > testPrivateCache():
FAILURE

org.apache.jmeter.protocol.http.control.TestCacheManagerUrlConnection > testPrivateCache()
FAILED
    org.opentest4j.AssertionFailedError: Should not find valid entry ==> expected: <false>
but was: <true>

org.apache.jmeter.protocol.http.control.TestCacheManagerHC4 > testCacheHttpClientBug51932():
FAILURE

org.apache.jmeter.protocol.http.control.TestCacheManagerHC4 > testCacheHttpClientBug51932()
FAILED
    org.opentest4j.AssertionFailedError: Should not find valid entry ==> expected: <false>
but was: <true>

org.apache.jmeter.protocol.http.control.DnsManagerTest > badDnsInCustomResolverShouldFailHttpSampler(String,
WireMockServer)[2] [[2] Java]: SKIPPED

org.apache.jmeter.protocol.http.sampler.SamplingNamingTest > testBug63364[Run 0: implementation:HttpClient4]:
SKIPPED

org.apache.jmeter.protocol.http.sampler.SamplingNamingTest > testBug63364[Run 1: implementation:Java]:
SKIPPED

629 tests completed, 2 failed, 3 skipped

> Task :src:dist:javadocAggregate
F:\jenkins\jenkins-slave\workspace\JMeter Windows\src\jorphan\src\main\java\org\apache\jorphan\exec\SystemCommand.java:132:
warning: no @throws for java.util.concurrent.TimeoutException
    public int run(List<String> arguments) throws InterruptedException, IOException,
TimeoutException {
               ^
10 warnings
checksum-dependency elapsed time: 27712ms, configurations processed: 264
    SHA-512 computation time: 1003ms (goes in parallel, it might exceed wall-clock time),
files processed: 28, processed: 5MiB, skipped: 3127MiB
    PGP signature resolution time: 1122ms (wall-clock), resolution requests: 157, signatures
resolved: 227
    PGP key resolution time: 11284ms (wall-clock), resolution requests: 157, download time:
4307ms (goes in parallel, it might exceed wall-clock time), keys downloaded: 2
        PGP signature verification time: 16772ms (goes in parallel, it might exceed wall-clock
time), files processed: 272, processed: 201MiB, skipped: 2903MiB

FAILURE: Build failed with an exception.

* What went wrong:
Execution failed for task ':src:protocol:http:test'.
> There were failing tests. See the report at: file:///F:/jenkins/jenkins-slave/workspace/JMeter%20Windows/src/protocol/http/build/reports/tests/test/index.html

* Try:
Run with --stacktrace option to get the stack trace. Run with --info or --debug option to
get more log output. Run with --scan to get full insights.

* Get more help at https://help.gradle.org

Deprecated Gradle features were used in this build, making it incompatible with Gradle 6.0.
Use '--warning-mode all' to show the individual deprecation warnings.
See https://docs.gradle.org/5.6.2/userguide/command_line_interface.html#sec:command_line_warnings

BUILD FAILED in 6m 41s
260 actionable tasks: 243 executed, 17 up-to-date
Could not open/create prefs root node Software\JavaSoft\Prefs at root 0x80000002. Windows
RegCreateKeyEx(...) returned error code 5.
Build step 'Invoke Gradle script' changed build result to FAILURE
Build step 'Invoke Gradle script' marked build as failure

Mime
View raw message