jmeter-dev mailing list archives

Site index · List index
Message view « Date » · « Thread »
Top « Date » · « Thread »
From Apache Jenkins Server <jenk...@builds.apache.org>
Subject Build failed in Jenkins: JMeter Windows #1522
Date Sat, 05 Oct 2019 08:42:49 GMT
See <https://builds.apache.org/job/JMeter%20Windows/1522/display/redirect?page=changes>

Changes:

[sitnikov.vladimir] 62861: Ensure thread groups from pre-5.0 jmx are loaded with "same user

[sitnikov.vladimir] Kepp lib/ext/*.jar on gw runGui and gw createDist


------------------------------------------
[...truncated 195.50 KB...]
    	at java.util.stream.ReferencePipeline$7$1.accept(ReferencePipeline.java:270)
    	at java.util.stream.ReferencePipeline$3$1.accept(ReferencePipeline.java:193)
    	at java.util.stream.ReferencePipeline$3$1.accept(ReferencePipeline.java:193)
    	at java.util.Spliterators$ArraySpliterator.forEachRemaining(Spliterators.java:948)
    	at java.util.stream.AbstractPipeline.copyInto(AbstractPipeline.java:481)
    	at java.util.stream.AbstractPipeline.wrapAndCopyInto(AbstractPipeline.java:471)
    	at java.util.stream.ForEachOps$ForEachOp.evaluateSequential(ForEachOps.java:151)
    	at java.util.stream.ForEachOps$ForEachOp$OfRef.evaluateSequential(ForEachOps.java:174)
    	at java.util.stream.AbstractPipeline.evaluate(AbstractPipeline.java:234)
    	at java.util.stream.ReferencePipeline.forEach(ReferencePipeline.java:418)
    	at java.util.stream.ReferencePipeline$7$1.accept(ReferencePipeline.java:270)
    	at java.util.stream.ReferencePipeline$3$1.accept(ReferencePipeline.java:193)
    	at java.util.stream.ReferencePipeline$3$1.accept(ReferencePipeline.java:193)
    	at java.util.stream.ReferencePipeline$3$1.accept(ReferencePipeline.java:193)
    	at java.util.ArrayList$ArrayListSpliterator.forEachRemaining(ArrayList.java:1382)
    	at java.util.stream.AbstractPipeline.copyInto(AbstractPipeline.java:481)
    	at java.util.stream.AbstractPipeline.wrapAndCopyInto(AbstractPipeline.java:471)
    	at java.util.stream.ForEachOps$ForEachOp.evaluateSequential(ForEachOps.java:151)
    	at java.util.stream.ForEachOps$ForEachOp$OfRef.evaluateSequential(ForEachOps.java:174)
    	at java.util.stream.AbstractPipeline.evaluate(AbstractPipeline.java:234)
    	at java.util.stream.ReferencePipeline.forEach(ReferencePipeline.java:418)
    	at java.util.stream.ReferencePipeline$7$1.accept(ReferencePipeline.java:270)
    	at java.util.ArrayList$ArrayListSpliterator.forEachRemaining(ArrayList.java:1382)
    	at java.util.stream.AbstractPipeline.copyInto(AbstractPipeline.java:481)
    	at java.util.stream.AbstractPipeline.wrapAndCopyInto(AbstractPipeline.java:471)
    	at java.util.stream.ForEachOps$ForEachOp.evaluateSequential(ForEachOps.java:151)
    	at java.util.stream.ForEachOps$ForEachOp$OfRef.evaluateSequential(ForEachOps.java:174)
    	at java.util.stream.AbstractPipeline.evaluate(AbstractPipeline.java:234)
    	at java.util.stream.ReferencePipeline.forEach(ReferencePipeline.java:418)
    	at org.junit.jupiter.engine.descriptor.TestTemplateTestDescriptor.execute(TestTemplateTestDescriptor.java:106)
    	at org.junit.jupiter.engine.descriptor.TestTemplateTestDescriptor.execute(TestTemplateTestDescriptor.java:41)
    	at org.junit.platform.engine.support.hierarchical.NodeTestTask.lambda$executeRecursively$5(NodeTestTask.java:135)
    	at org.junit.platform.engine.support.hierarchical.ThrowableCollector.execute(ThrowableCollector.java:73)
    	at org.junit.platform.engine.support.hierarchical.NodeTestTask.lambda$executeRecursively$7(NodeTestTask.java:125)
    	at org.junit.platform.engine.support.hierarchical.Node.around(Node.java:135)
    	at org.junit.platform.engine.support.hierarchical.NodeTestTask.lambda$executeRecursively$8(NodeTestTask.java:123)
    	at org.junit.platform.engine.support.hierarchical.ThrowableCollector.execute(ThrowableCollector.java:73)
    	at org.junit.platform.engine.support.hierarchical.NodeTestTask.executeRecursively(NodeTestTask.java:122)
    	at org.junit.platform.engine.support.hierarchical.NodeTestTask.execute(NodeTestTask.java:80)
    	at org.junit.platform.engine.support.hierarchical.ForkJoinPoolHierarchicalTestExecutorService$ExclusiveTask.compute(ForkJoinPoolHierarchicalTestExecutorService.java:171)
    	at org.junit.platform.engine.support.hierarchical.ForkJoinPoolHierarchicalTestExecutorService.invokeAll(ForkJoinPoolHierarchicalTestExecutorService.java:115)
    	at org.junit.platform.engine.support.hierarchical.NodeTestTask.lambda$executeRecursively$5(NodeTestTask.java:139)
    	at org.junit.platform.engine.support.hierarchical.ThrowableCollector.execute(ThrowableCollector.java:73)
    	at org.junit.platform.engine.support.hierarchical.NodeTestTask.lambda$executeRecursively$7(NodeTestTask.java:125)
    	at org.junit.platform.engine.support.hierarchical.Node.around(Node.java:135)
    	at org.junit.platform.engine.support.hierarchical.NodeTestTask.lambda$executeRecursively$8(NodeTestTask.java:123)
    	at org.junit.platform.engine.support.hierarchical.ThrowableCollector.execute(ThrowableCollector.java:73)
    	at org.junit.platform.engine.support.hierarchical.NodeTestTask.executeRecursively(NodeTestTask.java:122)
    	at org.junit.platform.engine.support.hierarchical.NodeTestTask.execute(NodeTestTask.java:80)
    	at org.junit.platform.engine.support.hierarchical.ForkJoinPoolHierarchicalTestExecutorService$ExclusiveTask.compute(ForkJoinPoolHierarchicalTestExecutorService.java:171)
    	at org.junit.platform.engine.support.hierarchical.ForkJoinPoolHierarchicalTestExecutorService.executeNonConcurrentTasks(ForkJoinPoolHierarchicalTestExecutorService.java:141)
    	at org.junit.platform.engine.support.hierarchical.ForkJoinPoolHierarchicalTestExecutorService.invokeAll(ForkJoinPoolHierarchicalTestExecutorService.java:121)
    	at org.junit.platform.engine.support.hierarchical.NodeTestTask.lambda$executeRecursively$5(NodeTestTask.java:139)
    	at org.junit.platform.engine.support.hierarchical.ThrowableCollector.execute(ThrowableCollector.java:73)
    	at org.junit.platform.engine.support.hierarchical.NodeTestTask.lambda$executeRecursively$7(NodeTestTask.java:125)
    	at org.junit.platform.engine.support.hierarchical.Node.around(Node.java:135)
    	at org.junit.platform.engine.support.hierarchical.NodeTestTask.lambda$executeRecursively$8(NodeTestTask.java:123)
    	at org.junit.platform.engine.support.hierarchical.ThrowableCollector.execute(ThrowableCollector.java:73)
    	at org.junit.platform.engine.support.hierarchical.NodeTestTask.executeRecursively(NodeTestTask.java:122)
    	at org.junit.platform.engine.support.hierarchical.NodeTestTask.execute(NodeTestTask.java:80)
    	at org.junit.platform.engine.support.hierarchical.ForkJoinPoolHierarchicalTestExecutorService$ExclusiveTask.compute(ForkJoinPoolHierarchicalTestExecutorService.java:171)
    	at java.util.concurrent.RecursiveAction.exec(RecursiveAction.java:189)
    	at java.util.concurrent.ForkJoinTask.doExec(ForkJoinTask.java:289)
    	at java.util.concurrent.ForkJoinPool$WorkQueue.runTask(ForkJoinPool.java:1056)
    	at java.util.concurrent.ForkJoinPool.runWorker(ForkJoinPool.java:1692)
    	at java.util.concurrent.ForkJoinWorkerThread.run(ForkJoinWorkerThread.java:157)

        at org.junit.jupiter.api.AssertionUtils.fail(AssertionUtils.java:39)
        at org.junit.jupiter.api.Assertions.fail(Assertions.java:109)
        at org.apache.jmeter.protocol.http.sampler.ParallelResourcesAndIpSource.test(ParallelResourcesAndIpSource.java:182)

org.apache.jmeter.protocol.http.sampler.ParallelResourcesAndIpSource > test(String, String,
InetAddress, WireMockServer, JMeterVariables, TestInfo)[4] FAILED
    org.opentest4j.AssertionFailedError: IPv4 <-> IPv6 connectivity must fail. sourceIp
= /0:0:0:0:0:0:0:1, targetHost = 127.0.0.1 result = url: http://127.0.0.1:64549/index.html
    response: Non HTTP response message: Cannot assign requested address: connect
    data.size: 13713
    data: java.net.BindException: Cannot assign requested address: connect
    	at java.net.DualStackPlainSocketImpl.waitForConnect(Native Method)
    	at java.net.DualStackPlainSocketImpl.socketConnect(DualStackPlainSocketImpl.java:85)
    	at java.net.AbstractPlainSocketImpl.doConnect(AbstractPlainSocketImpl.java:350)
    	at java.net.AbstractPlainSocketImpl.connectToAddress(AbstractPlainSocketImpl.java:206)
    	at java.net.AbstractPlainSocketImpl.connect(AbstractPlainSocketImpl.java:188)
    	at java.net.PlainSocketImpl.connect(PlainSocketImpl.java:172)
    	at java.net.SocksSocketImpl.connect(SocksSocketImpl.java:392)
    	at java.net.Socket.connect(Socket.java:589)
    	at org.apache.http.conn.socket.PlainConnectionSocketFactory.connectSocket(PlainConnectionSocketFactory.java:75)
    	at org.apache.http.impl.conn.DefaultHttpClientConnectionOperator.connect(DefaultHttpClientConnectionOperator.java:142)
    	at org.apache.jmeter.protocol.http.sampler.HTTPHC4Impl$JMeterDefaultHttpClientConnectionOperator.connect(HTTPHC4Impl.java:326)
    	at org.apache.http.impl.conn.PoolingHttpClientConnectionManager.connect(PoolingHttpClientConnectionManager.java:374)
    	at org.apache.http.impl.execchain.MainClientExec.establishRoute(MainClientExec.java:393)
    	at org.apache.http.impl.execchain.MainClientExec.execute(MainClientExec.java:236)
    	at org.apache.http.impl.execchain.ProtocolExec.execute(ProtocolExec.java:186)
    	at org.apache.http.impl.execchain.RetryExec.execute(RetryExec.java:89)
    	at org.apache.http.impl.execchain.RedirectExec.execute(RedirectExec.java:110)
    	at org.apache.http.impl.client.InternalHttpClient.doExecute(InternalHttpClient.java:185)
    	at org.apache.http.impl.client.CloseableHttpClient.execute(CloseableHttpClient.java:83)
    	at org.apache.jmeter.protocol.http.sampler.HTTPHC4Impl.executeRequest(HTTPHC4Impl.java:850)
    	at org.apache.jmeter.protocol.http.sampler.HTTPHC4Impl.sample(HTTPHC4Impl.java:561)
    	at org.apache.jmeter.protocol.http.sampler.HTTPSamplerProxy.sample(HTTPSamplerProxy.java:67)
    	at org.apache.jmeter.protocol.http.sampler.HTTPSamplerBase.sample(HTTPSamplerBase.java:1282)
    	at org.apache.jmeter.protocol.http.sampler.ParallelResourcesAndIpSource.test(ParallelResourcesAndIpSource.java:164)
    	at sun.reflect.NativeMethodAccessorImpl.invoke0(Native Method)
    	at sun.reflect.NativeMethodAccessorImpl.invoke(NativeMethodAccessorImpl.java:62)
    	at sun.reflect.DelegatingMethodAccessorImpl.invoke(DelegatingMethodAccessorImpl.java:43)
    	at java.lang.reflect.Method.invoke(Method.java:498)
    	at org.junit.platform.commons.util.ReflectionUtils.invokeMethod(ReflectionUtils.java:675)
    	at org.junit.jupiter.engine.execution.MethodInvocation.proceed(MethodInvocation.java:60)
    	at org.junit.jupiter.engine.execution.InvocationInterceptorChain$ValidatingInvocation.proceed(InvocationInterceptorChain.java:125)
    	at org.junit.jupiter.engine.extension.TimeoutInvocation.proceed(TimeoutInvocation.java:46)
    	at org.junit.jupiter.engine.extension.TimeoutExtension.intercept(TimeoutExtension.java:132)
    	at org.junit.jupiter.engine.extension.TimeoutExtension.interceptTestableMethod(TimeoutExtension.java:124)
    	at org.junit.jupiter.engine.extension.TimeoutExtension.interceptTestTemplateMethod(TimeoutExtension.java:81)
    	at org.junit.jupiter.engine.execution.ExecutableInvoker$ReflectiveInterceptorCall.lambda$ofVoidMethod$0(ExecutableInvoker.java:115)
    	at org.junit.jupiter.engine.execution.ExecutableInvoker.lambda$invoke$0(ExecutableInvoker.java:105)
    	at org.junit.jupiter.engine.execution.InvocationInterceptorChain$InterceptedInvocation.proceed(InvocationInterceptorChain.java:104)
    	at org.junit.jupiter.engine.execution.InvocationInterceptorChain.proceed(InvocationInterceptorChain.java:62)
    	at org.junit.jupiter.engine.execution.InvocationInterceptorChain.chainAndInvoke(InvocationInterceptorChain.java:43)
    	at org.junit.jupiter.engine.execution.InvocationInterceptorChain.invoke(InvocationInterceptorChain.java:35)
    	at org.junit.jupiter.engine.execution.ExecutableInvoker.invoke(ExecutableInvoker.java:104)
    	at org.junit.jupiter.engine.execution.ExecutableInvoker.invoke(ExecutableInvoker.java:98)
    	at org.junit.jupiter.engine.descriptor.TestMethodTestDescriptor.lambda$invokeTestMethod$6(TestMethodTestDescriptor.java:202)
    	at org.junit.platform.engine.support.hierarchical.ThrowableCollector.execute(ThrowableCollector.java:73)
    	at org.junit.jupiter.engine.descriptor.TestMethodTestDescriptor.invokeTestMethod(TestMethodTestDescriptor.java:198)
    	at org.junit.jupiter.engine.descriptor.TestMethodTestDescriptor.execute(TestMethodTestDescriptor.java:135)
    	at org.junit.jupiter.engine.descriptor.TestMethodTestDescriptor.execute(TestMethodTestDescriptor.java:69)
    	at org.junit.platform.engine.support.hierarchical.NodeTestTask.lambda$executeRecursively$5(NodeTestTask.java:135)
    	at org.junit.platform.engine.support.hierarchical.ThrowableCollector.execute(ThrowableCollector.java:73)
    	at org.junit.platform.engine.support.hierarchical.NodeTestTask.lambda$executeRecursively$7(NodeTestTask.java:125)
    	at org.junit.platform.engine.support.hierarchical.Node.around(Node.java:135)
    	at org.junit.platform.engine.support.hierarchical.NodeTestTask.lambda$executeRecursively$8(NodeTestTask.java:123)
    	at org.junit.platform.engine.support.hierarchical.ThrowableCollector.execute(ThrowableCollector.java:73)
    	at org.junit.platform.engine.support.hierarchical.NodeTestTask.executeRecursively(NodeTestTask.java:122)
    	at org.junit.platform.engine.support.hierarchical.NodeTestTask.execute(NodeTestTask.java:80)
    	at org.junit.platform.engine.support.hierarchical.ForkJoinPoolHierarchicalTestExecutorService$ExclusiveTask.compute(ForkJoinPoolHierarchicalTestExecutorService.java:171)
    	at org.junit.platform.engine.support.hierarchical.ForkJoinPoolHierarchicalTestExecutorService.submit(ForkJoinPoolHierarchicalTestExecutorService.java:104)
    	at org.junit.platform.engine.support.hierarchical.NodeTestTask$DefaultDynamicTestExecutor.execute(NodeTestTask.java:198)
    	at org.junit.jupiter.engine.descriptor.TestTemplateTestDescriptor.execute(TestTemplateTestDescriptor.java:138)
    	at org.junit.jupiter.engine.descriptor.TestTemplateTestDescriptor.lambda$execute$2(TestTemplateTestDescriptor.java:106)
    	at java.util.stream.ForEachOps$ForEachOp$OfRef.accept(ForEachOps.java:184)
    	at java.util.stream.ReferencePipeline$3$1.accept(ReferencePipeline.java:193)
    	at java.util.stream.ReferencePipeline$2$1.accept(ReferencePipeline.java:175)
    	at java.util.stream.ReferencePipeline$3$1.accept(ReferencePipeline.java:193)
    	at java.util.stream.ForEachOps$ForEachOp$OfRef.accept(ForEachOps.java:184)
    	at java.util.stream.ReferencePipeline$11$1.accept(ReferencePipeline.java:373)
    	at java.util.stream.ReferencePipeline$3$1.accept(ReferencePipeline.java:193)
    	at java.util.stream.ReferencePipeline$3$1.accept(ReferencePipeline.java:193)
    	at java.util.stream.ReferencePipeline$3$1.accept(ReferencePipeline.java:193)
    	at java.util.stream.ForEachOps$ForEachOp$OfRef.accept(ForEachOps.java:184)
    	at java.util.stream.ReferencePipeline$3$1.accept(ReferencePipeline.java:193)
    	at java.util.ArrayList$ArrayListSpliterator.forEachRemaining(ArrayList.java:1382)
    	at java.util.stream.ReferencePipeline$Head.forEach(ReferencePipeline.java:580)
    	at java.util.stream.ReferencePipeline$7$1.accept(ReferencePipeline.java:270)
    	at java.util.stream.ReferencePipeline$3$1.accept(ReferencePipeline.java:193)
    	at java.util.stream.ReferencePipeline$3$1.accept(ReferencePipeline.java:193)
    	at java.util.Spliterators$ArraySpliterator.forEachRemaining(Spliterators.java:948)
    	at java.util.stream.AbstractPipeline.copyInto(AbstractPipeline.java:481)
    	at java.util.stream.AbstractPipeline.wrapAndCopyInto(AbstractPipeline.java:471)
    	at java.util.stream.ForEachOps$ForEachOp.evaluateSequential(ForEachOps.java:151)
    	at java.util.stream.ForEachOps$ForEachOp$OfRef.evaluateSequential(ForEachOps.java:174)
    	at java.util.stream.AbstractPipeline.evaluate(AbstractPipeline.java:234)
    	at java.util.stream.ReferencePipeline.forEach(ReferencePipeline.java:418)
    	at java.util.stream.ReferencePipeline$7$1.accept(ReferencePipeline.java:270)
    	at java.util.stream.ReferencePipeline$3$1.accept(ReferencePipeline.java:193)
    	at java.util.stream.ReferencePipeline$3$1.accept(ReferencePipeline.java:193)
    	at java.util.stream.ReferencePipeline$3$1.accept(ReferencePipeline.java:193)
    	at java.util.ArrayList$ArrayListSpliterator.forEachRemaining(ArrayList.java:1382)
    	at java.util.stream.AbstractPipeline.copyInto(AbstractPipeline.java:481)
    	at java.util.stream.AbstractPipeline.wrapAndCopyInto(AbstractPipeline.java:471)
    	at java.util.stream.ForEachOps$ForEachOp.evaluateSequential(ForEachOps.java:151)
    	at java.util.stream.ForEachOps$ForEachOp$OfRef.evaluateSequential(ForEachOps.java:174)
    	at java.util.stream.AbstractPipeline.evaluate(AbstractPipeline.java:234)
    	at java.util.stream.ReferencePipeline.forEach(ReferencePipeline.java:418)
    	at java.util.stream.ReferencePipeline$7$1.accept(ReferencePipeline.java:270)
    	at java.util.ArrayList$ArrayListSpliterator.forEachRemaining(ArrayList.java:1382)
    	at java.util.stream.AbstractPipeline.copyInto(AbstractPipeline.java:481)
    	at java.util.stream.AbstractPipeline.wrapAndCopyInto(AbstractPipeline.java:471)
    	at java.util.stream.ForEachOps$ForEachOp.evaluateSequential(ForEachOps.java:151)
    	at java.util.stream.ForEachOps$ForEachOp$OfRef.evaluateSequential(ForEachOps.java:174)
    	at java.util.stream.AbstractPipeline.evaluate(AbstractPipeline.java:234)
    	at java.util.stream.ReferencePipeline.forEach(ReferencePipeline.java:418)
    	at org.junit.jupiter.engine.descriptor.TestTemplateTestDescriptor.execute(TestTemplateTestDescriptor.java:106)
    	at org.junit.jupiter.engine.descriptor.TestTemplateTestDescriptor.execute(TestTemplateTestDescriptor.java:41)
    	at org.junit.platform.engine.support.hierarchical.NodeTestTask.lambda$executeRecursively$5(NodeTestTask.java:135)
    	at org.junit.platform.engine.support.hierarchical.ThrowableCollector.execute(ThrowableCollector.java:73)
    	at org.junit.platform.engine.support.hierarchical.NodeTestTask.lambda$executeRecursively$7(NodeTestTask.java:125)
    	at org.junit.platform.engine.support.hierarchical.Node.around(Node.java:135)
    	at org.junit.platform.engine.support.hierarchical.NodeTestTask.lambda$executeRecursively$8(NodeTestTask.java:123)
    	at org.junit.platform.engine.support.hierarchical.ThrowableCollector.execute(ThrowableCollector.java:73)
    	at org.junit.platform.engine.support.hierarchical.NodeTestTask.executeRecursively(NodeTestTask.java:122)
    	at org.junit.platform.engine.support.hierarchical.NodeTestTask.execute(NodeTestTask.java:80)
    	at org.junit.platform.engine.support.hierarchical.ForkJoinPoolHierarchicalTestExecutorService$ExclusiveTask.compute(ForkJoinPoolHierarchicalTestExecutorService.java:171)
    	at org.junit.platform.engine.support.hierarchical.ForkJoinPoolHierarchicalTestExecutorService.invokeAll(ForkJoinPoolHierarchicalTestExecutorService.java:115)
    	at org.junit.platform.engine.support.hierarchical.NodeTestTask.lambda$executeRecursively$5(NodeTestTask.java:139)
    	at org.junit.platform.engine.support.hierarchical.ThrowableCollector.execute(ThrowableCollector.java:73)
    	at org.junit.platform.engine.support.hierarchical.NodeTestTask.lambda$executeRecursively$7(NodeTestTask.java:125)
    	at org.junit.platform.engine.support.hierarchical.Node.around(Node.java:135)
    	at org.junit.platform.engine.support.hierarchical.NodeTestTask.lambda$executeRecursively$8(NodeTestTask.java:123)
    	at org.junit.platform.engine.support.hierarchical.ThrowableCollector.execute(ThrowableCollector.java:73)
    	at org.junit.platform.engine.support.hierarchical.NodeTestTask.executeRecursively(NodeTestTask.java:122)
    	at org.junit.platform.engine.support.hierarchical.NodeTestTask.execute(NodeTestTask.java:80)
    	at org.junit.platform.engine.support.hierarchical.ForkJoinPoolHierarchicalTestExecutorService$ExclusiveTask.compute(ForkJoinPoolHierarchicalTestExecutorService.java:171)
    	at org.junit.platform.engine.support.hierarchical.ForkJoinPoolHierarchicalTestExecutorService.executeNonConcurrentTasks(ForkJoinPoolHierarchicalTestExecutorService.java:141)
    	at org.junit.platform.engine.support.hierarchical.ForkJoinPoolHierarchicalTestExecutorService.invokeAll(ForkJoinPoolHierarchicalTestExecutorService.java:121)
    	at org.junit.platform.engine.support.hierarchical.NodeTestTask.lambda$executeRecursively$5(NodeTestTask.java:139)
    	at org.junit.platform.engine.support.hierarchical.ThrowableCollector.execute(ThrowableCollector.java:73)
    	at org.junit.platform.engine.support.hierarchical.NodeTestTask.lambda$executeRecursively$7(NodeTestTask.java:125)
    	at org.junit.platform.engine.support.hierarchical.Node.around(Node.java:135)
    	at org.junit.platform.engine.support.hierarchical.NodeTestTask.lambda$executeRecursively$8(NodeTestTask.java:123)
    	at org.junit.platform.engine.support.hierarchical.ThrowableCollector.execute(ThrowableCollector.java:73)
    	at org.junit.platform.engine.support.hierarchical.NodeTestTask.executeRecursively(NodeTestTask.java:122)
    	at org.junit.platform.engine.support.hierarchical.NodeTestTask.execute(NodeTestTask.java:80)
    	at org.junit.platform.engine.support.hierarchical.ForkJoinPoolHierarchicalTestExecutorService$ExclusiveTask.compute(ForkJoinPoolHierarchicalTestExecutorService.java:171)
    	at java.util.concurrent.RecursiveAction.exec(RecursiveAction.java:189)
    	at java.util.concurrent.ForkJoinTask.doExec(ForkJoinTask.java:289)
    	at java.util.concurrent.ForkJoinPool$WorkQueue.runTask(ForkJoinPool.java:1056)
    	at java.util.concurrent.ForkJoinPool.runWorker(ForkJoinPool.java:1692)
    	at java.util.concurrent.ForkJoinWorkerThread.run(ForkJoinWorkerThread.java:157)

        at org.junit.jupiter.api.AssertionUtils.fail(AssertionUtils.java:39)
        at org.junit.jupiter.api.Assertions.fail(Assertions.java:109)
        at org.apache.jmeter.protocol.http.sampler.ParallelResourcesAndIpSource.test(ParallelResourcesAndIpSource.java:182)

622 tests completed, 2 failed, 3 skipped

> Task :src:protocol:http:test FAILED

> Task :src:dist:javadocAggregate
9 warnings
checksum-dependency elapsed time: 7070ms, configurations processed: 529 (add -PchecksumTimingsPrint
to print detailed timings)

FAILURE: Build failed with an exception.

* What went wrong:
Execution failed for task ':src:protocol:http:test'.
> There were failing tests. See the report at: file:///F:/jenkins/jenkins-slave/workspace/JMeter%20Windows/src/protocol/http/build/reports/tests/test/index.html

* Try:
Run with --stacktrace option to get the stack trace. Run with --info or --debug option to
get more log output. Run with --scan to get full insights.

* Get more help at https://help.gradle.org

Deprecated Gradle features were used in this build, making it incompatible with Gradle 6.0.
Use '--warning-mode all' to show the individual deprecation warnings.
See https://docs.gradle.org/5.6.2/userguide/command_line_interface.html#sec:command_line_warnings

BUILD FAILED in 2m 51s
259 actionable tasks: 144 executed, 115 up-to-date
Could not open/create prefs root node Software\JavaSoft\Prefs at root 0x80000002. Windows
RegCreateKeyEx(...) returned error code 5.
Build step 'Invoke Gradle script' changed build result to FAILURE
Build step 'Invoke Gradle script' marked build as failure

Mime
View raw message