jmeter-dev mailing list archives

Site index · List index
Message view « Date » · « Thread »
Top « Date » · « Thread »
From Apache Jenkins Server <jenk...@builds.apache.org>
Subject Build failed in Jenkins: JMeter-trunk #7482
Date Sun, 06 Oct 2019 20:54:42 GMT
See <https://builds.apache.org/job/JMeter-trunk/7482/display/redirect?page=changes>

Changes:

[pmouawad] JUnit v4 -> v5 Migration (#524)


------------------------------------------
[...truncated 42.75 KB...]
> Task :src:protocol:bolt:spotlessKotlinGradle
> Task :src:protocol:bolt:spotlessKotlinGradleCheck
> Task :src:protocol:bolt:spotlessCheck
> Task :src:protocol:ftp:spotlessKotlinGradle
> Task :src:protocol:ftp:spotlessKotlinGradleCheck
> Task :src:protocol:ftp:spotlessCheck
> Task :src:dist-check:spotlessJava
> Task :src:dist-check:spotlessJavaCheck
> Task :src:protocol:jdbc:spotlessJava
> Task :src:protocol:jdbc:spotlessJavaCheck
> Task :src:protocol:junit:spotlessJava
> Task :src:protocol:junit:spotlessJavaCheck
> Task :src:protocol:jdbc:spotlessKotlinGradle
> Task :src:protocol:jdbc:spotlessKotlinGradleCheck
> Task :src:protocol:jdbc:spotlessCheck
> Task :src:protocol:junit:spotlessKotlinGradle
> Task :src:protocol:junit:spotlessKotlinGradleCheck
> Task :src:protocol:junit:spotlessCheck
> Task :src:protocol:java:spotlessJava
> Task :src:protocol:java:spotlessJavaCheck
> Task :src:protocol:java:spotlessKotlinGradle
> Task :src:protocol:java:spotlessKotlinGradleCheck
> Task :src:protocol:java:spotlessCheck
> Task :src:protocol:junit-sample:spotlessJava
> Task :src:protocol:junit-sample:spotlessJavaCheck
> Task :src:protocol:junit-sample:spotlessKotlinGradle
> Task :src:protocol:junit-sample:spotlessKotlinGradleCheck
> Task :src:protocol:junit-sample:spotlessCheck
> Task :src:protocol:junit-sample:processTestResources NO-SOURCE
> Task :src:protocol:mongodb:spotlessJava
> Task :src:protocol:mongodb:spotlessJavaCheck
> Task :src:protocol:ldap:spotlessJava
> Task :src:protocol:ldap:spotlessJavaCheck
> Task :src:protocol:mongodb:spotlessKotlinGradle
> Task :src:protocol:mongodb:spotlessKotlinGradleCheck
> Task :src:protocol:mongodb:spotlessCheck
> Task :src:protocol:ldap:spotlessKotlinGradle
> Task :src:protocol:ldap:spotlessKotlinGradleCheck
> Task :src:protocol:ldap:spotlessCheck
> Task :src:protocol:native:spotlessJava
> Task :src:protocol:native:spotlessJavaCheck
> Task :src:protocol:mail:spotlessJava
> Task :src:protocol:mail:spotlessJavaCheck
> Task :src:protocol:mail:spotlessKotlinGradle
> Task :src:protocol:native:spotlessKotlinGradle
> Task :src:protocol:mail:spotlessKotlinGradleCheck
> Task :src:protocol:native:spotlessKotlinGradleCheck
> Task :src:protocol:mail:spotlessCheck
> Task :src:protocol:native:spotlessCheck
> Task :src:protocol:jms:spotlessJava
> Task :src:protocol:jms:spotlessJavaCheck
> Task :src:protocol:jms:spotlessKotlinGradle
> Task :src:protocol:jms:spotlessKotlinGradleCheck
> Task :src:protocol:jms:spotlessCheck
> Task :src:protocol:tcp:spotlessJava
> Task :src:protocol:tcp:spotlessJavaCheck
> Task :src:protocol:tcp:spotlessKotlinGradle
> Task :src:protocol:tcp:spotlessKotlinGradleCheck
> Task :src:protocol:tcp:spotlessCheck
> Task :src:functions:spotlessJava FAILED
> Task :src:protocol:http:spotlessJava
> Task :src:testkit:spotlessKotlinGradle
> Task :src:testkit-wiremock:spotlessKotlinGradle
> Task :src:bshclient:spotlessKotlinGradle
> Task :src:generator:spotlessKotlinGradle
> Task :src:examples:spotlessKotlinGradle
> Task :src:launcher:spotlessKotlinGradle
> Task :src:release:spotlessKotlinGradle
> Task :src:config:spotlessKotlinGradle
> Task :src:components:spotlessJava
> Task :src:bom:spotlessKotlinGradle
> Task :src:protocol:spotlessKotlinGradle
> Task :src:spotlessKotlinGradle
> Task :src:dist-check:spotlessKotlinGradle
> Task :src:licenses:spotlessKotlinGradle
> Task :src:dist:spotlessKotlinGradle
> Task :spotlessKotlinGradle
> Task :src:jorphan:compileTestJava

> Task :src:core:compileJava
Note: Some input files use or override a deprecated API.
Note: Recompile with -Xlint:deprecation for details.
Note: <https://builds.apache.org/job/JMeter-trunk/ws/src/core/src/main/java/org/apache/jmeter/save/converters/TestElementPropertyConverter.java>
uses unchecked or unsafe operations.
Note: Recompile with -Xlint:unchecked for details.
checksum-dependency elapsed time: 10046ms, configurations processed: 117 (add -PchecksumTimingsPrint
to print detailed timings)

FAILURE: Build failed with an exception.

* What went wrong:
Execution failed for task ':src:functions:spotlessJava'.
> The following files had format violations:
      src/functions/src/main/java/org/apache/jmeter/functions/DigestEncodeFunction.java
          @@ -19,6 +19,7 @@
           package�org.apache.jmeter.functions;
           
           import�java.io.UnsupportedEncodingException;
          +import�java.nio.charset.StandardCharsets;
           import�java.security.MessageDigest;
           import�java.security.NoSuchAlgorithmException;
           import�java.util.Collection;
          @@ -33,7 +34,6 @@
           import�org.apache.jmeter.util.JMeterUtils;
           import�org.slf4j.Logger;
           import�org.slf4j.LoggerFactory;
          -import�java.nio.charset.StandardCharsets;
           
           /**
           �*�Digest�Encode�Function�that�provides�computing�of�different�SHA-XXX,�can
  Run 'gradlew spotlessApply' to fix these violations.

* Try:
Run with --info or --debug option to get more log output. Run with --scan to get full insights.

* Exception is:
org.gradle.api.tasks.TaskExecutionException: Execution failed for task ':src:functions:spotlessJava'.
	at org.gradle.api.internal.tasks.execution.ExecuteActionsTaskExecuter$3.accept(ExecuteActionsTaskExecuter.java:166)
	at org.gradle.api.internal.tasks.execution.ExecuteActionsTaskExecuter$3.accept(ExecuteActionsTaskExecuter.java:163)
	at org.gradle.internal.Try$Failure.ifSuccessfulOrElse(Try.java:191)
	at org.gradle.api.internal.tasks.execution.ExecuteActionsTaskExecuter.execute(ExecuteActionsTaskExecuter.java:156)
	at org.gradle.api.internal.tasks.execution.ValidatingTaskExecuter.execute(ValidatingTaskExecuter.java:62)
	at org.gradle.api.internal.tasks.execution.SkipEmptySourceFilesTaskExecuter.execute(SkipEmptySourceFilesTaskExecuter.java:108)
	at org.gradle.api.internal.tasks.execution.ResolveBeforeExecutionOutputsTaskExecuter.execute(ResolveBeforeExecutionOutputsTaskExecuter.java:67)
	at org.gradle.api.internal.tasks.execution.ResolveAfterPreviousExecutionStateTaskExecuter.execute(ResolveAfterPreviousExecutionStateTaskExecuter.java:46)
	at org.gradle.api.internal.tasks.execution.CleanupStaleOutputsExecuter.execute(CleanupStaleOutputsExecuter.java:94)
	at org.gradle.api.internal.tasks.execution.FinalizePropertiesTaskExecuter.execute(FinalizePropertiesTaskExecuter.java:46)
	at org.gradle.api.internal.tasks.execution.ResolveTaskExecutionModeExecuter.execute(ResolveTaskExecutionModeExecuter.java:95)
	at org.gradle.api.internal.tasks.execution.SkipTaskWithNoActionsExecuter.execute(SkipTaskWithNoActionsExecuter.java:57)
	at org.gradle.api.internal.tasks.execution.SkipOnlyIfTaskExecuter.execute(SkipOnlyIfTaskExecuter.java:56)
	at org.gradle.api.internal.tasks.execution.CatchExceptionTaskExecuter.execute(CatchExceptionTaskExecuter.java:36)
	at org.gradle.api.internal.tasks.execution.EventFiringTaskExecuter$1.executeTask(EventFiringTaskExecuter.java:77)
	at org.gradle.api.internal.tasks.execution.EventFiringTaskExecuter$1.call(EventFiringTaskExecuter.java:55)
	at org.gradle.api.internal.tasks.execution.EventFiringTaskExecuter$1.call(EventFiringTaskExecuter.java:52)
	at org.gradle.internal.operations.DefaultBuildOperationExecutor$CallableBuildOperationWorker.execute(DefaultBuildOperationExecutor.java:416)
	at org.gradle.internal.operations.DefaultBuildOperationExecutor$CallableBuildOperationWorker.execute(DefaultBuildOperationExecutor.java:406)
	at org.gradle.internal.operations.DefaultBuildOperationExecutor$1.execute(DefaultBuildOperationExecutor.java:165)
	at org.gradle.internal.operations.DefaultBuildOperationExecutor.execute(DefaultBuildOperationExecutor.java:250)
	at org.gradle.internal.operations.DefaultBuildOperationExecutor.execute(DefaultBuildOperationExecutor.java:158)
	at org.gradle.internal.operations.DefaultBuildOperationExecutor.call(DefaultBuildOperationExecutor.java:102)
	at org.gradle.internal.operations.DelegatingBuildOperationExecutor.call(DelegatingBuildOperationExecutor.java:36)
	at org.gradle.api.internal.tasks.execution.EventFiringTaskExecuter.execute(EventFiringTaskExecuter.java:52)
	at org.gradle.execution.plan.LocalTaskNodeExecutor.execute(LocalTaskNodeExecutor.java:43)
	at org.gradle.execution.taskgraph.DefaultTaskExecutionGraph$InvokeNodeExecutorsAction.execute(DefaultTaskExecutionGraph.java:355)
	at org.gradle.execution.taskgraph.DefaultTaskExecutionGraph$InvokeNodeExecutorsAction.execute(DefaultTaskExecutionGraph.java:343)
	at org.gradle.execution.taskgraph.DefaultTaskExecutionGraph$BuildOperationAwareExecutionAction.execute(DefaultTaskExecutionGraph.java:336)
	at org.gradle.execution.taskgraph.DefaultTaskExecutionGraph$BuildOperationAwareExecutionAction.execute(DefaultTaskExecutionGraph.java:322)
	at org.gradle.execution.plan.DefaultPlanExecutor$ExecutorWorker$1.execute(DefaultPlanExecutor.java:134)
	at org.gradle.execution.plan.DefaultPlanExecutor$ExecutorWorker$1.execute(DefaultPlanExecutor.java:129)
	at org.gradle.execution.plan.DefaultPlanExecutor$ExecutorWorker.execute(DefaultPlanExecutor.java:202)
	at org.gradle.execution.plan.DefaultPlanExecutor$ExecutorWorker.executeNextNode(DefaultPlanExecutor.java:193)
	at org.gradle.execution.plan.DefaultPlanExecutor$ExecutorWorker.run(DefaultPlanExecutor.java:129)
	at org.gradle.internal.concurrent.ExecutorPolicy$CatchAndRecordFailures.onExecute(ExecutorPolicy.java:64)
	at org.gradle.internal.concurrent.ManagedExecutorImpl$1.run(ManagedExecutorImpl.java:48)
	at org.gradle.internal.concurrent.ThreadFactoryImpl$ManagedThreadRunnable.run(ThreadFactoryImpl.java:56)
Caused by: org.gradle.api.GradleException: The following files had format violations:
    src/functions/src/main/java/org/apache/jmeter/functions/DigestEncodeFunction.java
        @@ -19,6 +19,7 @@
         package�org.apache.jmeter.functions;
         
         import�java.io.UnsupportedEncodingException;
        +import�java.nio.charset.StandardCharsets;
         import�java.security.MessageDigest;
         import�java.security.NoSuchAlgorithmException;
         import�java.util.Collection;
        @@ -33,7 +34,6 @@
         import�org.apache.jmeter.util.JMeterUtils;
         import�org.slf4j.Logger;
         import�org.slf4j.LoggerFactory;
        -import�java.nio.charset.StandardCharsets;
         
         /**
         �*�Digest�Encode�Function�that�provides�computing�of�different�SHA-XXX,�can
Run 'gradlew spotlessApply' to fix these violations.
	at com.diffplug.gradle.spotless.SpotlessTask.formatViolationsFor(SpotlessTask.java:334)
	at com.diffplug.gradle.spotless.SpotlessTask.check(SpotlessTask.java:321)
	at com.diffplug.gradle.spotless.SpotlessTask.performAction(SpotlessTask.java:250)
	at org.gradle.internal.reflect.JavaMethod.invoke(JavaMethod.java:103)
	at org.gradle.api.internal.project.taskfactory.IncrementalTaskInputsTaskAction.doExecute(IncrementalTaskInputsTaskAction.java:47)
	at org.gradle.api.internal.project.taskfactory.StandardTaskAction.execute(StandardTaskAction.java:42)
	at org.gradle.api.internal.project.taskfactory.AbstractIncrementalTaskAction.execute(AbstractIncrementalTaskAction.java:25)
	at org.gradle.api.internal.project.taskfactory.StandardTaskAction.execute(StandardTaskAction.java:28)
	at org.gradle.api.internal.tasks.execution.ExecuteActionsTaskExecuter$5.run(ExecuteActionsTaskExecuter.java:476)
	at org.gradle.internal.operations.DefaultBuildOperationExecutor$RunnableBuildOperationWorker.execute(DefaultBuildOperationExecutor.java:402)
	at org.gradle.internal.operations.DefaultBuildOperationExecutor$RunnableBuildOperationWorker.execute(DefaultBuildOperationExecutor.java:394)
	at org.gradle.internal.operations.DefaultBuildOperationExecutor$1.execute(DefaultBuildOperationExecutor.java:165)
	at org.gradle.internal.operations.DefaultBuildOperationExecutor.execute(DefaultBuildOperationExecutor.java:250)
	at org.gradle.internal.operations.DefaultBuildOperationExecutor.execute(DefaultBuildOperationExecutor.java:158)
	at org.gradle.internal.operations.DefaultBuildOperationExecutor.run(DefaultBuildOperationExecutor.java:92)
	at org.gradle.internal.operations.DelegatingBuildOperationExecutor.run(DelegatingBuildOperationExecutor.java:31)
	at org.gradle.api.internal.tasks.execution.ExecuteActionsTaskExecuter.executeAction(ExecuteActionsTaskExecuter.java:461)
	at org.gradle.api.internal.tasks.execution.ExecuteActionsTaskExecuter.executeActions(ExecuteActionsTaskExecuter.java:444)
	at org.gradle.api.internal.tasks.execution.ExecuteActionsTaskExecuter.access$200(ExecuteActionsTaskExecuter.java:93)
	at org.gradle.api.internal.tasks.execution.ExecuteActionsTaskExecuter$TaskExecution.execute(ExecuteActionsTaskExecuter.java:237)
	at org.gradle.internal.execution.steps.ExecuteStep.lambda$execute$0(ExecuteStep.java:32)
	at org.gradle.internal.execution.steps.ExecuteStep.execute(ExecuteStep.java:32)
	at org.gradle.internal.execution.steps.ExecuteStep.execute(ExecuteStep.java:26)
	at org.gradle.internal.execution.steps.CleanupOutputsStep.execute(CleanupOutputsStep.java:58)
	at org.gradle.internal.execution.steps.CleanupOutputsStep.execute(CleanupOutputsStep.java:35)
	at org.gradle.internal.execution.steps.ResolveInputChangesStep.execute(ResolveInputChangesStep.java:48)
	at org.gradle.internal.execution.steps.ResolveInputChangesStep.execute(ResolveInputChangesStep.java:33)
	at org.gradle.internal.execution.steps.CancelExecutionStep.execute(CancelExecutionStep.java:39)
	at org.gradle.internal.execution.steps.TimeoutStep.executeWithoutTimeout(TimeoutStep.java:73)
	at org.gradle.internal.execution.steps.TimeoutStep.execute(TimeoutStep.java:54)
	at org.gradle.internal.execution.steps.CatchExceptionStep.execute(CatchExceptionStep.java:35)
	at org.gradle.internal.execution.steps.CreateOutputsStep.execute(CreateOutputsStep.java:51)
	at org.gradle.internal.execution.steps.SnapshotOutputsStep.execute(SnapshotOutputsStep.java:45)
	at org.gradle.internal.execution.steps.SnapshotOutputsStep.execute(SnapshotOutputsStep.java:31)
	at org.gradle.internal.execution.steps.CacheStep.executeWithoutCache(CacheStep.java:208)
	at org.gradle.internal.execution.steps.CacheStep.execute(CacheStep.java:70)
	at org.gradle.internal.execution.steps.CacheStep.execute(CacheStep.java:45)
	at org.gradle.internal.execution.steps.BroadcastChangingOutputsStep.execute(BroadcastChangingOutputsStep.java:49)
	at org.gradle.internal.execution.steps.StoreSnapshotsStep.execute(StoreSnapshotsStep.java:43)
	at org.gradle.internal.execution.steps.StoreSnapshotsStep.execute(StoreSnapshotsStep.java:32)
	at org.gradle.internal.execution.steps.RecordOutputsStep.execute(RecordOutputsStep.java:38)
	at org.gradle.internal.execution.steps.RecordOutputsStep.execute(RecordOutputsStep.java:24)
	at org.gradle.internal.execution.steps.SkipUpToDateStep.executeBecause(SkipUpToDateStep.java:96)
	at org.gradle.internal.execution.steps.SkipUpToDateStep.lambda$execute$0(SkipUpToDateStep.java:89)
	at org.gradle.internal.execution.steps.SkipUpToDateStep.execute(SkipUpToDateStep.java:54)
	at org.gradle.internal.execution.steps.SkipUpToDateStep.execute(SkipUpToDateStep.java:38)
	at org.gradle.internal.execution.steps.ResolveChangesStep.execute(ResolveChangesStep.java:76)
	at org.gradle.internal.execution.steps.ResolveChangesStep.execute(ResolveChangesStep.java:37)
	at org.gradle.internal.execution.steps.legacy.MarkSnapshottingInputsFinishedStep.execute(MarkSnapshottingInputsFinishedStep.java:36)
	at org.gradle.internal.execution.steps.legacy.MarkSnapshottingInputsFinishedStep.execute(MarkSnapshottingInputsFinishedStep.java:26)
	at org.gradle.internal.execution.steps.ResolveCachingStateStep.execute(ResolveCachingStateStep.java:90)
	at org.gradle.internal.execution.steps.ResolveCachingStateStep.execute(ResolveCachingStateStep.java:48)
	at org.gradle.internal.execution.steps.CaptureStateBeforeExecutionStep.execute(CaptureStateBeforeExecutionStep.java:69)
	at org.gradle.internal.execution.steps.CaptureStateBeforeExecutionStep.execute(CaptureStateBeforeExecutionStep.java:47)
	at org.gradle.internal.execution.impl.DefaultWorkExecutor.execute(DefaultWorkExecutor.java:33)
	at org.gradle.api.internal.tasks.execution.ExecuteActionsTaskExecuter.execute(ExecuteActionsTaskExecuter.java:140)
	... 34 more


* Get more help at https://help.gradle.org

Deprecated Gradle features were used in this build, making it incompatible with Gradle 6.0.
Use '--warning-mode all' to show the individual deprecation warnings.
See https://docs.gradle.org/5.6.2/userguide/command_line_interface.html#sec:command_line_warnings

BUILD FAILED in 35s
117 actionable tasks: 64 executed, 53 up-to-date

See the profiling report at: file://<https://builds.apache.org/job/JMeter-trunk/ws/build/reports/profile/profile-2019-10-06-20-53-58.html>
A fine-grained performance profile is available: use the --scan option.
Build step 'Invoke Gradle script' changed build result to FAILURE
Build step 'Invoke Gradle script' marked build as failure
Xvfb stopping
Archiving artifacts
[Fast Archiver] Compressed 308.75 MB of artifacts by 100.0% relative to #7480
Recording test results
ERROR: Step ?Publish JUnit test result report? failed: No test report files were found. Configuration
error?

Mime
View raw message