jmeter-dev mailing list archives

Site index · List index
Message view « Date » · « Thread »
Top « Date » · « Thread »
From Apache Jenkins Server <jenk...@builds.apache.org>
Subject Build failed in Jenkins: JMeter-trunk #7690
Date Sat, 28 Mar 2020 23:23:07 GMT
See <https://builds.apache.org/job/JMeter-trunk/7690/display/redirect?page=changes>

Changes:

[pmouawad] Bug 64277 - ForEach Controller: Improve UX


------------------------------------------
[...truncated 40.18 KB...]
> Task :autostyleJavaCheck NO-SOURCE
> Task :src:testkit-wiremock:autostyleJavaCheck
> Task :src:bshclient:autostyleJavaCheck
> Task :src:generator:autostyleJavaCheck
> Task :src:testkit:autostyleJavaCheck
> Task :src:protocol:bolt:autostyleJavaCheck
> Task :src:protocol:bolt:autostyleKotlinGradleCheck NO-SOURCE
> Task :src:launcher:autostyleJavaCheck
> Task :src:protocol:bolt:autostyleMarkdownCheck NO-SOURCE
> Task :src:protocol:bolt:autostyleCheck
> Task :src:protocol:jms:autostyleConfigsCheck NO-SOURCE
> Task :src:protocol:ftp:autostyleJavaCheck
> Task :src:protocol:ftp:autostyleKotlinGradleCheck NO-SOURCE
> Task :src:protocol:ftp:autostyleMarkdownCheck NO-SOURCE
> Task :src:protocol:ftp:autostyleCheck
> Task :src:protocol:junit:autostyleConfigsCheck NO-SOURCE
> Task :src:examples:autostyleJavaCheck
> Task :src:dist-check:autostyleJavaCheck
> Task :src:protocol:jdbc:autostyleJavaCheck
> Task :src:protocol:junit:autostyleJavaCheck
> Task :src:protocol:jdbc:autostyleKotlinGradleCheck NO-SOURCE
> Task :src:protocol:junit:autostyleKotlinGradleCheck NO-SOURCE
> Task :src:protocol:junit:autostyleMarkdownCheck NO-SOURCE
> Task :src:protocol:junit:autostyleCheck
> Task :src:protocol:jdbc:autostyleMarkdownCheck NO-SOURCE
> Task :src:protocol:jdbc:autostyleCheck
> Task :src:protocol:junit-sample:autostyleConfigsCheck NO-SOURCE
> Task :src:protocol:ldap:autostyleConfigsCheck NO-SOURCE
> Task :src:protocol:java:autostyleJavaCheck
> Task :src:protocol:java:autostyleKotlinGradleCheck NO-SOURCE
> Task :src:protocol:java:autostyleMarkdownCheck NO-SOURCE
> Task :src:protocol:java:autostyleCheck
> Task :src:protocol:mail:autostyleConfigsCheck NO-SOURCE

> Task :src:jorphan:compileJava
<https://builds.apache.org/job/JMeter-trunk/ws/src/jorphan/src/main/java/org/apache/jorphan/gui/JMeterUIDefaults.java>:37:
warning: FontDesignMetrics is internal proprietary API and may be removed in a future release
import sun.font.FontDesignMetrics;
               ^

> Task :src:protocol:junit-sample:autostyleJavaCheck
> Task :src:protocol:junit-sample:autostyleKotlinGradleCheck NO-SOURCE
> Task :src:protocol:junit-sample:autostyleMarkdownCheck NO-SOURCE
> Task :src:protocol:junit-sample:autostyleCheck
> Task :src:protocol:junit-sample:processTestResources NO-SOURCE
> Task :src:protocol:mongodb:autostyleConfigsCheck
> Task :src:protocol:jms:autostyleJavaCheck
> Task :src:protocol:jms:autostyleKotlinGradleCheck NO-SOURCE
> Task :src:protocol:jms:autostyleMarkdownCheck NO-SOURCE
> Task :src:protocol:jms:autostyleCheck
> Task :src:protocol:native:autostyleConfigsCheck NO-SOURCE
> Task :src:protocol:native:autostyleJavaCheck
> Task :src:protocol:native:autostyleKotlinGradleCheck NO-SOURCE
> Task :src:protocol:native:autostyleMarkdownCheck NO-SOURCE
> Task :src:protocol:native:autostyleCheck
> Task :src:protocol:tcp:autostyleConfigsCheck NO-SOURCE
> Task :src:protocol:mongodb:autostyleJavaCheck
> Task :src:protocol:mongodb:autostyleKotlinGradleCheck NO-SOURCE
> Task :src:protocol:mongodb:autostyleMarkdownCheck NO-SOURCE
> Task :src:protocol:mongodb:autostyleCheck
> Task :src:protocol:mail:autostyleJavaCheck
> Task :src:protocol:mail:autostyleKotlinGradleCheck NO-SOURCE
> Task :src:protocol:mail:autostyleMarkdownCheck NO-SOURCE
> Task :src:protocol:mail:autostyleCheck
> Task :src:protocol:ldap:autostyleJavaCheck
> Task :src:protocol:ldap:autostyleKotlinGradleCheck NO-SOURCE
> Task :src:protocol:ldap:autostyleMarkdownCheck NO-SOURCE
> Task :src:protocol:ldap:autostyleCheck
> Task :src:protocol:tcp:autostyleJavaCheck
> Task :src:protocol:tcp:autostyleKotlinGradleCheck NO-SOURCE
> Task :src:protocol:tcp:autostyleMarkdownCheck NO-SOURCE
> Task :src:protocol:tcp:autostyleCheck
> Task :src:functions:autostyleJavaCheck

> Task :src:jorphan:compileJava
<https://builds.apache.org/job/JMeter-trunk/ws/src/jorphan/src/main/java/org/apache/jorphan/gui/JMeterUIDefaults.java>:172:
warning: FontDesignMetrics is internal proprietary API and may be removed in a future release
            return FontDesignMetrics.getMetrics(f).getHeight();
                   ^
Note: <https://builds.apache.org/job/JMeter-trunk/ws/src/jorphan/src/main/java/org/apache/jorphan/gui/DynamicStyle.java>
uses unchecked or unsafe operations.
Note: Recompile with -Xlint:unchecked for details.
2 warnings

> Task :src:jorphan:compileGroovy NO-SOURCE
> Task :src:jorphan:processResources UP-TO-DATE
> Task :src:jorphan:classes
> Task :src:jorphan:jar
> Task :src:jorphan:compileTestJava UP-TO-DATE
> Task :src:bshclient:autostyleKotlinGradleCheck
> Task :src:testkit:autostyleKotlinGradleCheck
> Task :src:generator:autostyleKotlinGradleCheck
> Task :src:testkit-wiremock:autostyleKotlinGradleCheck
> Task :src:examples:autostyleKotlinGradleCheck
> Task :src:bshclient:autostyleMarkdownCheck NO-SOURCE
> Task :src:bshclient:autostyleCheck
> Task :src:generator:autostyleMarkdownCheck NO-SOURCE
> Task :src:testkit-wiremock:autostyleMarkdownCheck NO-SOURCE
> Task :src:testkit:autostyleMarkdownCheck NO-SOURCE
> Task :src:generator:autostyleCheck
> Task :src:testkit:autostyleCheck
> Task :src:testkit-wiremock:autostyleCheck
> Task :src:examples:autostyleMarkdownCheck NO-SOURCE
> Task :src:generator:processTestResources NO-SOURCE
> Task :src:examples:autostyleCheck
> Task :src:bshclient:compileJava UP-TO-DATE
> Task :src:bshclient:processResources NO-SOURCE
> Task :src:bshclient:classes UP-TO-DATE
> Task :src:functions:autostyleKotlinGradleCheck
> Task :src:functions:autostyleMarkdownCheck NO-SOURCE
> Task :src:functions:autostyleCheck
> Task :src:examples:processResources UP-TO-DATE
> Task :src:examples:processTestResources NO-SOURCE
> Task :src:launcher:autostyleKotlinGradleCheck
> Task :src:launcher:autostyleMarkdownCheck NO-SOURCE
> Task :src:launcher:autostyleCheck
> Task :src:protocol:http:autostyleJavaCheck
> Task :src:protocol:http:autostyleKotlinGradleCheck NO-SOURCE
> Task :src:protocol:http:autostyleMarkdownCheck NO-SOURCE
> Task :src:protocol:http:autostyleCheck
> Task :src:config:autostyleKotlinGradleCheck
> Task :src:config:autostyleMarkdownCheck NO-SOURCE
> Task :src:config:autostyleCheck
> Task :src:config:compileJava NO-SOURCE
> Task :src:config:processResources NO-SOURCE
> Task :src:config:classes UP-TO-DATE
> Task :src:config:checkstyleMain NO-SOURCE
> Task :src:release:autostyleKotlinGradleCheck
> Task :src:config:compileTestJava NO-SOURCE
> Task :src:release:autostyleMarkdownCheck NO-SOURCE
> Task :src:release:autostyleCheck
> Task :src:config:processTestResources NO-SOURCE
> Task :src:config:testClasses UP-TO-DATE
> Task :src:release:compileJava NO-SOURCE
> Task :src:config:checkstyleTest NO-SOURCE
> Task :src:release:processResources NO-SOURCE
> Task :src:release:classes UP-TO-DATE
> Task :src:config:spotbugsMain NO-SOURCE
> Task :src:release:checkstyleMain NO-SOURCE
> Task :src:config:spotbugsTest NO-SOURCE
> Task :src:release:compileTestJava NO-SOURCE
> Task :src:config:test NO-SOURCE
> Task :src:config:check
> Task :src:release:processTestResources NO-SOURCE
> Task :src:release:testClasses UP-TO-DATE
> Task :src:release:checkstyleTest NO-SOURCE
> Task :src:release:spotbugsMain NO-SOURCE
> Task :src:release:spotbugsTest NO-SOURCE
> Task :src:release:test NO-SOURCE
> Task :src:release:check
> Task :src:bshclient:checkstyleMain UP-TO-DATE
> Task :src:testkit:checkstyleMain UP-TO-DATE
> Task :src:testkit:compileTestJava NO-SOURCE
> Task :src:testkit:processTestResources NO-SOURCE
> Task :src:testkit-wiremock:checkstyleMain UP-TO-DATE
> Task :src:testkit:testClasses UP-TO-DATE
> Task :src:release:jar UP-TO-DATE
> Task :src:release:assemble UP-TO-DATE
> Task :src:bshclient:compileTestJava NO-SOURCE
> Task :src:testkit:checkstyleTest NO-SOURCE
> Task :src:testkit:checkstyleTestFixtures NO-SOURCE
> Task :src:bshclient:processTestResources NO-SOURCE
> Task :src:bshclient:testClasses UP-TO-DATE
> Task :src:bshclient:checkstyleTest NO-SOURCE
> Task :src:testkit-wiremock:compileTestJava NO-SOURCE
> Task :src:testkit-wiremock:processTestResources NO-SOURCE
> Task :src:bom:autostyleKotlinGradleCheck
> Task :src:testkit-wiremock:testClasses UP-TO-DATE
> Task :src:bom:autostyleMarkdownCheck NO-SOURCE
> Task :src:testkit-wiremock:checkstyleTest NO-SOURCE
> Task :src:bom:autostyleCheck
> Task :src:bom:check
> Task :src:testkit-wiremock:checkstyleTestFixtures NO-SOURCE
> Task :src:launcher:checkstyleMain UP-TO-DATE
> Task :src:bom:assemble UP-TO-DATE
> Task :src:protocol:autostyleKotlinGradleCheck
> Task :src:launcher:compileTestJava NO-SOURCE
> Task :src:protocol:autostyleMarkdownCheck NO-SOURCE
> Task :src:protocol:autostyleCheck
> Task :src:launcher:processTestResources NO-SOURCE
> Task :src:launcher:testClasses UP-TO-DATE
> Task :src:launcher:checkstyleTest NO-SOURCE
> Task :src:protocol:compileJava NO-SOURCE
> Task :src:protocol:processResources NO-SOURCE
> Task :src:protocol:classes UP-TO-DATE
> Task :src:protocol:checkstyleMain NO-SOURCE
> Task :src:protocol:compileTestJava NO-SOURCE
> Task :src:autostyleKotlinGradleCheck
> Task :src:protocol:processTestResources NO-SOURCE
> Task :src:protocol:testClasses UP-TO-DATE
> Task :src:autostyleMarkdownCheck NO-SOURCE
> Task :src:autostyleCheck
> Task :src:protocol:checkstyleTest NO-SOURCE
> Task :src:check
> Task :src:assemble UP-TO-DATE
> Task :src:protocol:spotbugsMain NO-SOURCE
> Task :src:protocol:spotbugsTest NO-SOURCE
> Task :src:protocol:test NO-SOURCE
> Task :src:protocol:check
> Task :src:protocol:jar UP-TO-DATE
> Task :src:protocol:assemble UP-TO-DATE
> Task :src:licenses:autostyleKotlinGradleCheck
> Task :src:components:autostyleJavaCheck FAILED
> Task :src:dist-check:autostyleKotlinGradleCheck
> Task :src:licenses:autostyleMarkdownCheck NO-SOURCE
> Task :src:bshclient:spotbugsMain UP-TO-DATE
> Task :src:testkit:spotbugsMain UP-TO-DATE
> Task :src:launcher:spotbugsMain UP-TO-DATE
> Task :src:testkit-wiremock:spotbugsMain UP-TO-DATE
> Task :src:dist:autostyleKotlinGradleCheck
> Task :autostyleKotlinGradleCheck
> Task :src:core:autostyleJavaCheck
> Task :src:jorphan:compileTestGroovy
checksum-dependency elapsed time: 8374ms, configurations processed: 114 (add -PchecksumTimingsPrint
to print detailed timings)

FAILURE: Build failed with an exception.

* What went wrong:
Execution failed for task ':src:components:autostyleJavaCheck'.
> The following files have format violations:
    src/components/src/main/java/org/apache/jmeter/control/gui/ForeachControlPanel.java
      @@ -211,7 +211,7 @@
               loopPanel.add(JMeterUtils.labelFor(endIndex, "foreach_end_index"));
               endIndex.setName(END_INDEX_NAME);
               loopPanel.add(endIndex);
      -��������\n
      +\n
               // TEXT FIELD
               returnVal = new JTextField("", 5); // $NON-NLS-1$
               loopPanel.add(JMeterUtils.labelFor(returnVal, "foreach_output"));
  Run './gradlew autostyleApply' to fix the violations.

* Try:
Run with --stacktrace option to get the stack trace. Run with --info or --debug option to
get more log output. Run with --scan to get full insights.

* Get more help at https://help.gradle.org

Deprecated Gradle features were used in this build, making it incompatible with Gradle 7.0.
Use '--warning-mode all' to show the individual deprecation warnings.
See https://docs.gradle.org/6.3/userguide/command_line_interface.html#sec:command_line_warnings

BUILD FAILED in 50s
125 actionable tasks: 77 executed, 48 up-to-date

See the profiling report at: file://<https://builds.apache.org/job/JMeter-trunk/ws/build/reports/profile/profile-2020-03-28-23-22-19.html>
A fine-grained performance profile is available: use the --scan option.
Build step 'Invoke Gradle script' changed build result to FAILURE
Build step 'Invoke Gradle script' marked build as failure
Xvfb stopping
Archiving artifacts
Recording test results
ERROR: Step ?Publish JUnit test result report? failed: No test report files were found. Configuration
error?

Mime
View raw message