jmeter-dev mailing list archives

Site index · List index
Message view « Date » · « Thread »
Top « Date » · « Thread »
From Apache Jenkins Server <jenk...@builds.apache.org>
Subject Build failed in Jenkins: JMeter-trunk #7648
Date Tue, 03 Mar 2020 21:26:33 GMT
See <https://builds.apache.org/job/JMeter-trunk/7648/display/redirect?page=changes>

Changes:

[felix.schumacher] correct typo

[felix.schumacher] Markup changes for code

[felix.schumacher] Use better suited domain names for examples

[felix.schumacher] Markup changes

[felix.schumacher] The button is called 'Create Test Plan'


------------------------------------------
[...truncated 176.83 KB...]
    user.dir=<https://builds.apache.org/job/JMeter-trunk/ws/src/components>
    user.language=en
    user.region=null
    user.country=US
    user.variant=
    Locale=en_US
    java.class.version=52.0
    java.awt.headless=null
    os.name=Linux
    os.version=4.15.0-76-generic
    os.arch=amd64
          2.5sec,    4 completed,   0 failed,   0 skipped, org.apache.jmeter.visualizers.backend.influxdb.HttpMetricsSenderTest
          0.0sec,    2 completed,   0 failed,   0 skipped, org.apache.jmeter.visualizers.backend.SamplerMetricTimedModeTest
          0.0sec,    2 completed,   0 failed,   0 skipped, org.apache.jmeter.visualizers.TestSamplingStatCalculator
          0.0sec,    6 completed,   0 failed,   0 skipped, org.apache.jmeter.control.TestInterleaveControl
WARNING   1.2sec,    8 completed,   0 failed,   1 skipped, org.apache.jmeter.control.TestIfController
          0.0sec,    4 completed,   0 failed,   0 skipped, org.apache.jmeter.control.TestOnceOnlyController
          0.1sec,    4 completed,   0 failed,   0 skipped, org.apache.jmeter.control.TestLoopController
          0.0sec,    1 completed,   0 failed,   0 skipped, org.apache.jmeter.control.TestGenericController
          0.0sec,    3 completed,   0 failed,   0 skipped, org.apache.jmeter.control.TestRandomController
          0.0sec,   12 completed,   0 failed,   0 skipped, org.apache.jmeter.control.TestWhileController
          0.1sec,    1 completed,   0 failed,   0 skipped, org.apache.jmeter.control.TestTransactionController
          0.0sec,    4 completed,   0 failed,   0 skipped, org.apache.jmeter.extractor.TestBoundaryExtractor
          0.2sec,   14 completed,   0 failed,   0 skipped, org.apache.jmeter.extractor.TestHtmlExtractorJodd
          0.1sec,   25 completed,   0 failed,   0 skipped, org.apache.jmeter.extractor.TestRegexExtractor
          0.9sec,    7 completed,   0 failed,   0 skipped, org.apache.jmeter.extractor.TestXPath2Extractor
          0.3sec,    6 completed,   0 failed,   0 skipped, org.apache.jmeter.extractor.TestXPathExtractor
          0.1sec,    9 completed,   0 failed,   0 skipped, org.apache.jmeter.extractor.TestJSONPostProcessor
          0.2sec,   14 completed,   0 failed,   0 skipped, org.apache.jmeter.extractor.TestHtmlExtractorJSoup
          0.0sec,    5 completed,   0 failed,   0 skipped, org.apache.jmeter.reporters.TestResultSaver
          0.1sec,   10 completed,   0 failed,   0 skipped, org.apache.jmeter.assertions.ResponseAssertionTest
          0.1sec,    7 completed,   0 failed,   0 skipped, org.apache.jmeter.assertions.gui.TestJSONPathAssertionGui
          0.2sec,   29 completed,   0 failed,   0 skipped, org.apache.jmeter.assertions.XPathAssertionTest
          0.0sec,    6 completed,   0 failed,   0 skipped, org.apache.jmeter.assertions.SizeAssertionTest
          0.0sec,    4 completed,   0 failed,   0 skipped, org.apache.jmeter.assertions.DurationAssertionTest
          0.1sec,    7 completed,   0 failed,   0 skipped, org.apache.jmeter.assertions.jmespath.gui.JMESPathAssertionGuiTest
          0.1sec,   14 completed,   0 failed,   0 skipped, org.apache.jmeter.assertions.XPath2AssertionTest
          0.9sec,    6 completed,   0 failed,   0 skipped, org.apache.jmeter.assertions.SMIMEAssertionTest
          0.0sec,   25 completed,   0 failed,   0 skipped, org.apache.jmeter.assertions.TestJSONPathAssertion
          0.3sec,    9 completed,   0 failed,   0 skipped, org.apache.jmeter.assertions.XMLSchemaAssertionTest
          0.0sec,    4 completed,   0 failed,   0 skipped, org.apache.jmeter.assertions.XmlAssertionTest
          0.0sec,    9 completed,   0 failed,   0 skipped, org.apache.jmeter.visualizers.TestSampleCompareTo
          0.3sec,   10 completed,   0 failed,   0 skipped, org.apache.jmeter.extractor.json.jmespath.TestJMESPathExtractor$SourceVarOrResponse
          0.0sec,   10 completed,   0 failed,   0 skipped, org.apache.jmeter.extractor.json.jmespath.TestJMESPathExtractor$MatchNumberMoreThanZeroOn1ExtractedValue
          0.0sec,    6 completed,   0 failed,   0 skipped, org.apache.jmeter.extractor.json.jmespath.TestJMESPathExtractor$MultipleMatchesOnAllExtractedValues
          0.0sec,    6 completed,   0 failed,   0 skipped, org.apache.jmeter.extractor.json.jmespath.TestJMESPathExtractor$OneMatchOnAllExtractedValues
          0.3sec,   32 completed,   0 failed,   0 skipped, org.apache.jmeter.extractor.json.jmespath.TestJMESPathExtractor
          0.0sec,   27 completed,   0 failed,   0 skipped, org.apache.jmeter.assertions.jmespath.TestJMESPathAssertion$TestAssertion
          0.0sec,   27 completed,   0 failed,   0 skipped, org.apache.jmeter.assertions.jmespath.TestJMESPathAssertion
          0.1sec,    6 completed,   0 failed,   0 skipped, org.apache.jmeter.timers.UniformRandomTimerSpec
          0.1sec,    3 completed,   0 failed,   0 skipped, org.apache.jmeter.visualizers.backend.influxdb.InfluxdbBackendListenerClientSpec
          0.4sec,    5 completed,   0 failed,   0 skipped, org.apache.jmeter.visualizers.backend.graphite.TextGraphiteMetricsSenderSpec
          0.1sec,    7 completed,   0 failed,   0 skipped, org.apache.jmeter.visualizers.backend.graphite.PickleGraphiteMetricsSenderSpec
          0.1sec,    4 completed,   0 failed,   0 skipped, org.apache.jmeter.control.RandomOrderControllerSpec
          1.1sec,    5 completed,   0 failed,   0 skipped, org.apache.jmeter.control.RunTimeSpec
          0.1sec,    8 completed,   0 failed,   0 skipped, org.apache.jmeter.control.ThroughputControllerSpec
          0.0sec,    4 completed,   0 failed,   0 skipped, org.apache.jmeter.extractor.JoddExtractorSpec
          0.8sec,    8 completed,   0 failed,   0 skipped, org.apache.jmeter.extractor.json.render.RenderAsJmesPathRendererSpec
          0.1sec,    8 completed,   0 failed,   0 skipped, org.apache.jmeter.extractor.json.render.RenderAsJsonRendererSpec
          0.2sec,   37 completed,   0 failed,   0 skipped, org.apache.jmeter.extractor.BoundaryExtractorSpec
          0.3sec,    5 completed,   0 failed,   0 skipped, org.apache.jmeter.assertions.gui.AssertionGuiSpec
          0.1sec,    7 completed,   0 failed,   0 skipped, org.apache.jmeter.assertions.CompareAssertionSpec
          0.0sec,    7 completed,   0 failed,   0 skipped, org.apache.jmeter.assertions.MD5HexAssertionSpec
WARNING  22.2sec,  487 completed,   0 failed,   1 skipped, Gradle
Test Run :src:components:test

> Task :src:components:check
> Task :src:components:jar UP-TO-DATE
> Task :src:components:testJar UP-TO-DATE
> Task :src:components:assemble UP-TO-DATE
> Task :src:functions:compileJava UP-TO-DATE
> Task :src:protocol:http:compileJava UP-TO-DATE
> Task :src:functions:compileGroovy NO-SOURCE
> Task :src:functions:classes UP-TO-DATE
> Task :src:protocol:http:compileGroovy NO-SOURCE
> Task :src:protocol:http:classes UP-TO-DATE
> Task :src:dist:compileJava NO-SOURCE
> Task :src:dist:classes UP-TO-DATE
> Task :src:dist:checkstyleMain NO-SOURCE
> Task :src:functions:jar UP-TO-DATE
> Task :src:protocol:http:jar UP-TO-DATE
> Task :src:dist:jar UP-TO-DATE
> Task :src:dist:spotbugsMain NO-SOURCE
> Task :src:dist-check:compileJava NO-SOURCE
> Task :src:dist-check:compileGroovy NO-SOURCE
> Task :src:dist-check:classes UP-TO-DATE
> Task :src:dist-check:checkstyleMain NO-SOURCE
> Task :src:dist-check:spotbugsMain NO-SOURCE
> Task :src:functions:compileTestJava UP-TO-DATE
> Task :src:dist-check:jar UP-TO-DATE
> Task :src:dist-check:assemble UP-TO-DATE
> Task :src:protocol:http:compileTestJava UP-TO-DATE
> Task :src:dist:populateLibs
> Task :src:dist:copyBinLibs UP-TO-DATE
> Task :src:functions:compileTestGroovy
> Task :src:functions:testClasses
> Task :src:functions:testJar UP-TO-DATE
> Task :src:dist:copyLibs
> Task :src:dist:createDist
> Task :src:functions:checkstyleMain
> Task :src:dist-check:copyExtraTestLibs
> Task :src:functions:checkstyleTest
> Task :src:licenses:gatherBinaryLicenses
> Task :src:licenses:renderLicenseForBinary UP-TO-DATE
> Task :src:licenses:renderLicenseForBinaryCopySpec
> Task :src:licenses:binLicenseDir UP-TO-DATE
> Task :src:licenses:assemble UP-TO-DATE
> Task :src:protocol:http:compileTestGroovy
> Task :src:protocol:http:testClasses
> Task :src:protocol:http:testJar UP-TO-DATE
> Task :src:protocol:http:checkstyleMain
> Task :src:protocol:http:checkstyleTest
> Task :src:dist-check:batchBUG_62847
> Task :src:dist-check:compileTestJava UP-TO-DATE
> Task :src:dist-check:compileTestGroovy
> Task :src:dist-check:testClasses
> Task :src:dist-check:checkstyleTest
> Task :src:generator:spotbugsMain
> Task :src:generator:spotbugsTest NO-SOURCE
> Task :src:generator:test NO-SOURCE
> Task :src:generator:check
> Task :src:examples:spotbugsMain
> Task :src:examples:spotbugsTest NO-SOURCE
> Task :src:examples:test NO-SOURCE
> Task :src:examples:check

> Task :src:functions:spotbugsMain
SpotBugs rule violations were found. See the report at: file://<https://builds.apache.org/job/JMeter-trunk/ws/src/functions/build/reports/spotbugs/main.xml>

> Task :src:dist-check:spotbugsTest
SpotBugs rule violations were found. See the report at: file://<https://builds.apache.org/job/JMeter-trunk/ws/src/dist-check/build/reports/spotbugs/test.xml>

> Task :src:dist:javadocAggregate
> Task :src:protocol:http:spotbugsMain

> Task :src:functions:spotbugsTest
SpotBugs rule violations were found. See the report at: file://<https://builds.apache.org/job/JMeter-trunk/ws/src/functions/build/reports/spotbugs/test.xml>

> Task :src:dist-check:batchBatchTestLocal

> Task :src:functions:test

Gradle Test Executor 51 STANDARD_OUT
    Setting JMeterHome: <https://builds.apache.org/job/JMeter-trunk/ws/src/functions/../../.>
    Initializing Properties: ../.././bin/jmeter.properties
    JMeterVersion=5.3-SNAPSHOT d652f1c
    java.version=1.8.0_241
    java.vm.name=Java HotSpot(TM) 64-Bit Server VM
    java.vendor=Oracle Corporation
    java.home=/usr/local/asfpackages/java/jdk1.8.0_241/jre
    file.encoding=ISO-8859-1
    default encoding=ISO-8859-1
    user.home=/home/jenkins
    user.dir=<https://builds.apache.org/job/JMeter-trunk/ws/src/functions>
    user.language=en
    user.region=null
    user.country=US
    user.variant=
    Locale=en_US
    java.class.version=52.0
    java.awt.headless=null
    os.name=Linux
    os.version=4.15.0-76-generic
    os.arch=amd64

> Task :src:dist-check:batchBug50898

> Task :src:protocol:http:spotbugsMain
SpotBugs rule violations were found. See the report at: file://<https://builds.apache.org/job/JMeter-trunk/ws/src/protocol/http/build/reports/spotbugs/main.xml>

> Task :src:dist-check:batchBug52968
> Task :src:functions:check
> Task :src:functions:assemble UP-TO-DATE
> Task :src:dist-check:batchBug54685
> Task :src:dist-check:batchBug55375
> Task :src:dist-check:batchBug56243
> Task :src:dist-check:batchBug56811

> Task :src:protocol:http:spotbugsTest
SpotBugs rule violations were found. See the report at: file://<https://builds.apache.org/job/JMeter-trunk/ws/src/protocol/http/build/reports/spotbugs/test.xml>

> Task :src:dist-check:batchBug62239

> Task :src:protocol:http:test

Gradle Test Executor 53 STANDARD_OUT
    Setting JMeterHome: <https://builds.apache.org/job/JMeter-trunk/ws/src/protocol/http/../../../.>
    Initializing Properties: ../../.././bin/jmeter.properties
    JMeterVersion=5.3-SNAPSHOT d652f1c
    java.version=1.8.0_241
    java.vm.name=Java HotSpot(TM) 64-Bit Server VM
    java.vendor=Oracle Corporation
    java.home=/usr/local/asfpackages/java/jdk1.8.0_241/jre
    file.encoding=ISO-8859-1
    default encoding=ISO-8859-1
    user.home=/home/jenkins
    user.dir=<https://builds.apache.org/job/JMeter-trunk/ws/src/protocol/http>
    user.language=en
    user.region=null
    user.country=US
    user.variant=
    Locale=en_US
    java.class.version=52.0
    java.awt.headless=null
    os.name=Linux
    os.version=4.15.0-76-generic
    os.arch=amd64

> Task :src:dist-check:batchFTP_TESTS
> Task :src:dist-check:batchHTMLParserTestFile_2
> Task :src:dist-check:batchHttp4ImplDigestAuth

> Task :src:protocol:http:test

629 tests completed, 1 failed, 3 skipped

> Task :src:protocol:http:test FAILED
> Task :src:dist-check:batchHttp4ImplPreemptiveBasicAuth
checksum-dependency elapsed time: 71314ms, configurations processed: 353
    SHA-512 computation time: 3756ms (goes in parallel, it might exceed wall-clock time),
files processed: 52, processed: 8MiB, skipped: 3566MiB
    PGP signature resolution time: 9491ms (wall-clock), resolution requests: 208, signatures
resolved: 222
    PGP key resolution time: 39498ms (wall-clock), resolution requests: 208, download time:
0ms (goes in parallel, it might exceed wall-clock time), keys downloaded: 0
        PGP signature verification time: 79355ms (goes in parallel, it might exceed wall-clock
time), files processed: 525, processed: 603MiB, skipped: 2932MiB

FAILURE: Build failed with an exception.

* What went wrong:
Execution failed for task ':src:protocol:http:test'.
> There were failing tests. See the report at: file://<https://builds.apache.org/job/JMeter-trunk/ws/src/protocol/http/build/reports/tests/test/index.html>

* Try:
Run with --stacktrace option to get the stack trace. Run with --info or --debug option to
get more log output. Run with --scan to get full insights.

* Get more help at https://help.gradle.org

Deprecated Gradle features were used in this build, making it incompatible with Gradle 7.0.
Use '--warning-mode all' to show the individual deprecation warnings.
See https://docs.gradle.org/6.1/userguide/command_line_interface.html#sec:command_line_warnings

BUILD FAILED in 5m 38s
339 actionable tasks: 203 executed, 136 up-to-date

See the profiling report at: file://<https://builds.apache.org/job/JMeter-trunk/ws/build/reports/profile/profile-2020-03-03-21-20-53.html>
A fine-grained performance profile is available: use the --scan option.
Build step 'Invoke Gradle script' changed build result to FAILURE
Build step 'Invoke Gradle script' marked build as failure
Xvfb stopping
Archiving artifacts
[Fast Archiver] Compressed 32.92 MB of artifacts by 93.3% relative to #7646
Recording test results

Mime
View raw message