jmeter-dev mailing list archives

Site index · List index
Message view « Date » · « Thread »
Top « Date » · « Thread »
From Apache Jenkins Server <jenk...@builds.apache.org>
Subject Build failed in Jenkins: JMeter Ubuntu #987
Date Tue, 24 Mar 2020 21:19:27 GMT
See <https://builds.apache.org/job/JMeter%20Ubuntu/987/display/redirect>

Changes:


------------------------------------------
[...truncated 132.83 KB...]
> Task :src:generator:compileTestJava NO-SOURCE
> Task :src:generator:testClasses UP-TO-DATE
> Task :src:examples:checkstyleTest NO-SOURCE
> Task :src:generator:checkstyleTest NO-SOURCE
> Task :src:components:compileTestJava UP-TO-DATE
> Task :src:components:compileTestGroovy UP-TO-DATE
> Task :src:components:processTestResources UP-TO-DATE
> Task :src:components:testClasses UP-TO-DATE
> Task :src:components:checkstyleTest UP-TO-DATE
> Task :src:components:spotbugsMain SKIPPED
> Task :src:components:spotbugsTest SKIPPED
> Task :gitProps
> Task :rat UP-TO-DATE
> Task :spotbugsMain SKIPPED
> Task :spotbugsTest SKIPPED
> Task :test NO-SOURCE
> Task :check
> Task :src:core:autostyleJavaCheck
> Task :src:core:autostyleKotlinGradleCheck
> Task :src:core:autostyleMarkdownCheck NO-SOURCE
> Task :src:core:autostyleCheck
> Task :src:core:checkstyleMain UP-TO-DATE
> Task :src:core:checkstyleTest UP-TO-DATE
> Task :src:core:spotbugsMain SKIPPED
> Task :src:core:spotbugsTest SKIPPED
> Task :src:core:test UP-TO-DATE
> Task :src:core:check

> Task :src:components:test

Gradle Test Executor 1 STANDARD_OUT
    Setting JMeterHome: <https://builds.apache.org/job/JMeter%20Ubuntu/ws/src/components/../../.>
    Initializing Properties: ../.././bin/jmeter.properties
    JMeterVersion=5.3-SNAPSHOT f63240a
    java.version=1.8.0_241
    java.vm.name=Java HotSpot(TM) 64-Bit Server VM
    java.vendor=Oracle Corporation
    java.home=/usr/local/asfpackages/java/jdk1.8.0_241/jre
    file.encoding=ISO-8859-1
    default encoding=ISO-8859-1
    user.home=/home/jenkins
    user.dir=<https://builds.apache.org/job/JMeter%20Ubuntu/ws/src/components>
    user.language=en
    user.region=null
    user.country=US
    user.variant=
    Locale=en_US
    java.class.version=52.0
    java.awt.headless=true
    os.name=Linux
    os.version=4.15.0-76-generic
    os.arch=amd64
FAILURE   0.1sec, org.apache.jmeter.gui.action.template.TestTemplateManager
> testSameButParamsTemplatesAreNotEqual()
    java.lang.RuntimeException: java.io.FileNotFoundException: /home/jenkins/jenkins-slave/workspace/JMeter%20Ubuntu/src/components/build/resources/test/org/apache/jmeter/gui/action/template/validTemplates.xml
(No such file or directory)
        at org.apache.jmeter.gui.action.template.TestTemplateManager.readTemplateFromFile(TestTemplateManager.java:59)
        at org.apache.jmeter.gui.action.template.TestTemplateManager.setup(TestTemplateManager.java:50)
        Caused by: java.io.FileNotFoundException: /home/jenkins/jenkins-slave/workspace/JMeter%20Ubuntu/src/components/build/resources/test/org/apache/jmeter/gui/action/template/validTemplates.xml
(No such file or directory)
            at java.io.FileInputStream.open(FileInputStream.java:195)
            at java.io.FileInputStream.<init>(FileInputStream.java:138)
            at java.io.FileInputStream.<init>(FileInputStream.java:93)
            at sun.net.www.protocol.file.FileURLConnection.connect(FileURLConnection.java:90)
            at sun.net.www.protocol.file.FileURLConnection.getInputStream(FileURLConnection.java:188)
            at javax.xml.parsers.DocumentBuilder.parse(DocumentBuilder.java:205)
            at org.apache.jmeter.gui.action.template.TemplateManager.parseTemplateFile(TemplateManager.java:175)
            at org.apache.jmeter.gui.action.template.TestTemplateManager.readTemplateFromFile(TestTemplateManager.java:57)
            ... 1 more

FAILURE   0.0sec, org.apache.jmeter.gui.action.template.TestTemplateManager
> testDifferentTemplatesAreNotEqual()
    java.lang.RuntimeException: java.io.FileNotFoundException: /home/jenkins/jenkins-slave/workspace/JMeter%20Ubuntu/src/components/build/resources/test/org/apache/jmeter/gui/action/template/validTemplates.xml
(No such file or directory)
        at org.apache.jmeter.gui.action.template.TestTemplateManager.readTemplateFromFile(TestTemplateManager.java:59)
        at org.apache.jmeter.gui.action.template.TestTemplateManager.setup(TestTemplateManager.java:50)
        Caused by: java.io.FileNotFoundException: /home/jenkins/jenkins-slave/workspace/JMeter%20Ubuntu/src/components/build/resources/test/org/apache/jmeter/gui/action/template/validTemplates.xml
(No such file or directory)
            at java.io.FileInputStream.open(FileInputStream.java:195)
            at java.io.FileInputStream.<init>(FileInputStream.java:138)
            at java.io.FileInputStream.<init>(FileInputStream.java:93)
            at sun.net.www.protocol.file.FileURLConnection.connect(FileURLConnection.java:90)
            at sun.net.www.protocol.file.FileURLConnection.getInputStream(FileURLConnection.java:188)
            at javax.xml.parsers.DocumentBuilder.parse(DocumentBuilder.java:205)
            at org.apache.jmeter.gui.action.template.TemplateManager.parseTemplateFile(TemplateManager.java:175)
            at org.apache.jmeter.gui.action.template.TestTemplateManager.readTemplateFromFile(TestTemplateManager.java:57)
            ... 1 more

FAILURE   0.0sec, org.apache.jmeter.gui.action.template.TestTemplateManager
> testValidTemplateFile()
    java.lang.RuntimeException: java.io.FileNotFoundException: /home/jenkins/jenkins-slave/workspace/JMeter%20Ubuntu/src/components/build/resources/test/org/apache/jmeter/gui/action/template/validTemplates.xml
(No such file or directory)
        at org.apache.jmeter.gui.action.template.TestTemplateManager.readTemplateFromFile(TestTemplateManager.java:59)
        at org.apache.jmeter.gui.action.template.TestTemplateManager.setup(TestTemplateManager.java:50)
        Caused by: java.io.FileNotFoundException: /home/jenkins/jenkins-slave/workspace/JMeter%20Ubuntu/src/components/build/resources/test/org/apache/jmeter/gui/action/template/validTemplates.xml
(No such file or directory)
            at java.io.FileInputStream.open(FileInputStream.java:195)
            at java.io.FileInputStream.<init>(FileInputStream.java:138)
            at java.io.FileInputStream.<init>(FileInputStream.java:93)
            at sun.net.www.protocol.file.FileURLConnection.connect(FileURLConnection.java:90)
            at sun.net.www.protocol.file.FileURLConnection.getInputStream(FileURLConnection.java:188)
            at javax.xml.parsers.DocumentBuilder.parse(DocumentBuilder.java:205)
            at org.apache.jmeter.gui.action.template.TemplateManager.parseTemplateFile(TemplateManager.java:175)
            at org.apache.jmeter.gui.action.template.TestTemplateManager.readTemplateFromFile(TestTemplateManager.java:57)
            ... 1 more

FAILURE   0.0sec, org.apache.jmeter.gui.action.template.TestTemplateManager
> testSameTemplatesAreEqual()
    java.lang.RuntimeException: java.io.FileNotFoundException: /home/jenkins/jenkins-slave/workspace/JMeter%20Ubuntu/src/components/build/resources/test/org/apache/jmeter/gui/action/template/validTemplates.xml
(No such file or directory)
        at org.apache.jmeter.gui.action.template.TestTemplateManager.readTemplateFromFile(TestTemplateManager.java:59)
        at org.apache.jmeter.gui.action.template.TestTemplateManager.setup(TestTemplateManager.java:50)
        Caused by: java.io.FileNotFoundException: /home/jenkins/jenkins-slave/workspace/JMeter%20Ubuntu/src/components/build/resources/test/org/apache/jmeter/gui/action/template/validTemplates.xml
(No such file or directory)
            at java.io.FileInputStream.open(FileInputStream.java:195)
            at java.io.FileInputStream.<init>(FileInputStream.java:138)
            at java.io.FileInputStream.<init>(FileInputStream.java:93)
            at sun.net.www.protocol.file.FileURLConnection.connect(FileURLConnection.java:90)
            at sun.net.www.protocol.file.FileURLConnection.getInputStream(FileURLConnection.java:188)
            at javax.xml.parsers.DocumentBuilder.parse(DocumentBuilder.java:205)
            at org.apache.jmeter.gui.action.template.TemplateManager.parseTemplateFile(TemplateManager.java:175)
            at org.apache.jmeter.gui.action.template.TestTemplateManager.readTemplateFromFile(TestTemplateManager.java:57)
            ... 1 more

FAILURE   0.0sec, org.apache.jmeter.gui.action.template.TestTemplateManager
> testInvalidTemplateXml()
    java.lang.RuntimeException: java.io.FileNotFoundException: /home/jenkins/jenkins-slave/workspace/JMeter%20Ubuntu/src/components/build/resources/test/org/apache/jmeter/gui/action/template/validTemplates.xml
(No such file or directory)
        at org.apache.jmeter.gui.action.template.TestTemplateManager.readTemplateFromFile(TestTemplateManager.java:59)
        at org.apache.jmeter.gui.action.template.TestTemplateManager.setup(TestTemplateManager.java:50)
        Caused by: java.io.FileNotFoundException: /home/jenkins/jenkins-slave/workspace/JMeter%20Ubuntu/src/components/build/resources/test/org/apache/jmeter/gui/action/template/validTemplates.xml
(No such file or directory)
            at java.io.FileInputStream.open(FileInputStream.java:195)
            at java.io.FileInputStream.<init>(FileInputStream.java:138)
            at java.io.FileInputStream.<init>(FileInputStream.java:93)
            at sun.net.www.protocol.file.FileURLConnection.connect(FileURLConnection.java:90)
            at sun.net.www.protocol.file.FileURLConnection.getInputStream(FileURLConnection.java:188)
            at javax.xml.parsers.DocumentBuilder.parse(DocumentBuilder.java:205)
            at org.apache.jmeter.gui.action.template.TemplateManager.parseTemplateFile(TemplateManager.java:175)
            at org.apache.jmeter.gui.action.template.TestTemplateManager.readTemplateFromFile(TestTemplateManager.java:57)
            ... 1 more

FAILURE   0.0sec, org.apache.jmeter.gui.action.template.TestTemplateManager
> equalsHashCode()
    java.lang.RuntimeException: java.io.FileNotFoundException: /home/jenkins/jenkins-slave/workspace/JMeter%20Ubuntu/src/components/build/resources/test/org/apache/jmeter/gui/action/template/validTemplates.xml
(No such file or directory)
        at org.apache.jmeter.gui.action.template.TestTemplateManager.readTemplateFromFile(TestTemplateManager.java:59)
        at org.apache.jmeter.gui.action.template.TestTemplateManager.setup(TestTemplateManager.java:50)
        Caused by: java.io.FileNotFoundException: /home/jenkins/jenkins-slave/workspace/JMeter%20Ubuntu/src/components/build/resources/test/org/apache/jmeter/gui/action/template/validTemplates.xml
(No such file or directory)
            at java.io.FileInputStream.open(FileInputStream.java:195)
            at java.io.FileInputStream.<init>(FileInputStream.java:138)
            at java.io.FileInputStream.<init>(FileInputStream.java:93)
            at sun.net.www.protocol.file.FileURLConnection.connect(FileURLConnection.java:90)
            at sun.net.www.protocol.file.FileURLConnection.getInputStream(FileURLConnection.java:188)
            at javax.xml.parsers.DocumentBuilder.parse(DocumentBuilder.java:205)
            at org.apache.jmeter.gui.action.template.TemplateManager.parseTemplateFile(TemplateManager.java:175)
            at org.apache.jmeter.gui.action.template.TestTemplateManager.readTemplateFromFile(TestTemplateManager.java:57)
            ... 1 more

FAILURE   0.0sec, org.apache.jmeter.gui.action.template.TestTemplateManager
> testNonExistantXmlFileThrowsFileNotFoundException()
    java.lang.RuntimeException: java.io.FileNotFoundException: /home/jenkins/jenkins-slave/workspace/JMeter%20Ubuntu/src/components/build/resources/test/org/apache/jmeter/gui/action/template/validTemplates.xml
(No such file or directory)
        at org.apache.jmeter.gui.action.template.TestTemplateManager.readTemplateFromFile(TestTemplateManager.java:59)
        at org.apache.jmeter.gui.action.template.TestTemplateManager.setup(TestTemplateManager.java:50)
        Caused by: java.io.FileNotFoundException: /home/jenkins/jenkins-slave/workspace/JMeter%20Ubuntu/src/components/build/resources/test/org/apache/jmeter/gui/action/template/validTemplates.xml
(No such file or directory)
            at java.io.FileInputStream.open(FileInputStream.java:195)
            at java.io.FileInputStream.<init>(FileInputStream.java:138)
            at java.io.FileInputStream.<init>(FileInputStream.java:93)
            at sun.net.www.protocol.file.FileURLConnection.connect(FileURLConnection.java:90)
            at sun.net.www.protocol.file.FileURLConnection.getInputStream(FileURLConnection.java:188)
            at javax.xml.parsers.DocumentBuilder.parse(DocumentBuilder.java:205)
            at org.apache.jmeter.gui.action.template.TemplateManager.parseTemplateFile(TemplateManager.java:175)
            at org.apache.jmeter.gui.action.template.TestTemplateManager.readTemplateFromFile(TestTemplateManager.java:57)
            ... 1 more

FAILURE   0.2sec,    7 completed,   7 failed,   0 skipped, org.apache.jmeter.gui.action.template.TestTemplateManager
          0.3sec,    1 completed,   0 failed,   0 skipped, org.apache.jmeter.resources.ResourceKeyUsageTestComponents
          0.0sec,    1 completed,   0 failed,   0 skipped, org.apache.jmeter.gui.action.TestSave
          0.1sec,    2 completed,   0 failed,   0 skipped, org.apache.jmeter.visualizers.backend.SamplerMetricTimedModeTest
          2.7sec,    4 completed,   0 failed,   0 skipped, org.apache.jmeter.visualizers.backend.influxdb.HttpMetricsSenderTest
          0.0sec,    3 completed,   0 failed,   0 skipped, org.apache.jmeter.visualizers.backend.SamplerMetricFixedModeTest
          0.0sec,    2 completed,   0 failed,   0 skipped, org.apache.jmeter.visualizers.TestSamplingStatCalculator
          0.1sec,    8 completed,   0 failed,   0 skipped, org.apache.jmeter.visualizers.TestRenderAsJson
          0.2sec,   10 completed,   0 failed,   0 skipped, org.apache.jmeter.assertions.ResponseAssertionTest
          0.4sec,    7 completed,   0 failed,   0 skipped, org.apache.jmeter.assertions.gui.TestJSONPathAssertionGui
          0.0sec,    4 completed,   0 failed,   0 skipped, org.apache.jmeter.assertions.DurationAssertionTest
          0.3sec,    9 completed,   0 failed,   0 skipped, org.apache.jmeter.assertions.XMLSchemaAssertionTest
          0.5sec,   29 completed,   0 failed,   0 skipped, org.apache.jmeter.assertions.XPathAssertionTest
          0.0sec,    6 completed,   0 failed,   0 skipped, org.apache.jmeter.assertions.SizeAssertionTest
          0.1sec,   25 completed,   0 failed,   0 skipped, org.apache.jmeter.assertions.TestJSONPathAssertion
          0.1sec,    7 completed,   0 failed,   0 skipped, org.apache.jmeter.assertions.jmespath.gui.JMESPathAssertionGuiTest
          0.8sec,    6 completed,   0 failed,   0 skipped, org.apache.jmeter.assertions.SMIMEAssertionTest
          0.7sec,   14 completed,   0 failed,   0 skipped, org.apache.jmeter.assertions.XPath2AssertionTest
          0.0sec,    4 completed,   0 failed,   0 skipped, org.apache.jmeter.assertions.XmlAssertionTest
          0.1sec,   14 completed,   0 failed,   0 skipped, org.apache.jmeter.extractor.TestHtmlExtractorJodd
          0.1sec,    6 completed,   0 failed,   0 skipped, org.apache.jmeter.extractor.TestXPathExtractor
          0.1sec,    7 completed,   0 failed,   0 skipped, org.apache.jmeter.extractor.TestXPath2Extractor
          0.5sec,   14 completed,   0 failed,   0 skipped, org.apache.jmeter.extractor.TestHtmlExtractorJSoup
          0.0sec,   25 completed,   0 failed,   0 skipped, org.apache.jmeter.extractor.TestRegexExtractor
          0.0sec,    4 completed,   0 failed,   0 skipped, org.apache.jmeter.extractor.TestBoundaryExtractor
          0.0sec,    9 completed,   0 failed,   0 skipped, org.apache.jmeter.extractor.TestJSONPostProcessor
          0.6sec,    4 completed,   0 failed,   0 skipped, org.apache.jmeter.timers.SyncTimerTest
          1.1sec,    9 completed,   0 failed,   0 skipped, org.apache.jmeter.timers.ConstantThroughputTimerTest
          0.5sec,    6 completed,   0 failed,   0 skipped, org.apache.jmeter.timers.poissonarrivals.PreciseThroughputTimerTest
          0.0sec,    4 completed,   0 failed,   0 skipped, org.apache.jmeter.timers.TimerServiceTest
          0.1sec,    1 completed,   0 failed,   0 skipped, org.apache.jmeter.config.gui.TestArgumentsPanel
          0.1sec,    6 completed,   0 failed,   0 skipped, org.apache.jmeter.config.TestCVSDataSet
          0.0sec,    3 completed,   0 failed,   0 skipped, org.apache.jmeter.config.TestRandomVariableConfig
          0.0sec,    5 completed,   0 failed,   0 skipped, org.apache.jmeter.reporters.TestResultSaver
          0.0sec,    1 completed,   0 failed,   0 skipped, org.apache.jmeter.control.TestGenericController
          0.1sec,    4 completed,   0 failed,   0 skipped, org.apache.jmeter.control.TestLoopController
WARNING   0.9sec,    8 completed,   0 failed,   1 skipped, org.apache.jmeter.control.TestIfController
          0.0sec,    6 completed,   0 failed,   0 skipped, org.apache.jmeter.control.TestInterleaveControl
          0.0sec,    1 completed,   0 failed,   0 skipped, org.apache.jmeter.control.TestTransactionController
          0.0sec,    4 completed,   0 failed,   0 skipped, org.apache.jmeter.control.TestOnceOnlyController
          0.0sec,    3 completed,   0 failed,   0 skipped, org.apache.jmeter.control.TestRandomController
          0.0sec,   12 completed,   0 failed,   0 skipped, org.apache.jmeter.control.TestWhileController
          0.0sec,    9 completed,   0 failed,   0 skipped, org.apache.jmeter.visualizers.TestSampleCompareTo
          0.3sec,   27 completed,   0 failed,   0 skipped, org.apache.jmeter.assertions.jmespath.TestJMESPathAssertion$TestAssertion
          0.3sec,   27 completed,   0 failed,   0 skipped, org.apache.jmeter.assertions.jmespath.TestJMESPathAssertion
          0.0sec,   10 completed,   0 failed,   0 skipped, org.apache.jmeter.extractor.json.jmespath.TestJMESPathExtractor$SourceVarOrResponse
          0.0sec,   10 completed,   0 failed,   0 skipped, org.apache.jmeter.extractor.json.jmespath.TestJMESPathExtractor$MatchNumberMoreThanZeroOn1ExtractedValue
          0.0sec,    6 completed,   0 failed,   0 skipped, org.apache.jmeter.extractor.json.jmespath.TestJMESPathExtractor$MultipleMatchesOnAllExtractedValues
          0.0sec,    6 completed,   0 failed,   0 skipped, org.apache.jmeter.extractor.json.jmespath.TestJMESPathExtractor$OneMatchOnAllExtractedValues
          0.0sec,   32 completed,   0 failed,   0 skipped, org.apache.jmeter.extractor.json.jmespath.TestJMESPathExtractor
          0.5sec,    7 completed,   0 failed,   0 skipped, org.apache.jmeter.visualizers.backend.graphite.PickleGraphiteMetricsSenderSpec
          0.0sec,    5 completed,   0 failed,   0 skipped, org.apache.jmeter.visualizers.backend.graphite.TextGraphiteMetricsSenderSpec
          0.1sec,    3 completed,   0 failed,   0 skipped, org.apache.jmeter.visualizers.backend.influxdb.InfluxdbBackendListenerClientSpec
          0.6sec,    5 completed,   0 failed,   0 skipped, org.apache.jmeter.assertions.gui.AssertionGuiSpec
          0.1sec,    7 completed,   0 failed,   0 skipped, org.apache.jmeter.assertions.CompareAssertionSpec
          0.0sec,    7 completed,   0 failed,   0 skipped, org.apache.jmeter.assertions.MD5HexAssertionSpec
          0.2sec,   37 completed,   0 failed,   0 skipped, org.apache.jmeter.extractor.BoundaryExtractorSpec
          0.0sec,    4 completed,   0 failed,   0 skipped, org.apache.jmeter.extractor.JoddExtractorSpec
WARNING   0.3sec,    8 completed,   0 failed,   2 skipped, org.apache.jmeter.extractor.json.render.RenderAsJmesPathRendererSpec
WARNING   0.1sec,    8 completed,   0 failed,   2 skipped, org.apache.jmeter.extractor.json.render.RenderAsJsonRendererSpec
          0.0sec,    6 completed,   0 failed,   0 skipped, org.apache.jmeter.timers.UniformRandomTimerSpec
          0.1sec,    8 completed,   0 failed,   0 skipped, org.apache.jmeter.control.ThroughputControllerSpec
WARNING   0.0sec,    5 completed,   0 failed,   1 skipped, org.apache.jmeter.control.RunTimeSpec
          0.0sec,    4 completed,   0 failed,   0 skipped, org.apache.jmeter.control.RandomOrderControllerSpec
FAILURE  18.3sec,  487 completed,   7 failed,   6 skipped,
Gradle Test Run :src:components:test

487 tests completed, 7 failed, 6 skipped

> Task :src:components:test FAILED
checksum-dependency elapsed time: 9225ms, configurations processed: 212 (add -PchecksumTimingsPrint
to print detailed timings)

FAILURE: Build failed with an exception.

* What went wrong:
Execution failed for task ':src:components:test'.
> There were failing tests. See the report at: file:///home/jenkins/jenkins-slave/workspace/JMeter%20Ubuntu/src/components/build/reports/tests/test/index.html

* Try:
Run with --stacktrace option to get the stack trace. Run with --info or --debug option to
get more log output. Run with --scan to get full insights.

* Get more help at https://help.gradle.org

Deprecated Gradle features were used in this build, making it incompatible with Gradle 7.0.
Use '--warning-mode all' to show the individual deprecation warnings.
See https://docs.gradle.org/6.1/userguide/command_line_interface.html#sec:command_line_warnings

BUILD FAILED in 50s
207 actionable tasks: 66 executed, 141 up-to-date
Build step 'Invoke Gradle script' changed build result to FAILURE
Build step 'Invoke Gradle script' marked build as failure
[locks-and-latches] Releasing all the locks
[locks-and-latches] All the locks released

Mime
View raw message