jmeter-dev mailing list archives

Site index · List index
Message view « Date » · « Thread »
Top « Date » · « Thread »
From Apache Jenkins Server <jenk...@builds.apache.org>
Subject Build failed in Jenkins: JMeter Ubuntu #982
Date Sun, 08 Mar 2020 14:35:43 GMT
See <https://builds.apache.org/job/JMeter%20Ubuntu/982/display/redirect?page=changes>

Changes:

[felix.schumacher] Apply autostyle to make spotbugs happy

[sitnikov.vladimir] Bump vlsi-release-plugins: 1.61 -> 1.65

[sitnikov.vladimir] Add ExecutionMode.SAME_THREAD to JMeterSerialTest to ensure the tests


------------------------------------------
[...truncated 208.36 KB...]
	at org.apache.jmeter.threads.JMeterThread.executeSamplePackage(JMeterThread.java:549) ~[ApacheJMeter_core.jar:5.3-SNAPSHOT]
	at org.apache.jmeter.threads.JMeterThread.processSampler(JMeterThread.java:489) [ApacheJMeter_core.jar:5.3-SNAPSHOT]
	at org.apache.jmeter.threads.JMeterThread.run(JMeterThread.java:256) [ApacheJMeter_core.jar:5.3-SNAPSHOT]
	at java.lang.Thread.run(Thread.java:748) [?:1.8.0_241]
2020-03-08 14:33:22,582 ERROR o.a.j.t.JMeterThread: Error while processing sampler: 'JDBC_With_Failing_PostProcessor'.
java.lang.IllegalArgumentException: Variable Name must not be null in JDBC PostProcessor
	at org.apache.jmeter.protocol.jdbc.processor.AbstractJDBCProcessor.process(AbstractJDBCProcessor.java:44)
~[ApacheJMeter_jdbc.jar:5.3-SNAPSHOT]
	at org.apache.jmeter.protocol.jdbc.processor.JDBCPostProcessor.process(JDBCPostProcessor.java:32)
~[ApacheJMeter_jdbc.jar:5.3-SNAPSHOT]
	at org.apache.jmeter.threads.JMeterThread.runPostProcessors(JMeterThread.java:932) ~[ApacheJMeter_core.jar:5.3-SNAPSHOT]
	at org.apache.jmeter.threads.JMeterThread.executeSamplePackage(JMeterThread.java:572) ~[ApacheJMeter_core.jar:5.3-SNAPSHOT]
	at org.apache.jmeter.threads.JMeterThread.processSampler(JMeterThread.java:489) [ApacheJMeter_core.jar:5.3-SNAPSHOT]
	at org.apache.jmeter.threads.JMeterThread.run(JMeterThread.java:256) [ApacheJMeter_core.jar:5.3-SNAPSHOT]
	at java.lang.Thread.run(Thread.java:748) [?:1.8.0_241]
2020-03-08 14:33:22,583 WARN o.a.j.p.j.p.AbstractJDBCProcessor: SQL Problem in JDBC PreProcessor:
java.sql.SQLSyntaxErrorException: unexpected token: USERS
2020-03-08 14:33:22,595 WARN o.a.j.p.j.p.AbstractJDBCProcessor: SQL Problem in JDBC PostProcessor:
java.sql.SQLSyntaxErrorException: unexpected token: USERS

> Task :src:dist-check:batchJMS_TESTS
Creating summariser <summary>
Created the tree successfully using <https://builds.apache.org/job/JMeter%20Ubuntu/ws/bin/testfiles/JMS_TESTS.jmx>
Starting standalone test @ Sun Mar 08 14:33:24 UTC 2020 (1583678004488)
Waiting for possible Shutdown/StopTestNow/HeapDump/ThreadDump message on port 4445
summary +      6 in 00:00:05 =    1.1/s Avg:   620 Min:     5 Max:  2003 Err:     0 (0.00%)
Active: 1 Started: 1 Finished: 0
summary +     21 in 00:00:24 =    0.9/s Avg:   538 Min:     1 Max:  3000 Err:     0 (0.00%)
Active: 0 Started: 1 Finished: 1
summary =     27 in 00:00:29 =    0.9/s Avg:   556 Min:     1 Max:  3000 Err:     0 (0.00%)
Tidying up ...    @ Sun Mar 08 14:33:54 UTC 2020 (1583678034665)
... end of run
No errors present in the logfile <https://builds.apache.org/job/JMeter%20Ubuntu/ws/bin/JMS_TESTS.log>
(the file is empty)

> Task :src:dist-check:batchOS_TESTS
Creating summariser <summary>
Created the tree successfully using <https://builds.apache.org/job/JMeter%20Ubuntu/ws/bin/testfiles/OS_TESTS.jmx>
Starting standalone test @ Sun Mar 08 14:33:57 UTC 2020 (1583678037566)
Waiting for possible Shutdown/StopTestNow/HeapDump/ThreadDump message on port 4445
summary =      3 in 00:00:02 =    1.8/s Avg:   342 Min:     9 Max:  1002 Err:     0 (0.00%)
Tidying up ...    @ Sun Mar 08 14:33:59 UTC 2020 (1583678039388)
... end of run
No errors present in the logfile <https://builds.apache.org/job/JMeter%20Ubuntu/ws/bin/OS_TESTS.log>
(the file is empty)

> Task :src:dist-check:batchResponseDecompression
Creating summariser <summary>
Created the tree successfully using <https://builds.apache.org/job/JMeter%20Ubuntu/ws/bin/testfiles/ResponseDecompression.jmx>
Starting standalone test @ Sun Mar 08 14:34:01 UTC 2020 (1583678041197)
Waiting for possible Shutdown/StopTestNow/HeapDump/ThreadDump message on port 4445
summary +      1 in 00:00:01 =    1.2/s Avg:   537 Min:   537 Max:   537 Err:     0 (0.00%)
Active: 1 Started: 1 Finished: 0
summary +      1 in 00:00:01 =    1.1/s Avg:   343 Min:   343 Max:   343 Err:     0 (0.00%)
Active: 0 Started: 1 Finished: 1
summary =      2 in 00:00:02 =    1.1/s Avg:   440 Min:   343 Max:   537 Err:     0 (0.00%)
Tidying up ...    @ Sun Mar 08 14:34:03 UTC 2020 (1583678043465)
... end of run
No errors present in the logfile <https://builds.apache.org/job/JMeter%20Ubuntu/ws/bin/ResponseDecompression.log>
(the file is empty)
[server] Created remote object: UnicastServerRef2 [liveRef: [endpoint:[asf922.gq1.ygridcore.net:45087,SSLRMIServerSocketFactory(host=asf922.gq1.ygridcore.net/67.195.81.142,
keyStoreLocation=rmi_keystore.jks, type=JKS, trustStoreLocation=rmi_keystore.jks, type=JKS,
alias=rmi),SSLRMIClientSocketFactory(keyStoreLocation=rmi_keystore.jks, type=JKS, trustStoreLocation=rmi_keystore.jks,
type=JKS, alias=rmi)](local),objID:[-2869bda4:170ba913b04:-7fff, -33066929929873154]]][server]


> Task :src:dist-check:batchServerBatchTestLocal
Creating summariser <summary>
Created the tree successfully using <https://builds.apache.org/job/JMeter%20Ubuntu/ws/bin/testfiles/BatchTestLocal.jmx>
Configuring remote engine: asf922.gq1.ygridcore.net:44569
Starting distributed test with remote engines: [asf922.gq1.ygridcore.net:44569] @ Sun Mar
08 14:34:08 UTC 2020 (1583678048193)

[server] Starting the test on host asf922.gq1.ygridcore.net:44569 @ Sun Mar 08 14:34:10 UTC
2020 (1583678050663)

> Task :src:dist-check:batchServerBatchTestLocal
Remote engines have been started:[asf922.gq1.ygridcore.net:44569]
Waiting for possible Shutdown/StopTestNow/HeapDump/ThreadDump message on port 4445
summary =    132 in 00:00:07 =   17.9/s Avg:     4 Min:     1 Max:    66 Err:    16 (12.12%)

[server] Finished the test on host asf922.gq1.ygridcore.net:44569 @ Sun Mar 08 14:34:18 UTC
2020 (1583678058482) - exit requested.

> Task :src:dist-check:batchServerBatchTestLocal
Tidying up remote @ Sun Mar 08 14:34:18 UTC 2020 (1583678058482)
... end of run
No errors present in the logfile <https://builds.apache.org/job/JMeter%20Ubuntu/ws/bin/BatchTestLocal.log>
(the file is empty)
No errors present in the logfile <https://builds.apache.org/job/JMeter%20Ubuntu/ws/bin/BatchTestLocalServer.log>
(the file is empty)

> Task :src:dist-check:batchSlowCharsFeatureHttpClient4
Creating summariser <summary>
Created the tree successfully using <https://builds.apache.org/job/JMeter%20Ubuntu/ws/bin/testfiles/SlowCharsFeature.jmx>
Starting standalone test @ Sun Mar 08 14:34:25 UTC 2020 (1583678065747)
Waiting for possible Shutdown/StopTestNow/HeapDump/ThreadDump message on port 4445
summary +      5 in 00:00:40 =    0.1/s Avg:  7887 Min:   407 Max: 12226 Err:     0 (0.00%)
Active: 1 Started: 1 Finished: 0
summary =      5 in 00:00:40 =    0.1/s Avg:  7887 Min:   407 Max: 12226 Err:     0 (0.00%)
Tidying up ...    @ Sun Mar 08 14:35:05 UTC 2020 (1583678105970)
... end of run
No errors present in the logfile <https://builds.apache.org/job/JMeter%20Ubuntu/ws/bin/SlowCharsFeature.log>
(the file is empty)

> Task :src:dist-check:batchSlowCharsFeatureJava
Creating summariser <summary>
Created the tree successfully using <https://builds.apache.org/job/JMeter%20Ubuntu/ws/bin/testfiles/SlowCharsFeature.jmx>
Starting standalone test @ Sun Mar 08 14:35:08 UTC 2020 (1583678108231)
Waiting for possible Shutdown/StopTestNow/HeapDump/ThreadDump message on port 4445
summary +      3 in 00:00:23 =    0.1/s Avg:  7399 Min:   395 Max: 11411 Err:     1 (33.33%)
Active: 1 Started: 1 Finished: 0
summary +      1 in 00:00:10 =    0.1/s Avg: 10269 Min: 10269 Max: 10269 Err:     0 (0.00%)
Active: 0 Started: 1 Finished: 1
summary =      4 in 00:00:33 =    0.1/s Avg:  8117 Min:   395 Max: 11411 Err:     1 (25.00%)
Tidying up ...    @ Sun Mar 08 14:35:41 UTC 2020 (1583678141499)
... end of run
ERROR: unexpected output for SlowCharsFeature_Java.csv:
  - expected 327 bytes, <https://builds.apache.org/job/JMeter%20Ubuntu/ws/bin/testfiles/SlowCharsFeature_Java.csv>
  + actual 406 bytes, <https://builds.apache.org/job/JMeter%20Ubuntu/ws/bin/SlowCharsFeature_Java.csv>
@@ -1,5 +1,5 @@
 label,responseCode,responseMessage,threadName,dataType,success
 JSS_setCPS,200,OK,setUp Thread Group 1-1,text,true
-ApacheJMeter-HP-Secure,206,Partial Content,Thread Group 1-1,text,true
+ApacheJMeter-HP-Secure,Non HTTP response code: java.net.SocketTimeoutException,Non HTTP response
message: Read timed out,Thread Group 1-1,text,false
 HTTPS-SNI-without-timeout,206,Partial Content,Thread Group 1-1,text,true
 HTTPS-SNI-with-timeout,206,Partial Content,Thread Group 1-1,text,true
ERROR: unexpected output for SlowCharsFeature_Java.xml:
  - expected 2738 bytes, <https://builds.apache.org/job/JMeter%20Ubuntu/ws/bin/testfiles/SlowCharsFeature_Java.xml>
  + actual 3332 bytes, <https://builds.apache.org/job/JMeter%20Ubuntu/ws/bin/SlowCharsFeature_Java.xml>
@@ -1,7 +1,7 @@
 <?xml version="1.0" encoding="UTF-8"?>
 <testResults version="1.2">
 <sample s="true" lb="JSS_setCPS" rc="200" rm="OK" tn="setUp Thread Group 1-1" dt="text"/>
-<httpSample s="true" lb="ApacheJMeter-HP-Secure" rc="206" rm="Partial Content" tn="Thread
Group 1-1" dt="text">
+<httpSample s="false" lb="ApacheJMeter-HP-Secure" rc="Non HTTP response code: java.net.SocketTimeoutException"
rm="Non HTTP response message: Read timed out" tn="Thread Group 1-1" dt="text">
   <assertionResult>
     <name>JSA-CheckResponseTimeHigherThan5s</name>
     <failure>false</failure>
@@ -9,23 +9,33 @@
   </assertionResult>
   <assertionResult>
     <name>RA_Size</name>
-    <failure>false</failure>
+    <failure>true</failure>
     <error>false</error>
+    <failureMessage>The result was the wrong size: It was 1,831 bytes, but should have
been equal to 7,001 bytes.</failureMessage>
   </assertionResult>
   <assertionResult>
     <name>RA_206</name>
-    <failure>false</failure>
+    <failure>true</failure>
     <error>false</error>
+    <failureMessage>Test failed: code expected to equal /
+
+****** received  : [[[Non HTTP response code: java.net.SocketTimeoutException]]]
+
+****** comparison: [[[206                                                    ]]]
+
+/</failureMessage>
   </assertionResult>
   <assertionResult>
     <name>RA_PartialContent</name>
-    <failure>false</failure>
+    <failure>true</failure>
     <error>false</error>
+    <failureMessage>Response was null</failureMessage>
   </assertionResult>
   <assertionResult>
     <name>RA</name>
-    <failure>false</failure>
+    <failure>true</failure>
     <error>false</error>
+    <failureMessage>Test failed: text expected to contain /Apache JMeter/</failureMessage>
   </assertionResult>
 </httpSample>
 <httpSample s="true" lb="HTTPS-SNI-without-timeout" rc="206" rm="Partial Content" tn="Thread
Group 1-1" dt="text">
No errors present in the logfile <https://builds.apache.org/job/JMeter%20Ubuntu/ws/bin/SlowCharsFeature.log>
(the file is empty)

> Task :src:dist-check:batchSlowCharsFeatureJava FAILED
checksum-dependency elapsed time: 45010ms, configurations processed: 237
    SHA-512 computation time: 874ms (goes in parallel, it might exceed wall-clock time), files
processed: 20, processed: 5MiB, skipped: 2695MiB
    PGP signature resolution time: 11923ms (wall-clock), resolution requests: 139, signatures
resolved: 217
    PGP key resolution time: 15696ms (wall-clock), resolution requests: 139, download time:
0ms (goes in parallel, it might exceed wall-clock time), keys downloaded: 0
        PGP signature verification time: 46830ms (goes in parallel, it might exceed wall-clock
time), files processed: 517, processed: 627MiB, skipped: 2048MiB

Build jmeter FAILURE reason:                                
    Execution failed for task ':src:dist-check:batchSlowCharsFeatureJava':
        Failures detected while testing <https://builds.apache.org/job/JMeter%20Ubuntu/ws/bin/testfiles/SlowCharsFeature.jmx>:
[unexpected output SlowCharsFeature_Java.csv, unexpected output SlowCharsFeature_Java.xml]
            at org.apache.jmeter.buildtools.batchtest.BatchTest.exec(BatchTest.kt:184)
            at org.gradle.internal.reflect.JavaMethod.invoke(JavaMethod.java:104)
            at org.gradle.api.internal.project.taskfactory.StandardTaskAction.doExecute(StandardTaskAction.java:49)
            at org.gradle.api.internal.project.taskfactory.StandardTaskAction.execute(StandardTaskAction.java:42)
            at org.gradle.api.internal.project.taskfactory.StandardTaskAction.execute(StandardTaskAction.java:28)
            at org.gradle.api.internal.AbstractTask$TaskActionWrapper.execute(AbstractTask.java:727)
            at org.gradle.api.internal.AbstractTask$TaskActionWrapper.execute(AbstractTask.java:694)
            at org.gradle.api.internal.tasks.execution.ExecuteActionsTaskExecuter$3.run(ExecuteActionsTaskExecuter.java:568)
            at org.gradle.internal.operations.DefaultBuildOperationExecutor$RunnableBuildOperationWorker.execute(DefaultBuildOperationExecutor.java:402)
            at org.gradle.internal.operations.DefaultBuildOperationExecutor$RunnableBuildOperationWorker.execute(DefaultBuildOperationExecutor.java:394)
            at org.gradle.internal.operations.DefaultBuildOperationExecutor$1.execute(DefaultBuildOperationExecutor.java:165)
            at org.gradle.internal.operations.DefaultBuildOperationExecutor.execute(DefaultBuildOperationExecutor.java:250)
            at org.gradle.internal.operations.DefaultBuildOperationExecutor.execute(DefaultBuildOperationExecutor.java:158)
            at org.gradle.internal.operations.DefaultBuildOperationExecutor.run(DefaultBuildOperationExecutor.java:92)
            at org.gradle.internal.operations.DelegatingBuildOperationExecutor.run(DelegatingBuildOperationExecutor.java:31)
            at org.gradle.api.internal.tasks.execution.ExecuteActionsTaskExecuter.executeAction(ExecuteActionsTaskExecuter.java:553)
            at org.gradle.api.internal.tasks.execution.ExecuteActionsTaskExecuter.executeActions(ExecuteActionsTaskExecuter.java:536)
            at org.gradle.api.internal.tasks.execution.ExecuteActionsTaskExecuter.access$300(ExecuteActionsTaskExecuter.java:109)
            at org.gradle.api.internal.tasks.execution.ExecuteActionsTaskExecuter$TaskExecution.executeWithPreviousOutputFiles(ExecuteActionsTaskExecuter.java:276)
            at org.gradle.api.internal.tasks.execution.ExecuteActionsTaskExecuter$TaskExecution.execute(ExecuteActionsTaskExecuter.java:265)
            at org.gradle.internal.execution.steps.ExecuteStep.lambda$execute$1(ExecuteStep.java:33)
            at org.gradle.internal.execution.steps.ExecuteStep.execute(ExecuteStep.java:33)
            at org.gradle.internal.execution.steps.ExecuteStep.execute(ExecuteStep.java:26)
            at org.gradle.internal.execution.steps.CleanupOutputsStep.execute(CleanupOutputsStep.java:63)
            at org.gradle.internal.execution.steps.CleanupOutputsStep.execute(CleanupOutputsStep.java:35)
            at org.gradle.internal.execution.steps.ResolveInputChangesStep.execute(ResolveInputChangesStep.java:49)
            at org.gradle.internal.execution.steps.ResolveInputChangesStep.execute(ResolveInputChangesStep.java:34)
            at org.gradle.internal.execution.steps.CancelExecutionStep.execute(CancelExecutionStep.java:43)
            at org.gradle.internal.execution.steps.TimeoutStep.executeWithoutTimeout(TimeoutStep.java:73)
            at org.gradle.internal.execution.steps.TimeoutStep.execute(TimeoutStep.java:54)
            at org.gradle.internal.execution.steps.CatchExceptionStep.execute(CatchExceptionStep.java:34)
            at org.gradle.internal.execution.steps.CreateOutputsStep.execute(CreateOutputsStep.java:44)
            at org.gradle.internal.execution.steps.SnapshotOutputsStep.execute(SnapshotOutputsStep.java:54)
            at org.gradle.internal.execution.steps.SnapshotOutputsStep.execute(SnapshotOutputsStep.java:38)
            at org.gradle.internal.execution.steps.BroadcastChangingOutputsStep.execute(BroadcastChangingOutputsStep.java:49)
            at org.gradle.internal.execution.steps.CacheStep.executeWithoutCache(CacheStep.java:153)
            at org.gradle.internal.execution.steps.CacheStep.execute(CacheStep.java:67)
            at org.gradle.internal.execution.steps.CacheStep.execute(CacheStep.java:41)
            at org.gradle.internal.execution.steps.StoreExecutionStateStep.execute(StoreExecutionStateStep.java:44)
            at org.gradle.internal.execution.steps.StoreExecutionStateStep.execute(StoreExecutionStateStep.java:33)
            at org.gradle.internal.execution.steps.RecordOutputsStep.execute(RecordOutputsStep.java:38)
            at org.gradle.internal.execution.steps.RecordOutputsStep.execute(RecordOutputsStep.java:24)
            at org.gradle.internal.execution.steps.SkipUpToDateStep.executeBecause(SkipUpToDateStep.java:92)
            at org.gradle.internal.execution.steps.SkipUpToDateStep.lambda$execute$0(SkipUpToDateStep.java:85)
            at org.gradle.internal.execution.steps.SkipUpToDateStep.execute(SkipUpToDateStep.java:55)
            at org.gradle.internal.execution.steps.SkipUpToDateStep.execute(SkipUpToDateStep.java:39)
            at org.gradle.internal.execution.steps.ResolveChangesStep.execute(ResolveChangesStep.java:76)
            at org.gradle.internal.execution.steps.ResolveChangesStep.execute(ResolveChangesStep.java:37)
            at org.gradle.internal.execution.steps.legacy.MarkSnapshottingInputsFinishedStep.execute(MarkSnapshottingInputsFinishedStep.java:36)
            at org.gradle.internal.execution.steps.legacy.MarkSnapshottingInputsFinishedStep.execute(MarkSnapshottingInputsFinishedStep.java:26)
            at org.gradle.internal.execution.steps.ResolveCachingStateStep.execute(ResolveCachingStateStep.java:94)
            at org.gradle.internal.execution.steps.ResolveCachingStateStep.execute(ResolveCachingStateStep.java:49)
            at org.gradle.internal.execution.steps.CaptureStateBeforeExecutionStep.execute(CaptureStateBeforeExecutionStep.java:79)
            at org.gradle.internal.execution.steps.CaptureStateBeforeExecutionStep.execute(CaptureStateBeforeExecutionStep.java:53)
            at org.gradle.internal.execution.steps.ValidateStep.execute(ValidateStep.java:74)
            at org.gradle.internal.execution.steps.SkipEmptyWorkStep.lambda$execute$2(SkipEmptyWorkStep.java:78)
            at org.gradle.internal.execution.steps.SkipEmptyWorkStep.execute(SkipEmptyWorkStep.java:78)
            at org.gradle.internal.execution.steps.SkipEmptyWorkStep.execute(SkipEmptyWorkStep.java:34)
            at org.gradle.internal.execution.steps.legacy.MarkSnapshottingInputsStartedStep.execute(MarkSnapshottingInputsStartedStep.java:39)
            at org.gradle.internal.execution.steps.LoadExecutionStateStep.execute(LoadExecutionStateStep.java:40)
            at org.gradle.internal.execution.steps.LoadExecutionStateStep.execute(LoadExecutionStateStep.java:28)


FAILURE: Build failed with an exception.

* What went wrong:
Execution failed for task ':src:dist-check:batchSlowCharsFeatureJava'.
> Failures detected while testing <https://builds.apache.org/job/JMeter%20Ubuntu/ws/bin/testfiles/SlowCharsFeature.jmx>:
[unexpected output SlowCharsFeature_Java.csv, unexpected output SlowCharsFeature_Java.xml]

* Try:
Run with --stacktrace option to get the stack trace. Run with --info or --debug option to
get more log output. Run with --scan to get full insights.

* Get more help at https://help.gradle.org

Deprecated Gradle features were used in this build, making it incompatible with Gradle 7.0.
Use '--warning-mode all' to show the individual deprecation warnings.
See https://docs.gradle.org/6.1/userguide/command_line_interface.html#sec:command_line_warnings

BUILD FAILED in 5m 20s
254 actionable tasks: 185 executed, 69 up-to-date
Build step 'Invoke Gradle script' changed build result to FAILURE
Build step 'Invoke Gradle script' marked build as failure
[locks-and-latches] Releasing all the locks
[locks-and-latches] All the locks released

Mime
View raw message