jmeter-dev mailing list archives

Site index · List index
Message view « Date » · « Thread »
Top « Date » · « Thread »
From Apache Jenkins Server <jenk...@builds.apache.org>
Subject Build failed in Jenkins: JMeter Windows #1639
Date Tue, 24 Mar 2020 21:05:34 GMT
See <https://builds.apache.org/job/JMeter%20Windows/1639/display/redirect?page=changes>

Changes:

[sitnikov.vladimir] Fix typo in changes.xml

[sitnikov.vladimir] Add batchTCP_TESTS to flakyTests tests (ignore it on CI by default)


------------------------------------------
[...truncated 189.25 KB...]
    Thread[/127.0.0.1:62858 to /127.0.0.1:62845 workers Thread 2,5,main], stackTrace:sun.misc.Unsafe#park
    java.util.concurrent.locks.LockSupport#park at line:175
    java.util.concurrent.locks.AbstractQueuedSynchronizer$ConditionObject#await at line:2039
    org.gradle.internal.remote.internal.hub.queue.EndPointQueue#take at line:49
    org.gradle.internal.remote.internal.hub.MessageHub$ConnectionDispatch#run at line:320
    org.gradle.internal.concurrent.ExecutorPolicy$CatchAndRecordFailures#onExecute at line:64
    org.gradle.internal.concurrent.ManagedExecutorImpl$1#run at line:48
    java.util.concurrent.ThreadPoolExecutor#runWorker at line:1149
    java.util.concurrent.ThreadPoolExecutor$Worker#run at line:624
    org.gradle.internal.concurrent.ThreadFactoryImpl$ManagedThreadRunnable#run at line:56
    java.lang.Thread#run at line:748

    Thread[Test worker,5,main], stackTrace:java.lang.Object#wait
    java.util.concurrent.ForkJoinTask#externalInterruptibleAwaitDone at line:367
    java.util.concurrent.ForkJoinTask#get at line:1001
    org.junit.platform.engine.support.hierarchical.HierarchicalTestEngine#execute at line:51
    org.junit.platform.launcher.core.DefaultLauncher#execute at line:220
    org.junit.platform.launcher.core.DefaultLauncher#lambda$execute$6 at line:188
    org.junit.platform.launcher.core.DefaultLauncher$$Lambda$172/1891198488#accept
    org.junit.platform.launcher.core.DefaultLauncher#withInterceptedStreams at line:202
    org.junit.platform.launcher.core.DefaultLauncher#execute at line:181
    org.junit.platform.launcher.core.DefaultLauncher#execute at line:128
    org.gradle.api.internal.tasks.testing.junitplatform.JUnitPlatformTestClassProcessor$CollectAllTestClassesExecutor#processAllTestClasses
at line:99
    org.gradle.api.internal.tasks.testing.junitplatform.JUnitPlatformTestClassProcessor$CollectAllTestClassesExecutor#access$000
at line:79
    org.gradle.api.internal.tasks.testing.junitplatform.JUnitPlatformTestClassProcessor#stop
at line:75
    org.gradle.api.internal.tasks.testing.SuiteTestClassProcessor#stop at line:61
    sun.reflect.NativeMethodAccessorImpl#invoke0
    sun.reflect.NativeMethodAccessorImpl#invoke at line:62
    sun.reflect.DelegatingMethodAccessorImpl#invoke at line:43
    java.lang.reflect.Method#invoke at line:498
    org.gradle.internal.dispatch.ReflectionDispatch#dispatch at line:36
    org.gradle.internal.dispatch.ReflectionDispatch#dispatch at line:24
    org.gradle.internal.dispatch.ContextClassLoaderDispatch#dispatch at line:33
    org.gradle.internal.dispatch.ProxyDispatchAdapter$DispatchingInvocationHandler#invoke
at line:94
    com.sun.proxy.$Proxy2#stop
    org.gradle.api.internal.tasks.testing.worker.TestWorker#stop at line:132
    sun.reflect.NativeMethodAccessorImpl#invoke0
    sun.reflect.NativeMethodAccessorImpl#invoke at line:62
    sun.reflect.DelegatingMethodAccessorImpl#invoke at line:43
    java.lang.reflect.Method#invoke at line:498
    org.gradle.internal.dispatch.ReflectionDispatch#dispatch at line:36
    org.gradle.internal.dispatch.ReflectionDispatch#dispatch at line:24
    org.gradle.internal.remote.internal.hub.MessageHubBackedObjectConnection$DispatchWrapper#dispatch
at line:182
    org.gradle.internal.remote.internal.hub.MessageHubBackedObjectConnection$DispatchWrapper#dispatch
at line:164
    org.gradle.internal.remote.internal.hub.MessageHub$Handler#run at line:412
    org.gradle.internal.concurrent.ExecutorPolicy$CatchAndRecordFailures#onExecute at line:64
    org.gradle.internal.concurrent.ManagedExecutorImpl$1#run at line:48
    java.util.concurrent.ThreadPoolExecutor#runWorker at line:1149
    java.util.concurrent.ThreadPoolExecutor$Worker#run at line:624
    org.gradle.internal.concurrent.ThreadFactoryImpl$ManagedThreadRunnable#run at line:56
    java.lang.Thread#run at line:748

    Thread[main,5,main], stackTrace:sun.misc.Unsafe#park
    java.util.concurrent.locks.LockSupport#park at line:175
    java.util.concurrent.locks.AbstractQueuedSynchronizer#parkAndCheckInterrupt at line:836
    java.util.concurrent.locks.AbstractQueuedSynchronizer#doAcquireSharedInterruptibly at
line:997
    java.util.concurrent.locks.AbstractQueuedSynchronizer#acquireSharedInterruptibly at line:1304
    java.util.concurrent.CountDownLatch#await at line:231
    org.gradle.api.internal.tasks.testing.worker.TestWorker#execute at line:72
    org.gradle.api.internal.tasks.testing.worker.TestWorker#execute at line:46
    org.gradle.process.internal.worker.child.ActionExecutionWorker#execute at line:91
    org.gradle.process.internal.worker.child.ActionExecutionWorker#execute at line:34
    org.gradle.process.internal.worker.child.SystemApplicationClassLoaderWorker#call at line:137
    org.gradle.process.internal.worker.child.SystemApplicationClassLoaderWorker#call at line:69
    worker.org.gradle.process.internal.worker.GradleWorkerMain#run at line:68
    worker.org.gradle.process.internal.worker.GradleWorkerMain#main at line:73

    Thread[/127.0.0.1:62858 to /127.0.0.1:62845 workers Thread 3,5,main], stackTrace:sun.nio.ch.WindowsSelectorImpl$SubSelector#poll0
    sun.nio.ch.WindowsSelectorImpl$SubSelector#poll at line:296
    sun.nio.ch.WindowsSelectorImpl$SubSelector#access$400 at line:278
    sun.nio.ch.WindowsSelectorImpl#doSelect at line:159
    sun.nio.ch.SelectorImpl#lockAndDoSelect at line:86
    sun.nio.ch.SelectorImpl#select at line:97
    sun.nio.ch.SelectorImpl#select at line:101
    org.gradle.internal.remote.internal.inet.SocketConnection$SocketInputStream#read at line:185
    com.esotericsoftware.kryo.io.Input#fill at line:146
    com.esotericsoftware.kryo.io.Input#require at line:178
    com.esotericsoftware.kryo.io.Input#readByte at line:295
    org.gradle.internal.serialize.kryo.KryoBackedDecoder#readByte at line:81
    org.gradle.internal.remote.internal.hub.InterHubMessageSerializer$MessageReader#read at
line:64
    org.gradle.internal.remote.internal.hub.InterHubMessageSerializer$MessageReader#read at
line:52
    org.gradle.internal.remote.internal.inet.SocketConnection#receive at line:81
    org.gradle.internal.remote.internal.hub.MessageHub$ConnectionReceive#run at line:268
    org.gradle.internal.concurrent.ExecutorPolicy$CatchAndRecordFailures#onExecute at line:64
    org.gradle.internal.concurrent.ManagedExecutorImpl$1#run at line:48
    java.util.concurrent.ThreadPoolExecutor#runWorker at line:1149
    java.util.concurrent.ThreadPoolExecutor$Worker#run at line:624
    org.gradle.internal.concurrent.ThreadFactoryImpl$ManagedThreadRunnable#run at line:56
    java.lang.Thread#run at line:748

          4.1sec,   18 completed,   0 failed,   0 skipped, org.apache.jmeter.samplers.TestSampleResult
          0.0sec,    7 completed,   0 failed,   0 skipped, org.apache.jmeter.samplers.TestSampleSaveConfiguration
          0.0sec,   11 completed,   0 failed,   0 skipped, org.apache.jmeter.save.TestCSVSaveService
          0.0sec,    2 completed,   0 failed,   0 skipped, org.apache.jmeter.testbeans.gui.TestBooleanPropertyEditor
          0.1sec,    2 completed,   0 failed,   0 skipped, org.apache.jmeter.testbeans.gui.TestComboStringEditor
          0.0sec,    2 completed,   0 failed,   0 skipped, org.apache.jmeter.testbeans.gui.TestFieldStringEditor
          0.0sec,    2 completed,   0 failed,   0 skipped, org.apache.jmeter.testelement.PackageTest
          0.0sec,    6 completed,   0 failed,   0 skipped, org.apache.jmeter.testelement.property.AbstractPropertyTest
          0.0sec,    2 completed,   0 failed,   0 skipped, org.apache.jmeter.testelement.property.MapPropertyTest
          0.0sec,   11 completed,   0 failed,   0 skipped, org.apache.jmeter.testelement.property.PackageTest
          0.0sec,    5 completed,   0 failed,   0 skipped, org.apache.jmeter.testelement.TestNumberProperty
          0.0sec,    1 completed,   0 failed,   0 skipped, org.apache.jmeter.threads.TestJMeterContextService
          0.0sec,    3 completed,   0 failed,   0 skipped, org.apache.jmeter.threads.TestJMeterThread
          0.0sec,    1 completed,   0 failed,   0 skipped, org.apache.jmeter.threads.TestTestCompiler
          0.0sec,   17 completed,   0 failed,   0 skipped, org.apache.jmeter.threads.TestUnmodifiableJMeterVariables
          0.4sec,    2 completed,   0 failed,   0 skipped, org.apache.jmeter.util.JSR223TestElementTest
          0.0sec,    1 completed,   0 failed,   0 skipped, org.apache.jmeter.util.PackageTest
          0.0sec,    5 completed,   0 failed,   0 skipped, org.apache.jmeter.util.StringUtilitiesTest
          0.0sec,    3 completed,   0 failed,   0 skipped, org.apache.jmeter.util.TestJMeterUtils
          0.9sec,   11 completed,   0 failed,   0 skipped, org.apache.jmeter.util.XPathUtilTest
          0.0sec,    6 completed,   0 failed,   0 skipped, org.apache.jorphan.reflect.TestFunctor
          0.0sec,    4 completed,   0 failed,   0 skipped, org.apache.jorphan.TestXMLBuffer

PackageTest > checkI18n fr: messages STANDARD_OUT
    Ignoring missing junit_failure_default_code=0001 in org/apache/jmeter/resources/messages_fr.properties
    Ignoring missing aggregate_report_90=90% in org/apache/jmeter/resources/messages_fr.properties
    Ignoring missing junit_error_default_code=9999 in org/apache/jmeter/resources/messages_fr.properties
    Ignoring missing junit_success_default_code=1000 in org/apache/jmeter/resources/messages_fr.properties
          0.1sec,   12 completed,   0 failed,   0 skipped, org.apache.jmeter.resources.PackageTest
          0.0sec,    4 completed,   0 failed,   0 skipped, org.apache.jmeter.samplers.TestDataStrippingSampleSender
          0.1sec,    4 completed,   0 failed,   0 skipped, org.apache.jmeter.engine.util.FunctionParserSpec
          0.9sec,    1 completed,   0 failed,   0 skipped, org.apache.jmeter.gui.HtmlReportGUISpec
          0.0sec,   14 completed,   0 failed,   0 skipped, org.apache.jmeter.report.core.ConvertersSpec
          0.0sec,    6 completed,   0 failed,   0 skipped, org.apache.jmeter.report.core.SampleMetadataParserSpec
          0.0sec,    1 completed,   0 failed,   0 skipped, org.apache.jmeter.report.processor.ApdexSummaryConsumerSpec
          0.0sec,    3 completed,   0 failed,   0 skipped, org.apache.jmeter.report.processor.FieldSampleComparatorSpec
          0.1sec,    2 completed,   0 failed,   0 skipped, org.apache.jmeter.report.processor.graph.impl.ResponseTimePercentilesOverTimeGraphConsumerSpec
          0.0sec,    4 completed,   0 failed,   0 skipped, org.apache.jmeter.report.processor.ListResultDataSpec
          0.2sec,    4 completed,   0 failed,   0 skipped, org.apache.jmeter.report.processor.Top5ErrorsBySamplerConsumerSpec
          0.0sec,    5 completed,   0 failed,   0 skipped, org.apache.jmeter.report.processor.Top5ErrorsSummaryDataSpec
          0.1sec,   23 completed,   0 failed,   0 skipped, org.apache.jmeter.services.FileServerSpec
          0.0sec,    3 completed,   0 failed,   0 skipped, org.apache.jmeter.util.keystore.JmeterKeyStoreSpec
         18.7sec,  264 completed,   0 failed,   0 skipped, Gradle Test Run :src:core:test

> Task :src:core:check
> Task :src:core:assemble

> Task :src:components:test
          1.2sec,    9 completed,   0 failed,   0 skipped, org.apache.jmeter.timers.ConstantThroughputTimerTest
          0.3sec,    6 completed,   0 failed,   0 skipped, org.apache.jmeter.timers.poissonarrivals.PreciseThroughputTimerTest
          0.6sec,    4 completed,   0 failed,   0 skipped, org.apache.jmeter.timers.SyncTimerTest
          0.0sec,    4 completed,   0 failed,   0 skipped, org.apache.jmeter.timers.TimerServiceTest
          1.4sec,    4 completed,   0 failed,   0 skipped, org.apache.jmeter.visualizers.backend.influxdb.HttpMetricsSenderTest
          0.1sec,    3 completed,   0 failed,   0 skipped, org.apache.jmeter.visualizers.backend.SamplerMetricFixedModeTest
          0.0sec,    2 completed,   0 failed,   0 skipped, org.apache.jmeter.visualizers.backend.SamplerMetricTimedModeTest
          0.0sec,    8 completed,   0 failed,   0 skipped, org.apache.jmeter.visualizers.TestRenderAsJson
          0.0sec,    2 completed,   0 failed,   0 skipped, org.apache.jmeter.visualizers.TestSamplingStatCalculator
          0.2sec,   27 completed,   0 failed,   0 skipped, org.apache.jmeter.assertions.jmespath.TestJMESPathAssertion$TestAssertion
          0.2sec,   27 completed,   0 failed,   0 skipped, org.apache.jmeter.assertions.jmespath.TestJMESPathAssertion
          0.0sec,   10 completed,   0 failed,   0 skipped, org.apache.jmeter.extractor.json.jmespath.TestJMESPathExtractor$SourceVarOrResponse
          0.0sec,   10 completed,   0 failed,   0 skipped, org.apache.jmeter.extractor.json.jmespath.TestJMESPathExtractor$MatchNumberMoreThanZeroOn1ExtractedValue
          0.0sec,    6 completed,   0 failed,   0 skipped, org.apache.jmeter.extractor.json.jmespath.TestJMESPathExtractor$MultipleMatchesOnAllExtractedValues
          0.0sec,    6 completed,   0 failed,   0 skipped, org.apache.jmeter.extractor.json.jmespath.TestJMESPathExtractor$OneMatchOnAllExtractedValues
          0.0sec,   32 completed,   0 failed,   0 skipped, org.apache.jmeter.extractor.json.jmespath.TestJMESPathExtractor
          0.0sec,    9 completed,   0 failed,   0 skipped, org.apache.jmeter.visualizers.TestSampleCompareTo
          0.2sec,    7 completed,   0 failed,   0 skipped, org.apache.jmeter.assertions.CompareAssertionSpec

> Task :src:dist-check:batchBug50898
Mar 24, 2020 2:04:06 PM java.util.prefs.WindowsPreferences <init>
WARNING: Could not open/create prefs root node Software\JavaSoft\Prefs at root 0x80000002.
Windows RegCreateKeyEx(...) returned error code 5.
Creating summariser <summary>
Created the tree successfully using F:\jenkins\jenkins-slave\workspace\JMeter Windows\bin\testfiles\Bug50898.jmx
Starting standalone test @ Tue Mar 24 14:04:06 PDT 2020 (1585083846774)
Waiting for possible Shutdown/StopTestNow/HeapDump/ThreadDump message on port 4445
summary =      2 in 00:00:00 =   14.5/s Avg:     6 Min:     6 Max:     7 Err:     0 (0.00%)
Tidying up ...    @ Tue Mar 24 14:04:07 PDT 2020 (1585083847504)
... end of run
No errors present in the logfile F:\jenkins\jenkins-slave\workspace\JMeter Windows\bin\Bug50898.log
(the file is empty)

> Task :src:dist:javadocAggregate
javadoc: warning - Multiple sources of package comments found for package "org.apache.jmeter.assertions"
javadoc: warning - Multiple sources of package comments found for package "org.apache.jmeter.visualizers"
javadoc: warning - Multiple sources of package comments found for package "org.apache.jmeter.report.config"
javadoc: warning - Multiple sources of package comments found for package "org.apache.jmeter.report.core"
javadoc: warning - Multiple sources of package comments found for package "org.apache.jmeter.report.dashboard"
javadoc: warning - Multiple sources of package comments found for package "org.apache.jmeter.report.processor"
javadoc: warning - Multiple sources of package comments found for package "org.apache.jmeter.report.processor.graph"
javadoc: warning - Multiple sources of package comments found for package "org.apache.jmeter.report.processor.graph.impl"
javadoc: warning - Multiple sources of package comments found for package "org.apache.commons.cli.avalon"

> Task :src:dist-check:batchBug52968
Mar 24, 2020 2:04:09 PM java.util.prefs.WindowsPreferences <init>
WARNING: Could not open/create prefs root node Software\JavaSoft\Prefs at root 0x80000002.
Windows RegCreateKeyEx(...) returned error code 5.
Creating summariser <summary>
Created the tree successfully using F:\jenkins\jenkins-slave\workspace\JMeter Windows\bin\testfiles\Bug52968.jmx
Starting standalone test @ Tue Mar 24 14:04:09 PDT 2020 (1585083849735)
Waiting for possible Shutdown/StopTestNow/HeapDump/ThreadDump message on port 4445
summary =     30 in 00:00:00 =   65.6/s Avg:     5 Min:     4 Max:     7 Err:     9 (30.00%)
Tidying up ...    @ Tue Mar 24 14:04:10 PDT 2020 (1585083850783)
... end of run
No errors present in the logfile F:\jenkins\jenkins-slave\workspace\JMeter Windows\bin\Bug52968.log
(the file is empty)

> Task :src:components:test
          0.5sec,    5 completed,   0 failed,   0 skipped, org.apache.jmeter.assertions.gui.AssertionGuiSpec
          0.0sec,    7 completed,   0 failed,   0 skipped, org.apache.jmeter.assertions.MD5HexAssertionSpec
          0.1sec,    4 completed,   0 failed,   0 skipped, org.apache.jmeter.control.RandomOrderControllerSpec
WARNING   0.1sec,    5 completed,   0 failed,   1 skipped, org.apache.jmeter.control.RunTimeSpec
          0.1sec,    8 completed,   0 failed,   0 skipped, org.apache.jmeter.control.ThroughputControllerSpec
          0.2sec,   37 completed,   0 failed,   0 skipped, org.apache.jmeter.extractor.BoundaryExtractorSpec
          0.0sec,    4 completed,   0 failed,   0 skipped, org.apache.jmeter.extractor.JoddExtractorSpec
          0.3sec,    8 completed,   0 failed,   0 skipped, org.apache.jmeter.extractor.json.render.RenderAsJmesPathRendererSpec
          0.1sec,    8 completed,   0 failed,   0 skipped, org.apache.jmeter.extractor.json.render.RenderAsJsonRendererSpec
          0.0sec,    6 completed,   0 failed,   0 skipped, org.apache.jmeter.timers.UniformRandomTimerSpec
          0.2sec,    7 completed,   0 failed,   0 skipped, org.apache.jmeter.visualizers.backend.graphite.PickleGraphiteMetricsSenderSpec
          0.0sec,    5 completed,   0 failed,   0 skipped, org.apache.jmeter.visualizers.backend.graphite.TextGraphiteMetricsSenderSpec
          2.3sec, org.apache.jmeter.visualizers.backend.influxdb.InfluxdbBackendListenerClientSpec,
Sending metrics when empty does not raise an exception
          2.4sec,    3 completed,   0 failed,   0 skipped, org.apache.jmeter.visualizers.backend.influxdb.InfluxdbBackendListenerClientSpec
FAILURE  18.7sec,  487 completed,   7 failed,   2 skipped, Gradle Test Run :src:components:test

487 tests completed, 7 failed, 2 skipped

> Task :src:components:test FAILED

> Task :src:dist-check:batchBug54685
Mar 24, 2020 2:04:12 PM java.util.prefs.WindowsPreferences <init>
WARNING: Could not open/create prefs root node Software\JavaSoft\Prefs at root 0x80000002.
Windows RegCreateKeyEx(...) returned error code 5.
Creating summariser <summary>
Created the tree successfully using F:\jenkins\jenkins-slave\workspace\JMeter Windows\bin\testfiles\Bug54685.jmx
Starting standalone test @ Tue Mar 24 14:04:12 PDT 2020 (1585083852701)
Waiting for possible Shutdown/StopTestNow/HeapDump/ThreadDump message on port 4445
summary =      1 in 00:00:00 =    7.6/s Avg:     5 Min:     5 Max:     5 Err:     0 (0.00%)
Tidying up ...    @ Tue Mar 24 14:04:13 PDT 2020 (1585083853421)
... end of run
No errors present in the logfile F:\jenkins\jenkins-slave\workspace\JMeter Windows\bin\Bug54685.log
(the file is empty)

> Task :src:dist:javadocAggregate
9 warnings
checksum-dependency elapsed time: 3683ms, configurations processed: 231 (add -PchecksumTimingsPrint
to print detailed timings)

FAILURE: Build failed with an exception.

* What went wrong:
Execution failed for task ':src:components:test'.
> There were failing tests. See the report at: file:///F:/jenkins/jenkins-slave/workspace/JMeter%20Windows/src/components/build/reports/tests/test/index.html

* Try:
Run with --stacktrace option to get the stack trace. Run with --info or --debug option to
get more log output. Run with --scan to get full insights.

* Get more help at https://help.gradle.org

Deprecated Gradle features were used in this build, making it incompatible with Gradle 7.0.
Use '--warning-mode all' to show the individual deprecation warnings.
See https://docs.gradle.org/6.1/userguide/command_line_interface.html#sec:command_line_warnings

BUILD FAILED in 2m 35s
242 actionable tasks: 130 executed, 112 up-to-date
Could not open/create prefs root node Software\JavaSoft\Prefs at root 0x80000002. Windows
RegCreateKeyEx(...) returned error code 5.
Build step 'Invoke Gradle script' changed build result to FAILURE
Build step 'Invoke Gradle script' marked build as failure

Mime
View raw message