jmeter-dev mailing list archives

Site index · List index
Message view « Date » · « Thread »
Top « Date » · « Thread »
From Apache Jenkins Server <jenk...@builds.apache.org>
Subject Build failed in Jenkins: JMeter-trunk #7658
Date Tue, 10 Mar 2020 19:47:55 GMT
See <https://builds.apache.org/job/JMeter-trunk/7658/display/redirect?page=changes>

Changes:

[felix.schumacher] Recurse into sub samplers more deeply when checking assertions

[felix.schumacher] Recurse into sampleResults for getSampleList


------------------------------------------
[...truncated 102.39 KB...]
> Task :src:dist:distTarSourceSha512

> Task :src:bshclient:spotbugsMain
SpotBugs rule violations were found. See the report at: file://<https://builds.apache.org/job/JMeter-trunk/ws/src/bshclient/build/reports/spotbugs/main.xml>

> Task :src:bshclient:spotbugsTest NO-SOURCE
> Task :src:bshclient:test NO-SOURCE
> Task :src:bshclient:check
> Task :src:bshclient:jar UP-TO-DATE
> Task :src:bshclient:assemble UP-TO-DATE
> Task :src:launcher:spotbugsMain
> Task :src:launcher:spotbugsTest NO-SOURCE
> Task :src:launcher:test NO-SOURCE
> Task :src:launcher:check
> Task :src:launcher:assemble UP-TO-DATE
> Task :src:core:compileJava
> Task :src:core:compileGroovy NO-SOURCE
> Task :src:core:classes
> Task :src:core:jar
> Task :src:protocol:junit-sample:compileJava
> Task :src:protocol:junit-sample:classes
> Task :src:protocol:native:compileJava
> Task :src:protocol:native:classes
> Task :src:protocol:junit-sample:jar UP-TO-DATE
> Task :src:protocol:native:jar UP-TO-DATE

> Task :src:protocol:ftp:compileJava
Note: <https://builds.apache.org/job/JMeter-trunk/ws/src/protocol/ftp/src/main/java/org/apache/jmeter/protocol/ftp/sampler/FTPSampler.java>
uses or overrides a deprecated API.
Note: Recompile with -Xlint:deprecation for details.

> Task :src:protocol:ftp:classes
> Task :src:dist:distZipSource
> Task :src:protocol:mongodb:compileJava
> Task :src:protocol:mongodb:classes
> Task :src:protocol:junit:compileJava
> Task :src:protocol:junit:classes
> Task :src:protocol:mongodb:jar UP-TO-DATE
> Task :src:protocol:junit:jar UP-TO-DATE
> Task :src:protocol:ftp:jar UP-TO-DATE

> Task :src:protocol:tcp:compileJava
Note: Some input files use or override a deprecated API.
Note: Recompile with -Xlint:deprecation for details.

> Task :src:protocol:tcp:classes
> Task :src:protocol:java:compileJava
> Task :src:protocol:java:classes
> Task :src:protocol:tcp:jar UP-TO-DATE
> Task :src:protocol:java:jar UP-TO-DATE
> Task :src:protocol:ldap:compileJava
> Task :src:protocol:ldap:classes
> Task :src:protocol:ldap:jar UP-TO-DATE
> Task :src:protocol:mail:compileJava
> Task :src:protocol:mail:classes
> Task :src:dist:distZipSourceSha512
> Task :src:protocol:mail:jar UP-TO-DATE

> Task :src:protocol:jms:compileJava
Note: Some input files use or override a deprecated API.
Note: Recompile with -Xlint:deprecation for details.

> Task :src:protocol:jms:classes
> Task :src:protocol:jms:jar UP-TO-DATE
> Task :src:protocol:bolt:compileJava
> Task :src:protocol:bolt:compileGroovy NO-SOURCE
> Task :src:protocol:bolt:classes
> Task :src:protocol:bolt:jar UP-TO-DATE

> Task :src:protocol:jdbc:compileJava
Note: <https://builds.apache.org/job/JMeter-trunk/ws/src/protocol/jdbc/src/main/java/org/apache/jmeter/protocol/jdbc/config/DataSourceElement.java>
uses or overrides a deprecated API.
Note: Recompile with -Xlint:deprecation for details.

> Task :src:protocol:jdbc:compileGroovy NO-SOURCE
> Task :src:protocol:jdbc:classes
> Task :src:protocol:jdbc:jar UP-TO-DATE

> Task :src:core:compileTestJava
Note: Some input files use or override a deprecated API.
Note: Recompile with -Xlint:deprecation for details.

> Task :src:dist:processSiteXslt
> Task :src:protocol:junit-sample:checkstyleMain
> Task :src:protocol:bolt:checkstyleMain
> Task :src:protocol:mongodb:checkstyleMain
> Task :src:protocol:ldap:checkstyleMain
> Task :src:protocol:junit:checkstyleMain
> Task :src:protocol:java:checkstyleMain
> Task :src:protocol:tcp:checkstyleMain
> Task :src:protocol:jms:checkstyleMain
> Task :src:protocol:jdbc:checkstyleMain
> Task :src:protocol:ftp:checkstyleMain
> Task :src:protocol:native:checkstyleMain

> Task :src:jorphan:spotbugsMain
SpotBugs rule violations were found. See the report at: file://<https://builds.apache.org/job/JMeter-trunk/ws/src/jorphan/build/reports/spotbugs/main.xml>

> Task :src:protocol:mail:checkstyleMain

> Task :src:components:compileJava
Note: Some input files use or override a deprecated API.
Note: Recompile with -Xlint:deprecation for details.
Note: Some input files use unchecked or unsafe operations.
Note: Recompile with -Xlint:unchecked for details.

> Task :src:components:compileGroovy NO-SOURCE
> Task :src:components:classes
> Task :src:generator:compileJava
> Task :src:generator:classes
> Task :src:generator:jar UP-TO-DATE
> Task :src:examples:compileJava
> Task :src:examples:classes
> Task :src:components:checkstyleMain
> Task :src:generator:checkstyleMain
> Task :src:generator:compileTestJava NO-SOURCE
> Task :src:generator:testClasses UP-TO-DATE
> Task :src:generator:checkstyleTest NO-SOURCE
> Task :src:generator:assemble UP-TO-DATE
> Task :src:examples:checkstyleMain
> Task :src:examples:compileTestJava NO-SOURCE
> Task :src:examples:testClasses UP-TO-DATE
> Task :src:examples:checkstyleTest NO-SOURCE
> Task :src:examples:jar UP-TO-DATE
> Task :src:examples:assemble UP-TO-DATE
> Task :src:core:compileTestGroovy
> Task :src:core:processTestResources UP-TO-DATE
> Task :src:core:testClasses
> Task :src:core:testJar
> Task :src:core:autostyleConfigsCheck
> Task :src:core:autostyleGroovyCheck
> Task :src:core:autostyleJavaCheck FAILED

> Task :src:protocol:junit-sample:spotbugsMain
SpotBugs rule violations were found. See the report at: file://<https://builds.apache.org/job/JMeter-trunk/ws/src/protocol/junit-sample/build/reports/spotbugs/main.xml>

> Task :src:protocol:ldap:spotbugsMain
> Task :src:protocol:jdbc:spotbugsMain
> Task :src:protocol:bolt:spotbugsMain
> Task :src:protocol:jms:spotbugsMain
> Task :src:protocol:ftp:spotbugsMain
> Task :src:protocol:tcp:spotbugsMain
> Task :src:protocol:java:spotbugsMain
> Task :src:protocol:junit:spotbugsMain
> Task :src:protocol:mongodb:spotbugsMain
> Task :src:protocol:native:spotbugsMain
> Task :src:jorphan:spotbugsTest
> Task :src:protocol:mail:spotbugsMain
> Task :src:components:spotbugsMain

> Task :src:protocol:bolt:spotbugsMain
SpotBugs rule violations were found. See the report at: file://<https://builds.apache.org/job/JMeter-trunk/ws/src/protocol/bolt/build/reports/spotbugs/main.xml>

> Task :src:protocol:mongodb:spotbugsMain
SpotBugs rule violations were found. See the report at: file://<https://builds.apache.org/job/JMeter-trunk/ws/src/protocol/mongodb/build/reports/spotbugs/main.xml>

> Task :src:protocol:native:spotbugsMain
SpotBugs rule violations were found. See the report at: file://<https://builds.apache.org/job/JMeter-trunk/ws/src/protocol/native/build/reports/spotbugs/main.xml>

> Task :src:protocol:junit:spotbugsMain
SpotBugs rule violations were found. See the report at: file://<https://builds.apache.org/job/JMeter-trunk/ws/src/protocol/junit/build/reports/spotbugs/main.xml>

> Task :src:protocol:ftp:spotbugsMain
SpotBugs rule violations were found. See the report at: file://<https://builds.apache.org/job/JMeter-trunk/ws/src/protocol/ftp/build/reports/spotbugs/main.xml>

> Task :src:protocol:jdbc:spotbugsMain
SpotBugs rule violations were found. See the report at: file://<https://builds.apache.org/job/JMeter-trunk/ws/src/protocol/jdbc/build/reports/spotbugs/main.xml>

> Task :src:protocol:tcp:spotbugsMain
SpotBugs rule violations were found. See the report at: file://<https://builds.apache.org/job/JMeter-trunk/ws/src/protocol/tcp/build/reports/spotbugs/main.xml>

> Task :src:protocol:mail:spotbugsMain
SpotBugs rule violations were found. See the report at: file://<https://builds.apache.org/job/JMeter-trunk/ws/src/protocol/mail/build/reports/spotbugs/main.xml>

> Task :src:protocol:jms:spotbugsMain
SpotBugs rule violations were found. See the report at: file://<https://builds.apache.org/job/JMeter-trunk/ws/src/protocol/jms/build/reports/spotbugs/main.xml>

> Task :src:jorphan:spotbugsTest
SpotBugs rule violations were found. See the report at: file://<https://builds.apache.org/job/JMeter-trunk/ws/src/jorphan/build/reports/spotbugs/test.xml>

> Task :src:components:spotbugsMain
The following classes needed for analysis were missing:
  org.bouncycastle.asn1.x500.style.BCStyle
  org.bouncycastle.asn1.ASN1ObjectIdentifier
  org.bouncycastle.asn1.ASN1Encodable
  org.bouncycastle.asn1.x509.Extension
  org.bouncycastle.operator.DigestCalculatorProvider
  org.bouncycastle.util.Selector
  org.bouncycastle.cert.X509CertificateHolder
  org.bouncycastle.cms.SignerInformationVerifier
  org.bouncycastle.mail.smime.SMIMESignedParser
  org.bouncycastle.operator.bc.BcDigestCalculatorProvider
  org.bouncycastle.cms.CMSException
  org.bouncycastle.mail.smime.SMIMEException
  org.bouncycastle.cms.SignerInformationStore
  org.bouncycastle.cms.SignerInformation
  org.bouncycastle.util.Store
  org.bouncycastle.cms.jcajce.JcaSimpleSignerInfoVerifierBuilder
  org.bouncycastle.asn1.x500.X500Name
  org.bouncycastle.cert.jcajce.JcaX509CertificateHolder
  org.bouncycastle.asn1.x500.RDN
  org.bouncycastle.asn1.x500.AttributeTypeAndValue
  org.bouncycastle.asn1.x500.style.IETFUtils
  org.bouncycastle.asn1.x509.GeneralNames
  org.bouncycastle.asn1.x509.GeneralName
  org.bouncycastle.jce.provider.BouncyCastleProvider
  org.bouncycastle.operator.OperatorCreationException
SpotBugs rule violations were found. See the report at: file://<https://builds.apache.org/job/JMeter-trunk/ws/src/components/build/reports/spotbugs/main.xml>
checksum-dependency elapsed time: 21061ms, configurations processed: 235
    SHA-512 computation time: 129ms (goes in parallel, it might exceed wall-clock time), files
processed: 45, processed: 7MiB, skipped: 2159MiB
    PGP signature resolution time: 7115ms (wall-clock), resolution requests: 137, signatures
resolved: 218
    PGP key resolution time: 10032ms (wall-clock), resolution requests: 137, download time:
0ms (goes in parallel, it might exceed wall-clock time), keys downloaded: 0
        PGP signature verification time: 16268ms (goes in parallel, it might exceed wall-clock
time), files processed: 501, processed: 613MiB, skipped: 1528MiB

FAILURE: Build failed with an exception.

* What went wrong:
Execution failed for task ':src:core:autostyleJavaCheck'.
> The following files have format violations:
    src/core/src/main/java/org/apache/jmeter/testelement/AbstractScopedTestElement.java
      @@ -18,7 +18,6 @@
       package org.apache.jmeter.testelement;
       
       import java.util.ArrayList;
      -import java.util.Arrays;
       import java.util.Collections;
       import java.util.List;
       
  Run './gradlew autostyleApply' to fix the violations.

* Try:
Run with --stacktrace option to get the stack trace. Run with --info or --debug option to
get more log output. Run with --scan to get full insights.

* Get more help at https://help.gradle.org

Deprecated Gradle features were used in this build, making it incompatible with Gradle 7.0.
Use '--warning-mode all' to show the individual deprecation warnings.
See https://docs.gradle.org/6.1/userguide/command_line_interface.html#sec:command_line_warnings

BUILD FAILED in 3m 27s
218 actionable tasks: 149 executed, 69 up-to-date

See the profiling report at: file://<https://builds.apache.org/job/JMeter-trunk/ws/build/reports/profile/profile-2020-03-10-19-44-19.html>
A fine-grained performance profile is available: use the --scan option.
Build step 'Invoke Gradle script' changed build result to FAILURE
Build step 'Invoke Gradle script' marked build as failure
Xvfb stopping
Archiving artifacts
[Fast Archiver] Compressed 32.92 MB of artifacts by 59.2% relative to #7657
Recording test results
ERROR: Step ?Publish JUnit test result report? failed: No test report files were found. Configuration
error?

Mime
View raw message