jmeter-dev mailing list archives

Site index · List index
Message view « Date » · « Thread »
Top « Date » · « Thread »
From Apache Jenkins Server <jenk...@builds.apache.org>
Subject Build failed in Jenkins: JMeter-trunk #7698
Date Sun, 29 Mar 2020 14:15:52 GMT
See <https://builds.apache.org/job/JMeter-trunk/7698/display/redirect?page=changes>

Changes:

[pmouawad] Bug 64283 - XPath2 Extractor: Improve UX


------------------------------------------
[...truncated 25.60 KB...]
> Task :src:generator:autostyleConfigsCheck NO-SOURCE
> Task :src:protocol:bolt:processResources UP-TO-DATE
> Task :src:release:autostyleConfigsCheck NO-SOURCE
> Task :src:protocol:autostyleConfigsCheck NO-SOURCE
> Task :src:protocol:mongodb:processResources UP-TO-DATE
> Task :src:protocol:autostyleJavaCheck NO-SOURCE
> Task :src:dist-check:autostyleConfigsCheck NO-SOURCE
> Task :src:protocol:http:processResources UP-TO-DATE
> Task :src:licenses:autostyleConfigsCheck NO-SOURCE
> Task :src:release:autostyleJavaCheck NO-SOURCE
> Task :src:launcher:compileJava UP-TO-DATE
> Task :src:testkit:compileJava UP-TO-DATE
> Task :src:protocol:ftp:autostyleConfigsCheck NO-SOURCE
> Task :src:protocol:mongodb:processTestResources NO-SOURCE
> Task :src:licenses:autostyleJavaCheck NO-SOURCE
> Task :src:protocol:bolt:processTestResources NO-SOURCE
> Task :src:protocol:jdbc:processResources UP-TO-DATE
> Task :src:testkit:processResources NO-SOURCE
> Task :src:protocol:jdbc:processTestResources NO-SOURCE
> Task :src:testkit:classes UP-TO-DATE
> Task :src:functions:processTestResources UP-TO-DATE
> Task :src:launcher:processResources UP-TO-DATE
> Task :src:launcher:classes UP-TO-DATE
> Task :src:core:versionClass
> Task :src:launcher:jar UP-TO-DATE
> Task :src:launcher:autostyleConfigsCheck NO-SOURCE
> Task :src:testkit:jar UP-TO-DATE
> Task :src:testkit:compileTestFixturesJava NO-SOURCE
> Task :src:protocol:http:processTestResources UP-TO-DATE
> Task :src:testkit:processTestFixturesResources NO-SOURCE
> Task :src:testkit:testFixturesClasses UP-TO-DATE
> Task :src:testkit:testFixturesJar UP-TO-DATE
> Task :src:testkit:autostyleConfigsCheck NO-SOURCE
> Task :src:protocol:bolt:autostyleConfigsCheck
> Task :src:functions:autostyleConfigsCheck
> Task :src:autostyleConfigsCheck
> Task :src:examples:autostyleConfigsCheck
> Task :src:protocol:java:autostyleConfigsCheck
> Task :src:protocol:http:autostyleConfigsCheck
> Task :src:protocol:bolt:autostyleGroovyCheck
> Task :src:protocol:jdbc:autostyleConfigsCheck
> Task :src:functions:autostyleGroovyCheck
> Task :src:jorphan:compileJava UP-TO-DATE
> Task :src:jorphan:compileGroovy NO-SOURCE
> Task :src:dist-check:autostyleGroovyCheck
> Task :src:protocol:http:autostyleGroovyCheck
> Task :src:jorphan:processResources UP-TO-DATE
> Task :src:jorphan:classes UP-TO-DATE
> Task :src:protocol:jdbc:autostyleGroovyCheck
> Task :src:jorphan:jar UP-TO-DATE
> Task :src:testkit-wiremock:compileJava UP-TO-DATE
> Task :src:testkit-wiremock:processResources NO-SOURCE
> Task :src:testkit-wiremock:classes UP-TO-DATE
> Task :src:testkit-wiremock:jar UP-TO-DATE
> Task :src:testkit-wiremock:compileTestFixturesJava NO-SOURCE
> Task :src:testkit-wiremock:processTestFixturesResources NO-SOURCE
> Task :src:testkit-wiremock:testFixturesClasses UP-TO-DATE
> Task :src:testkit-wiremock:testFixturesJar UP-TO-DATE
> Task :src:testkit-wiremock:autostyleConfigsCheck NO-SOURCE
> Task :src:components:autostyleConfigsCheck
> Task :src:jorphan:compileTestJava UP-TO-DATE
> Task :src:jorphan:compileTestGroovy UP-TO-DATE
> Task :src:jorphan:processTestResources NO-SOURCE
> Task :src:jorphan:testClasses UP-TO-DATE
> Task :src:components:autostyleGroovyCheck
> Task :src:jorphan:testJar UP-TO-DATE
> Task :src:jorphan:autostyleConfigsCheck NO-SOURCE
> Task :src:jorphan:autostyleGroovyCheck
> Task :autostyleConfigsCheck
> Task :autostyleJavaCheck NO-SOURCE
> Task :src:core:processResources
> Task :src:bshclient:autostyleJavaCheck
> Task :src:testkit-wiremock:autostyleJavaCheck
> Task :src:generator:autostyleJavaCheck
> Task :src:testkit:autostyleJavaCheck
> Task :src:launcher:autostyleJavaCheck
> Task :src:examples:autostyleJavaCheck
> Task :src:protocol:bolt:autostyleJavaCheck
> Task :src:protocol:bolt:autostyleKotlinGradleCheck NO-SOURCE
> Task :src:protocol:ftp:autostyleJavaCheck
> Task :src:protocol:bolt:autostyleMarkdownCheck NO-SOURCE
> Task :src:protocol:ftp:autostyleKotlinGradleCheck NO-SOURCE
> Task :src:protocol:bolt:autostyleCheck
> Task :src:protocol:ftp:autostyleMarkdownCheck NO-SOURCE
> Task :src:protocol:ftp:autostyleCheck
> Task :src:protocol:junit:autostyleConfigsCheck NO-SOURCE
> Task :src:protocol:jms:autostyleConfigsCheck NO-SOURCE
> Task :src:dist-check:autostyleJavaCheck
> Task :src:protocol:jdbc:autostyleJavaCheck
> Task :src:protocol:jdbc:autostyleKotlinGradleCheck NO-SOURCE
> Task :src:protocol:jdbc:autostyleMarkdownCheck NO-SOURCE
> Task :src:protocol:jdbc:autostyleCheck
> Task :src:protocol:junit-sample:autostyleConfigsCheck NO-SOURCE
> Task :src:protocol:junit:autostyleJavaCheck
> Task :src:protocol:junit:autostyleKotlinGradleCheck NO-SOURCE
> Task :src:protocol:junit:autostyleMarkdownCheck NO-SOURCE
> Task :src:protocol:junit:autostyleCheck
> Task :src:protocol:ldap:autostyleConfigsCheck NO-SOURCE
> Task :src:protocol:java:autostyleJavaCheck
> Task :src:protocol:java:autostyleKotlinGradleCheck NO-SOURCE
> Task :src:protocol:java:autostyleMarkdownCheck NO-SOURCE
> Task :src:protocol:java:autostyleCheck
> Task :src:protocol:mail:autostyleConfigsCheck NO-SOURCE
> Task :src:protocol:junit-sample:autostyleJavaCheck
> Task :src:protocol:junit-sample:autostyleKotlinGradleCheck NO-SOURCE
> Task :src:protocol:junit-sample:autostyleMarkdownCheck NO-SOURCE
> Task :src:protocol:junit-sample:autostyleCheck
> Task :src:protocol:junit-sample:processTestResources NO-SOURCE
> Task :src:protocol:mongodb:autostyleConfigsCheck
> Task :src:protocol:mongodb:autostyleJavaCheck
> Task :src:protocol:mongodb:autostyleKotlinGradleCheck NO-SOURCE
> Task :src:protocol:mongodb:autostyleMarkdownCheck NO-SOURCE
> Task :src:protocol:mongodb:autostyleCheck
> Task :src:protocol:native:autostyleConfigsCheck NO-SOURCE
> Task :src:protocol:native:autostyleJavaCheck
> Task :src:protocol:ldap:autostyleJavaCheck
> Task :src:protocol:ldap:autostyleKotlinGradleCheck NO-SOURCE
> Task :src:protocol:ldap:autostyleMarkdownCheck NO-SOURCE
> Task :src:protocol:ldap:autostyleCheck
> Task :src:protocol:native:autostyleKotlinGradleCheck NO-SOURCE
> Task :src:protocol:native:autostyleMarkdownCheck NO-SOURCE
> Task :src:protocol:native:autostyleCheck
> Task :src:protocol:tcp:autostyleConfigsCheck NO-SOURCE
> Task :src:protocol:mail:autostyleJavaCheck
> Task :src:protocol:mail:autostyleKotlinGradleCheck NO-SOURCE
> Task :src:protocol:mail:autostyleMarkdownCheck NO-SOURCE
> Task :src:protocol:mail:autostyleCheck
> Task :src:protocol:jms:autostyleJavaCheck
> Task :src:protocol:jms:autostyleKotlinGradleCheck NO-SOURCE
> Task :src:protocol:jms:autostyleMarkdownCheck NO-SOURCE
> Task :src:protocol:jms:autostyleCheck
> Task :src:protocol:tcp:autostyleJavaCheck
> Task :src:protocol:tcp:autostyleKotlinGradleCheck NO-SOURCE
> Task :src:protocol:tcp:autostyleMarkdownCheck NO-SOURCE
> Task :src:protocol:tcp:autostyleCheck
> Task :src:functions:autostyleJavaCheck
> Task :src:jorphan:autostyleJavaCheck
> Task :src:protocol:http:autostyleJavaCheck
> Task :src:protocol:http:autostyleKotlinGradleCheck NO-SOURCE
> Task :src:examples:autostyleKotlinGradleCheck
> Task :src:testkit:autostyleKotlinGradleCheck
> Task :src:testkit:autostyleMarkdownCheck NO-SOURCE
> Task :src:testkit:autostyleCheck
> Task :src:examples:autostyleMarkdownCheck NO-SOURCE
> Task :src:examples:autostyleCheck
> Task :src:generator:autostyleKotlinGradleCheck
> Task :src:jorphan:autostyleKotlinGradleCheck
> Task :src:generator:autostyleMarkdownCheck NO-SOURCE
> Task :src:testkit-wiremock:autostyleKotlinGradleCheck
> Task :src:generator:autostyleCheck
> Task :src:bshclient:autostyleKotlinGradleCheck
> Task :src:testkit-wiremock:autostyleMarkdownCheck NO-SOURCE
> Task :src:jorphan:autostyleMarkdownCheck NO-SOURCE
> Task :src:jorphan:autostyleCheck
> Task :src:protocol:http:autostyleMarkdownCheck NO-SOURCE
> Task :src:protocol:http:autostyleCheck
> Task :src:examples:processResources UP-TO-DATE
> Task :src:testkit-wiremock:autostyleCheck
> Task :src:bshclient:autostyleMarkdownCheck NO-SOURCE
> Task :src:generator:processTestResources NO-SOURCE
> Task :src:examples:processTestResources NO-SOURCE
> Task :src:bshclient:autostyleCheck
> Task :src:functions:autostyleKotlinGradleCheck
> Task :src:launcher:autostyleKotlinGradleCheck
> Task :src:functions:autostyleMarkdownCheck NO-SOURCE
> Task :src:functions:autostyleCheck
> Task :src:launcher:autostyleMarkdownCheck NO-SOURCE
> Task :src:launcher:autostyleCheck
> Task :src:bshclient:compileJava UP-TO-DATE
> Task :src:bshclient:processResources NO-SOURCE
> Task :src:bshclient:classes UP-TO-DATE
> Task :src:release:autostyleKotlinGradleCheck
> Task :src:release:autostyleMarkdownCheck NO-SOURCE
> Task :src:release:autostyleCheck
> Task :src:release:compileJava NO-SOURCE
> Task :src:release:processResources NO-SOURCE
> Task :src:release:classes UP-TO-DATE
> Task :src:config:autostyleKotlinGradleCheck
> Task :src:release:checkstyleMain NO-SOURCE
> Task :src:config:autostyleMarkdownCheck NO-SOURCE
> Task :src:release:compileTestJava NO-SOURCE
> Task :src:config:autostyleCheck
> Task :src:release:processTestResources NO-SOURCE
> Task :src:release:testClasses UP-TO-DATE
> Task :src:config:compileJava NO-SOURCE
> Task :src:config:processResources NO-SOURCE
> Task :src:config:classes UP-TO-DATE
> Task :src:config:checkstyleMain NO-SOURCE
> Task :src:release:checkstyleTest NO-SOURCE
> Task :src:config:compileTestJava NO-SOURCE
> Task :src:config:processTestResources NO-SOURCE
> Task :src:release:spotbugsMain NO-SOURCE
> Task :src:components:autostyleJavaCheck FAILED
> Task :src:config:testClasses UP-TO-DATE
> Task :src:config:checkstyleTest NO-SOURCE
> Task :src:release:spotbugsTest NO-SOURCE
> Task :src:release:test NO-SOURCE
> Task :src:testkit:checkstyleMain UP-TO-DATE
> Task :src:launcher:checkstyleMain UP-TO-DATE
> Task :src:jorphan:checkstyleMain UP-TO-DATE
> Task :src:testkit-wiremock:checkstyleMain UP-TO-DATE
> Task :src:bshclient:checkstyleMain UP-TO-DATE
> Task :src:protocol:autostyleKotlinGradleCheck
> Task :src:bom:autostyleKotlinGradleCheck
> Task :src:autostyleKotlinGradleCheck
> Task :src:licenses:autostyleKotlinGradleCheck
> Task :src:dist-check:autostyleKotlinGradleCheck
> Task :src:dist:autostyleKotlinGradleCheck
> Task :autostyleKotlinGradleCheck
> Task :src:core:compileJava
checksum-dependency elapsed time: 8733ms, configurations processed: 105 (add -PchecksumTimingsPrint
to print detailed timings)

FAILURE: Build failed with an exception.

* What went wrong:
Execution failed for task ':src:components:autostyleJavaCheck'.
> The following files have format violations:
    src/components/src/main/java/org/apache/jmeter/extractor/gui/XPath2ExtractorGui.java
      @@ -125,7 +125,7 @@
           private JPanel makeParameterPanel() {
               JPanel mainPanel = new JPanel(new BorderLayout());
               mainPanel.add(createScopePanel(true, true, true), BorderLayout.NORTH);
      -��������\n
      +\n
               JPanel panel = new JPanel(new MigLayout("fillx, wrap 2", "[][fill,grow]"));
               panel.setBorder(BorderFactory.createTitledBorder(
                       JMeterUtils.getResString("xpath2_extractor_properties")));
  Run './gradlew autostyleApply' to fix the violations.

* Try:
Run with --stacktrace option to get the stack trace. Run with --info or --debug option to
get more log output. Run with --scan to get full insights.

* Get more help at https://help.gradle.org

Deprecated Gradle features were used in this build, making it incompatible with Gradle 7.0.
Use '--warning-mode all' to show the individual deprecation warnings.
See https://docs.gradle.org/6.3/userguide/command_line_interface.html#sec:command_line_warnings

BUILD FAILED in 21s
121 actionable tasks: 77 executed, 44 up-to-date

See the profiling report at: file://<https://builds.apache.org/job/JMeter-trunk/ws/build/reports/profile/profile-2020-03-29-14-15-31.html>
A fine-grained performance profile is available: use the --scan option.
Build step 'Invoke Gradle script' changed build result to FAILURE
Build step 'Invoke Gradle script' marked build as failure
Xvfb stopping
Archiving artifacts
Recording test results
ERROR: Step ?Publish JUnit test result report? failed: No test report files were found. Configuration
error?

Mime
View raw message