jmeter-dev mailing list archives

Site index · List index
Message view « Date » · « Thread »
Top « Date » · « Thread »
From Apache Jenkins Server <jenk...@builds.apache.org>
Subject Build failed in Jenkins: JMeter-trunk #7653
Date Sat, 07 Mar 2020 14:53:16 GMT
See <https://builds.apache.org/job/JMeter-trunk/7653/display/redirect?page=changes>

Changes:

[felix.schumacher] Markup changes and a few minor typos


------------------------------------------
[...truncated 96.82 KB...]
> Task :src:testkit-wiremock:testClasses UP-TO-DATE
> Task :src:testkit-wiremock:checkstyleTest NO-SOURCE
> Task :src:testkit-wiremock:checkstyleTestFixtures NO-SOURCE
> Task :src:licenses:gatherSourceLicenses UP-TO-DATE
> Task :src:licenses:renderLicenseForSource UP-TO-DATE
> Task :src:components:processResources UP-TO-DATE
> Task :src:bshclient:spotbugsMain UP-TO-DATE
> Task :src:launcher:spotbugsMain UP-TO-DATE
> Task :src:bshclient:spotbugsTest NO-SOURCE
> Task :src:launcher:spotbugsTest NO-SOURCE
> Task :src:bshclient:test NO-SOURCE
> Task :src:bshclient:check
> Task :src:launcher:test NO-SOURCE
> Task :src:launcher:check
> Task :src:launcher:assemble UP-TO-DATE
> Task :src:testkit:checkstyleMain UP-TO-DATE
> Task :src:testkit:compileTestJava NO-SOURCE
> Task :src:testkit:processTestResources NO-SOURCE
> Task :src:testkit:testClasses UP-TO-DATE
> Task :src:bshclient:jar UP-TO-DATE
> Task :src:testkit:checkstyleTest NO-SOURCE
> Task :src:components:processTestResources UP-TO-DATE
> Task :src:testkit:checkstyleTestFixtures NO-SOURCE
> Task :src:bshclient:assemble UP-TO-DATE
> Task :src:jorphan:spotbugsMain UP-TO-DATE
> Task :src:testkit-wiremock:spotbugsMain UP-TO-DATE
> Task :src:testkit-wiremock:spotbugsTest NO-SOURCE
> Task :src:testkit-wiremock:spotbugsTestFixtures NO-SOURCE
> Task :src:testkit-wiremock:test NO-SOURCE
> Task :src:testkit-wiremock:check
> Task :src:testkit-wiremock:assemble UP-TO-DATE
> Task :src:testkit:spotbugsMain UP-TO-DATE
> Task :src:testkit:spotbugsTest NO-SOURCE
> Task :src:testkit:spotbugsTestFixtures NO-SOURCE
> Task :src:testkit:test NO-SOURCE
> Task :src:testkit:check
> Task :src:testkit:assemble UP-TO-DATE
> Task :src:dist-check:populateLibs
> Task :src:jorphan:spotbugsTest UP-TO-DATE
> Task :src:dist:autostyleKotlinGradleCheck
> Task :src:dist:autostyleMarkdownCheck NO-SOURCE
> Task :src:dist:autostyleCheck
> Task :src:dist:processResources NO-SOURCE
> Task :src:dist:processTestResources NO-SOURCE
> Task :src:dist:preparePropertiesbuildPrintableDoc UP-TO-DATE
> Task :autostyleKotlinGradleCheck
> Task :src:licenses:renderLicenseForSourceCopySpec
> Task :src:licenses:srcLicenseDir UP-TO-DATE
> Task :src:licenses:jar UP-TO-DATE
> Task :src:config:jar UP-TO-DATE
> Task :src:config:assemble UP-TO-DATE
> Task :autostyleMarkdownCheck
> Task :autostyleCheck
> Task :compileJava NO-SOURCE
> Task :processResources NO-SOURCE
> Task :classes UP-TO-DATE
> Task :checkstyleMain NO-SOURCE
> Task :compileTestJava NO-SOURCE
> Task :processTestResources NO-SOURCE
> Task :testClasses UP-TO-DATE
> Task :checkstyleTest NO-SOURCE
> Task :src:core:jar
> Task :src:core:compileTestJava UP-TO-DATE
> Task :gitProps
> Task :src:protocol:jdbc:compileJava UP-TO-DATE
> Task :src:protocol:jdbc:compileGroovy NO-SOURCE
> Task :src:protocol:jdbc:classes UP-TO-DATE
> Task :src:protocol:bolt:compileJava UP-TO-DATE
> Task :src:components:compileJava UP-TO-DATE
> Task :src:protocol:bolt:compileGroovy NO-SOURCE
> Task :src:components:compileGroovy NO-SOURCE
> Task :src:protocol:bolt:classes UP-TO-DATE
> Task :src:components:classes UP-TO-DATE
> Task :src:protocol:jdbc:jar UP-TO-DATE
> Task :src:protocol:bolt:jar UP-TO-DATE
> Task :src:examples:compileJava UP-TO-DATE
> Task :src:generator:compileJava UP-TO-DATE
> Task :src:examples:classes UP-TO-DATE
> Task :src:generator:classes UP-TO-DATE
> Task :src:generator:jar UP-TO-DATE
> Task :src:dist:buildPrintableDoc
> Task :spotbugsMain NO-SOURCE
> Task :spotbugsTest NO-SOURCE
> Task :test NO-SOURCE
> Task :jar UP-TO-DATE
> Task :assemble UP-TO-DATE

> Task :src:jorphan:test

PackageTest STANDARD_ERROR
    SLF4J: Failed to load class "org.slf4j.impl.StaticLoggerBinder".
    SLF4J: Defaulting to no-operation (NOP) logger implementation
    SLF4J: See http://www.slf4j.org/codes.html#StaticLoggerBinder for further details.
          0.1sec,    5 completed,   0 failed,   0 skipped, org.apache.jorphan.collections.PackageTest
          0.2sec,   50 completed,   0 failed,   0 skipped, org.apache.jorphan.util.TestJorphanUtils
          0.0sec,    8 completed,   0 failed,   0 skipped, org.apache.jorphan.util.TestConverter
WARNING   0.0sec,   10 completed,   0 failed,   2 skipped, org.apache.jorphan.math.TestStatCalculator
          0.0sec,    6 completed,   0 failed,   0 skipped, org.apache.jorphan.gui.ObjectTableModelTest
          0.1sec,   26 completed,   0 failed,   0 skipped, org.apache.jorphan.gui.ObjectTableSorterTest

> Task :src:protocol:tcp:checkstyleMain
> Task :src:protocol:jms:checkstyleMain
> Task :src:protocol:junit:checkstyleMain
> Task :src:generator:checkstyleMain
> Task :src:components:checkstyleMain
> Task :src:examples:checkstyleMain
> Task :src:protocol:native:checkstyleMain
> Task :src:protocol:junit-sample:checkstyleMain
> Task :src:protocol:ldap:checkstyleMain
> Task :src:protocol:bolt:checkstyleMain
> Task :src:protocol:jdbc:checkstyleMain
> Task :src:protocol:mail:checkstyleMain
> Task :src:examples:compileTestJava NO-SOURCE
> Task :src:generator:compileTestJava NO-SOURCE
> Task :src:examples:testClasses UP-TO-DATE
> Task :src:generator:testClasses UP-TO-DATE
> Task :src:generator:checkstyleTest NO-SOURCE
> Task :src:examples:checkstyleTest NO-SOURCE
> Task :src:generator:assemble UP-TO-DATE
> Task :src:examples:jar UP-TO-DATE
> Task :src:examples:assemble UP-TO-DATE
> Task :src:protocol:ftp:checkstyleMain
> Task :src:protocol:java:checkstyleMain
> Task :src:protocol:mongodb:checkstyleMain
> Task :src:core:compileTestGroovy
> Task :src:core:processTestResources UP-TO-DATE
> Task :src:core:testClasses
> Task :src:core:testJar UP-TO-DATE
> Task :src:core:autostyleConfigsCheck
> Task :src:core:autostyleGroovyCheck FAILED
> Task :rat
> Task :src:dist:distTarSource

> Task :src:protocol:junit-sample:spotbugsMain
SpotBugs rule violations were found. See the report at: file://<https://builds.apache.org/job/JMeter-trunk/ws/src/protocol/junit-sample/build/reports/spotbugs/main.xml>

> Task :src:jorphan:test
         10.8sec, org.apache.jorphan.exec.TestKeyToolUtils > testDNSNameBasedCert()

> Task :src:protocol:bolt:spotbugsMain
SpotBugs rule violations were found. See the report at: file://<https://builds.apache.org/job/JMeter-trunk/ws/src/protocol/bolt/build/reports/spotbugs/main.xml>

> Task :src:protocol:tcp:spotbugsMain
> Task :src:protocol:jms:spotbugsMain
> Task :src:protocol:native:spotbugsMain
> Task :src:components:spotbugsMain
> Task :src:protocol:junit:spotbugsMain
> Task :src:protocol:jdbc:spotbugsMain
> Task :src:protocol:ldap:spotbugsMain
> Task :src:protocol:mail:spotbugsMain
> Task :src:protocol:ftp:spotbugsMain
> Task :src:protocol:java:spotbugsMain
> Task :src:protocol:mongodb:spotbugsMain
SpotBugs rule violations were found. See the report at: file://<https://builds.apache.org/job/JMeter-trunk/ws/src/protocol/mongodb/build/reports/spotbugs/main.xml>

> Task :src:jorphan:test
          9.3sec, org.apache.jorphan.exec.TestKeyToolUtils > testIPBasedCert()
         31.8sec,    3 completed,   0 failed,   0 skipped, org.apache.jorphan.exec.TestKeyToolUtils
          0.1sec,    4 completed,   0 failed,   0 skipped, org.apache.jorphan.reflect.TestClassTools

> Task :src:protocol:jdbc:spotbugsMain
SpotBugs rule violations were found. See the report at: file://<https://builds.apache.org/job/JMeter-trunk/ws/src/protocol/jdbc/build/reports/spotbugs/main.xml>

> Task :src:jorphan:test
          1.9sec,   16 completed,   0 failed,   0 skipped, org.apache.jorphan.io.TextFileSpec
          0.5sec,   32 completed,   0 failed,   0 skipped, org.apache.jorphan.util.ConverterSpec
WARNING  39.6sec,  202 completed,   0 failed,   2 skipped, Gradle
Test Run :src:jorphan:test

> Task :src:protocol:ftp:spotbugsMain
SpotBugs rule violations were found. See the report at: file://<https://builds.apache.org/job/JMeter-trunk/ws/src/protocol/ftp/build/reports/spotbugs/main.xml>

> Task :src:protocol:tcp:spotbugsMain
SpotBugs rule violations were found. See the report at: file://<https://builds.apache.org/job/JMeter-trunk/ws/src/protocol/tcp/build/reports/spotbugs/main.xml>

> Task :src:protocol:native:spotbugsMain
SpotBugs rule violations were found. See the report at: file://<https://builds.apache.org/job/JMeter-trunk/ws/src/protocol/native/build/reports/spotbugs/main.xml>

> Task :src:protocol:junit:spotbugsMain
SpotBugs rule violations were found. See the report at: file://<https://builds.apache.org/job/JMeter-trunk/ws/src/protocol/junit/build/reports/spotbugs/main.xml>

> Task :src:protocol:mail:spotbugsMain
SpotBugs rule violations were found. See the report at: file://<https://builds.apache.org/job/JMeter-trunk/ws/src/protocol/mail/build/reports/spotbugs/main.xml>

> Task :src:protocol:jms:spotbugsMain
SpotBugs rule violations were found. See the report at: file://<https://builds.apache.org/job/JMeter-trunk/ws/src/protocol/jms/build/reports/spotbugs/main.xml>

> Task :src:components:spotbugsMain
The following classes needed for analysis were missing:
  org.bouncycastle.asn1.x500.style.BCStyle
  org.bouncycastle.asn1.ASN1ObjectIdentifier
  org.bouncycastle.asn1.ASN1Encodable
  org.bouncycastle.asn1.x509.Extension
  org.bouncycastle.operator.DigestCalculatorProvider
  org.bouncycastle.util.Selector
  org.bouncycastle.cert.X509CertificateHolder
  org.bouncycastle.cms.SignerInformationVerifier
  org.bouncycastle.mail.smime.SMIMESignedParser
  org.bouncycastle.operator.bc.BcDigestCalculatorProvider
  org.bouncycastle.cms.CMSException
  org.bouncycastle.mail.smime.SMIMEException
  org.bouncycastle.cms.SignerInformationStore
  org.bouncycastle.cms.SignerInformation
  org.bouncycastle.util.Store
  org.bouncycastle.cms.jcajce.JcaSimpleSignerInfoVerifierBuilder
  org.bouncycastle.asn1.x500.X500Name
  org.bouncycastle.cert.jcajce.JcaX509CertificateHolder
  org.bouncycastle.asn1.x500.RDN
  org.bouncycastle.asn1.x500.AttributeTypeAndValue
  org.bouncycastle.asn1.x500.style.IETFUtils
  org.bouncycastle.asn1.x509.GeneralNames
  org.bouncycastle.asn1.x509.GeneralName
  org.bouncycastle.jce.provider.BouncyCastleProvider
  org.bouncycastle.operator.OperatorCreationException
SpotBugs rule violations were found. See the report at: file://<https://builds.apache.org/job/JMeter-trunk/ws/src/components/build/reports/spotbugs/main.xml>
checksum-dependency elapsed time: 12318ms, configurations processed: 235 (add -PchecksumTimingsPrint
to print detailed timings)

FAILURE: Build failed with an exception.

* What went wrong:
Execution failed for task ':src:core:autostyleGroovyCheck'.
> The following files have format violations:
    src/core/src/test/groovy/org/apache/jmeter/engine/util/FunctionParserSpec.groovy
      @@ -59,4 +59,4 @@
                   return "__func()"
               }
           }
      -}
      +}\n
  Run './gradlew autostyleApply' to fix the violations.

* Try:
Run with --stacktrace option to get the stack trace. Run with --info or --debug option to
get more log output. Run with --scan to get full insights.

* Get more help at https://help.gradle.org

Deprecated Gradle features were used in this build, making it incompatible with Gradle 7.0.
Use '--warning-mode all' to show the individual deprecation warnings.
See https://docs.gradle.org/6.1/userguide/command_line_interface.html#sec:command_line_warnings

BUILD FAILED in 1m 35s
214 actionable tasks: 101 executed, 113 up-to-date

See the profiling report at: file://<https://builds.apache.org/job/JMeter-trunk/ws/build/reports/profile/profile-2020-03-07-14-51-28.html>
A fine-grained performance profile is available: use the --scan option.
Build step 'Invoke Gradle script' changed build result to FAILURE
Build step 'Invoke Gradle script' marked build as failure
Xvfb stopping
Archiving artifacts
Recording test results

Mime
View raw message