jmeter-dev mailing list archives

Site index · List index
Message view « Date » · « Thread »
Top « Date » · « Thread »
From Apache Jenkins Server <jenk...@builds.apache.org>
Subject Build failed in Jenkins: JMeter Windows #1637
Date Mon, 23 Mar 2020 15:56:31 GMT
See <https://builds.apache.org/job/JMeter%20Windows/1637/display/redirect?page=changes>

Changes:

[felix.schumacher] Recurse into sub samplers more deeply when checking assertions

[felix.schumacher] Recurse into sampleResults for getSampleList

[felix.schumacher] Remove unneeded import

[sitnikov.vladimir] Simplify runGui Gradle task

[sitnikov.vladimir] Add Button.defaultButtonFollowsFocus=false

[sitnikov.vladimir] Add darklaf look and feel

[sitnikov.vladimir] Update darklaf: 1.4.1.0 -> 1.4.2.0

[felix.schumacher] Error when loading Templates on Windows

[felix.schumacher] Error when loading Templates on Windows

[felix.schumacher] Keep divider location when changing visualizer mode

[sitnikov.vladimir] Normalize vertical size for HTTP request path field

[sitnikov.vladimir] Add screenshots for Darklaf look and feel

[sitnikov.vladimir] Fix context menu UX: show it on right-click no matter what was the

[sitnikov.vladimir] Extract JTextAreaWithBorder component

[sitnikov.vladimir] Use SVG icon for splashscreen

[sitnikov.vladimir] Update look and feel without restart

[sitnikov.vladimir] Use ctrl+alt+wheel for font zooming

[sitnikov.vladimir] Make Darklaf toolbar buttons thin

[sitnikov.vladimir] Show context menu for the full row, not just for the tree label

[sitnikov.vladimir] Change the toolbar container to also be a toolbar and use an empty

[sitnikov.vladimir] Support SVG icons for the toolbar

[sitnikov.vladimir] Fix import order

[sitnikov.vladimir] Remove etched borders.

[sitnikov.vladimir] Do not include runGui coverage to the default coverage report

[sitnikov.vladimir] Skip well known flaky tests by default


------------------------------------------
[...truncated 174.58 KB...]
          0.0sec,    4 completed,   0 failed,   0 skipped, org.apache.jmeter.samplers.TestDataStrippingSampleSender
          0.1sec,    4 completed,   0 failed,   0 skipped, org.apache.jmeter.engine.util.FunctionParserSpec
          0.8sec,    1 completed,   0 failed,   0 skipped, org.apache.jmeter.gui.HtmlReportGUISpec
          0.0sec,   14 completed,   0 failed,   0 skipped, org.apache.jmeter.report.core.ConvertersSpec
          0.0sec,    6 completed,   0 failed,   0 skipped, org.apache.jmeter.report.core.SampleMetadataParserSpec
          0.1sec,    1 completed,   0 failed,   0 skipped, org.apache.jmeter.report.processor.ApdexSummaryConsumerSpec
          0.0sec,    3 completed,   0 failed,   0 skipped, org.apache.jmeter.report.processor.FieldSampleComparatorSpec
          0.1sec,    2 completed,   0 failed,   0 skipped, org.apache.jmeter.report.processor.graph.impl.ResponseTimePercentilesOverTimeGraphConsumerSpec
          0.1sec,    4 completed,   0 failed,   0 skipped, org.apache.jmeter.report.processor.ListResultDataSpec
          0.2sec,    4 completed,   0 failed,   0 skipped, org.apache.jmeter.report.processor.Top5ErrorsBySamplerConsumerSpec
          0.0sec,    5 completed,   0 failed,   0 skipped, org.apache.jmeter.report.processor.Top5ErrorsSummaryDataSpec
          0.1sec,   23 completed,   0 failed,   0 skipped, org.apache.jmeter.services.FileServerSpec
          0.0sec,    3 completed,   0 failed,   0 skipped, org.apache.jmeter.util.keystore.JmeterKeyStoreSpec
         22.0sec,  264 completed,   0 failed,   0 skipped, Gradle Test Run :src:core:test

> Task :src:core:check
> Task :src:core:assemble

> Task :src:components:test

Gradle Test Executor 16 STANDARD_OUT
    Setting JMeterHome: F:\jenkins\jenkins-slave\workspace\JMeter Windows\src\components\..\..\.
    Initializing Properties: ../.././bin/jmeter.properties

Gradle Test Executor 16 STANDARD_ERROR
    Mar 23, 2020 8:56:12 AM java.util.prefs.WindowsPreferences <init>
    WARNING: Could not open/create prefs root node Software\JavaSoft\Prefs at root 0x80000002.
Windows RegCreateKeyEx(...) returned error code 5.

Gradle Test Executor 16 STANDARD_OUT
    JMeterVersion=5.3-SNAPSHOT 207f526
    java.version=1.8.0_152
    java.vm.name=Java HotSpot(TM) 64-Bit Server VM
    java.vendor=Oracle Corporation
    java.home=F:\jenkins\tools\java\latest1.8\jre
    file.encoding=windows-1252
    default encoding=windows-1252
    user.home=C:\Users\jenkins
    user.dir=F:\jenkins\jenkins-slave\workspace\JMeter Windows\src\components
    user.language=en
    user.region=null
    user.country=US
    user.variant=
    Locale=en_US
    java.class.version=52.0
    java.awt.headless=null
    os.name=Windows Server 2016
    os.version=10.0
    os.arch=amd64
          0.2sec,    4 completed,   0 failed,   0 skipped, org.apache.jmeter.assertions.DurationAssertionTest
          0.4sec,    7 completed,   0 failed,   0 skipped, org.apache.jmeter.assertions.gui.TestJSONPathAssertionGui
          0.3sec,    7 completed,   0 failed,   0 skipped, org.apache.jmeter.assertions.jmespath.gui.JMESPathAssertionGuiTest
          0.2sec,   10 completed,   0 failed,   0 skipped, org.apache.jmeter.assertions.ResponseAssertionTest
          0.0sec,    6 completed,   0 failed,   0 skipped, org.apache.jmeter.assertions.SizeAssertionTest
          0.9sec,    6 completed,   0 failed,   0 skipped, org.apache.jmeter.assertions.SMIMEAssertionTest
          0.1sec,   25 completed,   0 failed,   0 skipped, org.apache.jmeter.assertions.TestJSONPathAssertion
          0.0sec,    4 completed,   0 failed,   0 skipped, org.apache.jmeter.assertions.XmlAssertionTest
          0.4sec,    9 completed,   0 failed,   0 skipped, org.apache.jmeter.assertions.XMLSchemaAssertionTest
          0.9sec,   14 completed,   0 failed,   0 skipped, org.apache.jmeter.assertions.XPath2AssertionTest
          0.4sec,   29 completed,   0 failed,   0 skipped, org.apache.jmeter.assertions.XPathAssertionTest
          0.0sec,    1 completed,   0 failed,   0 skipped, org.apache.jmeter.config.gui.TestArgumentsPanel
          0.1sec,    6 completed,   0 failed,   0 skipped, org.apache.jmeter.config.TestCVSDataSet
          0.0sec,    3 completed,   0 failed,   0 skipped, org.apache.jmeter.config.TestRandomVariableConfig
          0.0sec,    1 completed,   0 failed,   0 skipped, org.apache.jmeter.control.TestGenericController
WARNING   0.8sec,    8 completed,   0 failed,   1 skipped, org.apache.jmeter.control.TestIfController
          0.0sec,    6 completed,   0 failed,   0 skipped, org.apache.jmeter.control.TestInterleaveControl
          0.1sec,    4 completed,   0 failed,   0 skipped, org.apache.jmeter.control.TestLoopController
          0.0sec,    4 completed,   0 failed,   0 skipped, org.apache.jmeter.control.TestOnceOnlyController
          0.0sec,    3 completed,   0 failed,   0 skipped, org.apache.jmeter.control.TestRandomController
          0.1sec,    1 completed,   0 failed,   0 skipped, org.apache.jmeter.control.TestTransactionController
          0.0sec,   12 completed,   0 failed,   0 skipped, org.apache.jmeter.control.TestWhileController
          0.0sec,    4 completed,   0 failed,   0 skipped, org.apache.jmeter.extractor.TestBoundaryExtractor
          0.2sec,   14 completed,   0 failed,   0 skipped, org.apache.jmeter.extractor.TestHtmlExtractorJodd
          0.1sec,   14 completed,   0 failed,   0 skipped, org.apache.jmeter.extractor.TestHtmlExtractorJSoup
          0.0sec,    9 completed,   0 failed,   0 skipped, org.apache.jmeter.extractor.TestJSONPostProcessor
          0.1sec,   25 completed,   0 failed,   0 skipped, org.apache.jmeter.extractor.TestRegexExtractor
          0.1sec,    7 completed,   0 failed,   0 skipped, org.apache.jmeter.extractor.TestXPath2Extractor
          0.2sec,    6 completed,   0 failed,   0 skipped, org.apache.jmeter.extractor.TestXPathExtractor
FAILURE   0.0sec, org.apache.jmeter.gui.action.template.TestTemplateManager > testSameButParamsTemplatesAreNotEqual()
    java.lang.RuntimeException: java.io.FileNotFoundException: F:\jenkins\jenkins-slave\workspace\JMeter%20Windows\src\components\build\resources\test\org\apache\jmeter\gui\action\template\validTemplates.xml
(The system cannot find the path specified)
        at org.apache.jmeter.gui.action.template.TestTemplateManager.readTemplateFromFile(TestTemplateManager.java:59)
        at org.apache.jmeter.gui.action.template.TestTemplateManager.setup(TestTemplateManager.java:50)
        Caused by: java.io.FileNotFoundException: F:\jenkins\jenkins-slave\workspace\JMeter%20Windows\src\components\build\resources\test\org\apache\jmeter\gui\action\template\validTemplates.xml
(The system cannot find the path specified)
            at java.io.FileInputStream.open(FileInputStream.java:195)
            at java.io.FileInputStream.<init>(FileInputStream.java:138)
            at java.io.FileInputStream.<init>(FileInputStream.java:93)
            at sun.net.www.protocol.file.FileURLConnection.connect(FileURLConnection.java:90)
            at sun.net.www.protocol.file.FileURLConnection.getInputStream(FileURLConnection.java:188)
            at javax.xml.parsers.DocumentBuilder.parse(DocumentBuilder.java:205)
            at org.apache.jmeter.gui.action.template.TemplateManager.parseTemplateFile(TemplateManager.java:175)
            at org.apache.jmeter.gui.action.template.TestTemplateManager.readTemplateFromFile(TestTemplateManager.java:57)
            ... 1 more

FAILURE   0.0sec, org.apache.jmeter.gui.action.template.TestTemplateManager > testDifferentTemplatesAreNotEqual()
    java.lang.RuntimeException: java.io.FileNotFoundException: F:\jenkins\jenkins-slave\workspace\JMeter%20Windows\src\components\build\resources\test\org\apache\jmeter\gui\action\template\validTemplates.xml
(The system cannot find the path specified)
        at org.apache.jmeter.gui.action.template.TestTemplateManager.readTemplateFromFile(TestTemplateManager.java:59)
        at org.apache.jmeter.gui.action.template.TestTemplateManager.setup(TestTemplateManager.java:50)
        Caused by: java.io.FileNotFoundException: F:\jenkins\jenkins-slave\workspace\JMeter%20Windows\src\components\build\resources\test\org\apache\jmeter\gui\action\template\validTemplates.xml
(The system cannot find the path specified)
            at java.io.FileInputStream.open(FileInputStream.java:195)
            at java.io.FileInputStream.<init>(FileInputStream.java:138)
            at java.io.FileInputStream.<init>(FileInputStream.java:93)
            at sun.net.www.protocol.file.FileURLConnection.connect(FileURLConnection.java:90)
            at sun.net.www.protocol.file.FileURLConnection.getInputStream(FileURLConnection.java:188)
            at javax.xml.parsers.DocumentBuilder.parse(DocumentBuilder.java:205)
            at org.apache.jmeter.gui.action.template.TemplateManager.parseTemplateFile(TemplateManager.java:175)
            at org.apache.jmeter.gui.action.template.TestTemplateManager.readTemplateFromFile(TestTemplateManager.java:57)
            ... 1 more

FAILURE   0.0sec, org.apache.jmeter.gui.action.template.TestTemplateManager > testValidTemplateFile()
    java.lang.RuntimeException: java.io.FileNotFoundException: F:\jenkins\jenkins-slave\workspace\JMeter%20Windows\src\components\build\resources\test\org\apache\jmeter\gui\action\template\validTemplates.xml
(The system cannot find the path specified)
        at org.apache.jmeter.gui.action.template.TestTemplateManager.readTemplateFromFile(TestTemplateManager.java:59)
        at org.apache.jmeter.gui.action.template.TestTemplateManager.setup(TestTemplateManager.java:50)
        Caused by: java.io.FileNotFoundException: F:\jenkins\jenkins-slave\workspace\JMeter%20Windows\src\components\build\resources\test\org\apache\jmeter\gui\action\template\validTemplates.xml
(The system cannot find the path specified)
            at java.io.FileInputStream.open(FileInputStream.java:195)
            at java.io.FileInputStream.<init>(FileInputStream.java:138)
            at java.io.FileInputStream.<init>(FileInputStream.java:93)
            at sun.net.www.protocol.file.FileURLConnection.connect(FileURLConnection.java:90)
            at sun.net.www.protocol.file.FileURLConnection.getInputStream(FileURLConnection.java:188)
            at javax.xml.parsers.DocumentBuilder.parse(DocumentBuilder.java:205)
            at org.apache.jmeter.gui.action.template.TemplateManager.parseTemplateFile(TemplateManager.java:175)
            at org.apache.jmeter.gui.action.template.TestTemplateManager.readTemplateFromFile(TestTemplateManager.java:57)
            ... 1 more

FAILURE   0.0sec, org.apache.jmeter.gui.action.template.TestTemplateManager > testSameTemplatesAreEqual()
    java.lang.RuntimeException: java.io.FileNotFoundException: F:\jenkins\jenkins-slave\workspace\JMeter%20Windows\src\components\build\resources\test\org\apache\jmeter\gui\action\template\validTemplates.xml
(The system cannot find the path specified)
        at org.apache.jmeter.gui.action.template.TestTemplateManager.readTemplateFromFile(TestTemplateManager.java:59)
        at org.apache.jmeter.gui.action.template.TestTemplateManager.setup(TestTemplateManager.java:50)
        Caused by: java.io.FileNotFoundException: F:\jenkins\jenkins-slave\workspace\JMeter%20Windows\src\components\build\resources\test\org\apache\jmeter\gui\action\template\validTemplates.xml
(The system cannot find the path specified)
            at java.io.FileInputStream.open(FileInputStream.java:195)
            at java.io.FileInputStream.<init>(FileInputStream.java:138)
            at java.io.FileInputStream.<init>(FileInputStream.java:93)
            at sun.net.www.protocol.file.FileURLConnection.connect(FileURLConnection.java:90)
            at sun.net.www.protocol.file.FileURLConnection.getInputStream(FileURLConnection.java:188)
            at javax.xml.parsers.DocumentBuilder.parse(DocumentBuilder.java:205)
            at org.apache.jmeter.gui.action.template.TemplateManager.parseTemplateFile(TemplateManager.java:175)
            at org.apache.jmeter.gui.action.template.TestTemplateManager.readTemplateFromFile(TestTemplateManager.java:57)
            ... 1 more

FAILURE   0.0sec, org.apache.jmeter.gui.action.template.TestTemplateManager > testInvalidTemplateXml()
    java.lang.RuntimeException: java.io.FileNotFoundException: F:\jenkins\jenkins-slave\workspace\JMeter%20Windows\src\components\build\resources\test\org\apache\jmeter\gui\action\template\validTemplates.xml
(The system cannot find the path specified)
        at org.apache.jmeter.gui.action.template.TestTemplateManager.readTemplateFromFile(TestTemplateManager.java:59)
        at org.apache.jmeter.gui.action.template.TestTemplateManager.setup(TestTemplateManager.java:50)
        Caused by: java.io.FileNotFoundException: F:\jenkins\jenkins-slave\workspace\JMeter%20Windows\src\components\build\resources\test\org\apache\jmeter\gui\action\template\validTemplates.xml
(The system cannot find the path specified)
            at java.io.FileInputStream.open(FileInputStream.java:195)
            at java.io.FileInputStream.<init>(FileInputStream.java:138)
            at java.io.FileInputStream.<init>(FileInputStream.java:93)
            at sun.net.www.protocol.file.FileURLConnection.connect(FileURLConnection.java:90)
            at sun.net.www.protocol.file.FileURLConnection.getInputStream(FileURLConnection.java:188)
            at javax.xml.parsers.DocumentBuilder.parse(DocumentBuilder.java:205)
            at org.apache.jmeter.gui.action.template.TemplateManager.parseTemplateFile(TemplateManager.java:175)
            at org.apache.jmeter.gui.action.template.TestTemplateManager.readTemplateFromFile(TestTemplateManager.java:57)
            ... 1 more

FAILURE   0.0sec, org.apache.jmeter.gui.action.template.TestTemplateManager > equalsHashCode()
    java.lang.RuntimeException: java.io.FileNotFoundException: F:\jenkins\jenkins-slave\workspace\JMeter%20Windows\src\components\build\resources\test\org\apache\jmeter\gui\action\template\validTemplates.xml
(The system cannot find the path specified)
        at org.apache.jmeter.gui.action.template.TestTemplateManager.readTemplateFromFile(TestTemplateManager.java:59)
        at org.apache.jmeter.gui.action.template.TestTemplateManager.setup(TestTemplateManager.java:50)
        Caused by: java.io.FileNotFoundException: F:\jenkins\jenkins-slave\workspace\JMeter%20Windows\src\components\build\resources\test\org\apache\jmeter\gui\action\template\validTemplates.xml
(The system cannot find the path specified)
            at java.io.FileInputStream.open(FileInputStream.java:195)
            at java.io.FileInputStream.<init>(FileInputStream.java:138)
            at java.io.FileInputStream.<init>(FileInputStream.java:93)
            at sun.net.www.protocol.file.FileURLConnection.connect(FileURLConnection.java:90)
            at sun.net.www.protocol.file.FileURLConnection.getInputStream(FileURLConnection.java:188)
            at javax.xml.parsers.DocumentBuilder.parse(DocumentBuilder.java:205)
            at org.apache.jmeter.gui.action.template.TemplateManager.parseTemplateFile(TemplateManager.java:175)
            at org.apache.jmeter.gui.action.template.TestTemplateManager.readTemplateFromFile(TestTemplateManager.java:57)
            ... 1 more

FAILURE   0.0sec, org.apache.jmeter.gui.action.template.TestTemplateManager > testNonExistantXmlFileThrowsFileNotFoundException()
    java.lang.RuntimeException: java.io.FileNotFoundException: F:\jenkins\jenkins-slave\workspace\JMeter%20Windows\src\components\build\resources\test\org\apache\jmeter\gui\action\template\validTemplates.xml
(The system cannot find the path specified)
        at org.apache.jmeter.gui.action.template.TestTemplateManager.readTemplateFromFile(TestTemplateManager.java:59)
        at org.apache.jmeter.gui.action.template.TestTemplateManager.setup(TestTemplateManager.java:50)
        Caused by: java.io.FileNotFoundException: F:\jenkins\jenkins-slave\workspace\JMeter%20Windows\src\components\build\resources\test\org\apache\jmeter\gui\action\template\validTemplates.xml
(The system cannot find the path specified)
            at java.io.FileInputStream.open(FileInputStream.java:195)
            at java.io.FileInputStream.<init>(FileInputStream.java:138)
            at java.io.FileInputStream.<init>(FileInputStream.java:93)
            at sun.net.www.protocol.file.FileURLConnection.connect(FileURLConnection.java:90)
            at sun.net.www.protocol.file.FileURLConnection.getInputStream(FileURLConnection.java:188)
            at javax.xml.parsers.DocumentBuilder.parse(DocumentBuilder.java:205)
            at org.apache.jmeter.gui.action.template.TemplateManager.parseTemplateFile(TemplateManager.java:175)
            at org.apache.jmeter.gui.action.template.TestTemplateManager.readTemplateFromFile(TestTemplateManager.java:57)
            ... 1 more

FAILURE   0.1sec,    7 completed,   7 failed,   0 skipped, org.apache.jmeter.gui.action.template.TestTemplateManager
          0.0sec,    1 completed,   0 failed,   0 skipped, org.apache.jmeter.gui.action.TestSave
          0.0sec,    5 completed,   0 failed,   0 skipped, org.apache.jmeter.reporters.TestResultSaver
          0.4sec,    1 completed,   0 failed,   0 skipped, org.apache.jmeter.resources.ResourceKeyUsageTestComponents
          1.1sec,    9 completed,   0 failed,   0 skipped, org.apache.jmeter.timers.ConstantThroughputTimerTest
          0.2sec,    6 completed,   0 failed,   0 skipped, org.apache.jmeter.timers.poissonarrivals.PreciseThroughputTimerTest
          0.6sec,    4 completed,   0 failed,   0 skipped, org.apache.jmeter.timers.SyncTimerTest
          0.0sec,    4 completed,   0 failed,   0 skipped, org.apache.jmeter.timers.TimerServiceTest
          1.6sec,    4 completed,   0 failed,   0 skipped, org.apache.jmeter.visualizers.backend.influxdb.HttpMetricsSenderTest
          0.0sec,    3 completed,   0 failed,   0 skipped, org.apache.jmeter.visualizers.backend.SamplerMetricFixedModeTest
          0.0sec,    2 completed,   0 failed,   0 skipped, org.apache.jmeter.visualizers.backend.SamplerMetricTimedModeTest
          0.0sec,    8 completed,   0 failed,   0 skipped, org.apache.jmeter.visualizers.TestRenderAsJson
          0.0sec,    2 completed,   0 failed,   0 skipped, org.apache.jmeter.visualizers.TestSamplingStatCalculator
          0.2sec,   27 completed,   0 failed,   0 skipped, org.apache.jmeter.assertions.jmespath.TestJMESPathAssertion$TestAssertion
          0.2sec,   27 completed,   0 failed,   0 skipped, org.apache.jmeter.assertions.jmespath.TestJMESPathAssertion
          0.0sec,   10 completed,   0 failed,   0 skipped, org.apache.jmeter.extractor.json.jmespath.TestJMESPathExtractor$SourceVarOrResponse
          0.0sec,   10 completed,   0 failed,   0 skipped, org.apache.jmeter.extractor.json.jmespath.TestJMESPathExtractor$MatchNumberMoreThanZeroOn1ExtractedValue
          0.0sec,    6 completed,   0 failed,   0 skipped, org.apache.jmeter.extractor.json.jmespath.TestJMESPathExtractor$MultipleMatchesOnAllExtractedValues
          0.0sec,    6 completed,   0 failed,   0 skipped, org.apache.jmeter.extractor.json.jmespath.TestJMESPathExtractor$OneMatchOnAllExtractedValues
          0.0sec,   32 completed,   0 failed,   0 skipped, org.apache.jmeter.extractor.json.jmespath.TestJMESPathExtractor
          0.0sec,    9 completed,   0 failed,   0 skipped, org.apache.jmeter.visualizers.TestSampleCompareTo
          0.2sec,    7 completed,   0 failed,   0 skipped, org.apache.jmeter.assertions.CompareAssertionSpec
          0.5sec,    5 completed,   0 failed,   0 skipped, org.apache.jmeter.assertions.gui.AssertionGuiSpec
          0.0sec,    7 completed,   0 failed,   0 skipped, org.apache.jmeter.assertions.MD5HexAssertionSpec
          0.1sec,    4 completed,   0 failed,   0 skipped, org.apache.jmeter.control.RandomOrderControllerSpec
WARNING   0.0sec,    5 completed,   0 failed,   1 skipped, org.apache.jmeter.control.RunTimeSpec
          0.0sec,    8 completed,   0 failed,   0 skipped, org.apache.jmeter.control.ThroughputControllerSpec
          0.2sec,   37 completed,   0 failed,   0 skipped, org.apache.jmeter.extractor.BoundaryExtractorSpec
          0.0sec,    4 completed,   0 failed,   0 skipped, org.apache.jmeter.extractor.JoddExtractorSpec
          0.3sec,    8 completed,   0 failed,   0 skipped, org.apache.jmeter.extractor.json.render.RenderAsJmesPathRendererSpec
          0.1sec,    8 completed,   0 failed,   0 skipped, org.apache.jmeter.extractor.json.render.RenderAsJsonRendererSpec
          0.0sec,    6 completed,   0 failed,   0 skipped, org.apache.jmeter.timers.UniformRandomTimerSpec
          0.2sec,    7 completed,   0 failed,   0 skipped, org.apache.jmeter.visualizers.backend.graphite.PickleGraphiteMetricsSenderSpec
          0.0sec,    5 completed,   0 failed,   0 skipped, org.apache.jmeter.visualizers.backend.graphite.TextGraphiteMetricsSenderSpec
          2.3sec, org.apache.jmeter.visualizers.backend.influxdb.InfluxdbBackendListenerClientSpec,
Sending metrics when empty does not raise an exception
          2.3sec,    3 completed,   0 failed,   0 skipped, org.apache.jmeter.visualizers.backend.influxdb.InfluxdbBackendListenerClientSpec
FAILURE  18.7sec,  487 completed,   7 failed,   2 skipped, Gradle Test Run :src:components:test

487 tests completed, 7 failed, 2 skipped

> Task :src:components:test FAILED
checksum-dependency elapsed time: 29698ms, configurations processed: 218
    SHA-512 computation time: 1695ms (goes in parallel, it might exceed wall-clock time),
files processed: 16, processed: 4MiB, skipped: 2432MiB
    PGP signature resolution time: 3195ms (wall-clock), resolution requests: 128, signatures
resolved: 222
    PGP key resolution time: 13701ms (wall-clock), resolution requests: 128, download time:
461ms (goes in parallel, it might exceed wall-clock time), keys downloaded: 3
        PGP signature verification time: 40279ms (goes in parallel, it might exceed wall-clock
time), files processed: 280, processed: 226MiB, skipped: 2188MiB

FAILURE: Build failed with an exception.

* What went wrong:
Execution failed for task ':src:components:test'.
> There were failing tests. See the report at: file:///F:/jenkins/jenkins-slave/workspace/JMeter%20Windows/src/components/build/reports/tests/test/index.html

* Try:
Run with --stacktrace option to get the stack trace. Run with --info or --debug option to
get more log output. Run with --scan to get full insights.

* Get more help at https://help.gradle.org

Deprecated Gradle features were used in this build, making it incompatible with Gradle 7.0.
Use '--warning-mode all' to show the individual deprecation warnings.
See https://docs.gradle.org/6.1/userguide/command_line_interface.html#sec:command_line_warnings

BUILD FAILED in 4m 34s
224 actionable tasks: 162 executed, 62 up-to-date
Could not open/create prefs root node Software\JavaSoft\Prefs at root 0x80000002. Windows
RegCreateKeyEx(...) returned error code 5.
Build step 'Invoke Gradle script' changed build result to FAILURE
Build step 'Invoke Gradle script' marked build as failure

Mime
View raw message