jmeter-dev mailing list archives

Site index · List index
Message view « Date » · « Thread »
Top « Date » · « Thread »
From Apache Jenkins Server <jenk...@builds.apache.org>
Subject Build failed in Jenkins: JMeter-trunk #7696
Date Sun, 29 Mar 2020 13:58:03 GMT
See <https://builds.apache.org/job/JMeter-trunk/7696/display/redirect?page=changes>

Changes:

[pmouawad] Fix Violation: Remove unused imports


------------------------------------------
[...truncated 49.86 KB...]
> Task :src:protocol:java:autostyleCheck
> Task :src:protocol:mail:autostyleConfigsCheck NO-SOURCE
> Task :src:protocol:junit-sample:autostyleJavaCheck
> Task :src:protocol:junit-sample:autostyleKotlinGradleCheck NO-SOURCE
> Task :src:protocol:junit-sample:autostyleMarkdownCheck NO-SOURCE
> Task :src:protocol:junit-sample:autostyleCheck
> Task :src:protocol:junit-sample:processTestResources NO-SOURCE
> Task :src:protocol:mongodb:autostyleConfigsCheck
> Task :src:protocol:mongodb:autostyleJavaCheck
> Task :src:protocol:mongodb:autostyleKotlinGradleCheck NO-SOURCE
> Task :src:protocol:mongodb:autostyleMarkdownCheck NO-SOURCE
> Task :src:protocol:mongodb:autostyleCheck
> Task :src:protocol:native:autostyleConfigsCheck NO-SOURCE
> Task :src:protocol:ldap:autostyleJavaCheck
> Task :src:protocol:ldap:autostyleKotlinGradleCheck NO-SOURCE
> Task :src:protocol:ldap:autostyleMarkdownCheck NO-SOURCE
> Task :src:protocol:ldap:autostyleCheck
> Task :src:protocol:tcp:autostyleConfigsCheck NO-SOURCE
> Task :src:protocol:mail:autostyleJavaCheck
> Task :src:protocol:native:autostyleJavaCheck
> Task :src:protocol:native:autostyleKotlinGradleCheck NO-SOURCE
> Task :src:protocol:mail:autostyleKotlinGradleCheck NO-SOURCE
> Task :src:protocol:native:autostyleMarkdownCheck NO-SOURCE
> Task :src:protocol:native:autostyleCheck
> Task :src:protocol:mail:autostyleMarkdownCheck NO-SOURCE
> Task :src:protocol:mail:autostyleCheck
> Task :src:protocol:jms:autostyleJavaCheck
> Task :src:protocol:jms:autostyleKotlinGradleCheck NO-SOURCE
> Task :src:protocol:jms:autostyleMarkdownCheck NO-SOURCE
> Task :src:protocol:jms:autostyleCheck
> Task :src:protocol:tcp:autostyleJavaCheck
> Task :src:protocol:tcp:autostyleKotlinGradleCheck NO-SOURCE
> Task :src:protocol:tcp:autostyleMarkdownCheck NO-SOURCE
> Task :src:protocol:tcp:autostyleCheck
> Task :src:functions:autostyleJavaCheck
> Task :src:jorphan:autostyleJavaCheck
> Task :src:protocol:http:autostyleJavaCheck
> Task :src:protocol:http:autostyleKotlinGradleCheck NO-SOURCE
> Task :src:protocol:http:autostyleMarkdownCheck NO-SOURCE
> Task :src:protocol:http:autostyleCheck
> Task :src:examples:autostyleKotlinGradleCheck
> Task :src:bshclient:autostyleKotlinGradleCheck
> Task :src:bshclient:autostyleMarkdownCheck NO-SOURCE
> Task :src:bshclient:autostyleCheck
> Task :src:examples:autostyleMarkdownCheck NO-SOURCE
> Task :src:testkit:autostyleKotlinGradleCheck
> Task :src:testkit:autostyleMarkdownCheck NO-SOURCE
> Task :src:testkit:autostyleCheck
> Task :src:generator:autostyleKotlinGradleCheck
> Task :src:testkit-wiremock:autostyleKotlinGradleCheck
> Task :src:generator:autostyleMarkdownCheck NO-SOURCE
> Task :src:examples:autostyleCheck
> Task :src:generator:autostyleCheck
> Task :src:testkit-wiremock:autostyleMarkdownCheck NO-SOURCE
> Task :src:testkit-wiremock:autostyleCheck
> Task :src:generator:processTestResources NO-SOURCE
> Task :src:jorphan:autostyleKotlinGradleCheck
> Task :src:bshclient:compileJava UP-TO-DATE
> Task :src:examples:processResources UP-TO-DATE
> Task :src:jorphan:autostyleMarkdownCheck NO-SOURCE
> Task :src:bshclient:processResources NO-SOURCE
> Task :src:functions:autostyleKotlinGradleCheck
> Task :src:examples:processTestResources NO-SOURCE
> Task :src:jorphan:autostyleCheck
> Task :src:bshclient:classes UP-TO-DATE
> Task :src:functions:autostyleMarkdownCheck NO-SOURCE
> Task :src:launcher:autostyleKotlinGradleCheck
> Task :src:functions:autostyleCheck
> Task :src:launcher:autostyleMarkdownCheck NO-SOURCE
> Task :src:launcher:autostyleCheck
> Task :src:release:autostyleKotlinGradleCheck
> Task :src:release:autostyleMarkdownCheck NO-SOURCE
> Task :src:release:autostyleCheck
> Task :src:release:compileJava NO-SOURCE
> Task :src:release:processResources NO-SOURCE
> Task :src:release:classes UP-TO-DATE
> Task :src:release:checkstyleMain NO-SOURCE
> Task :src:release:compileTestJava NO-SOURCE
> Task :src:release:processTestResources NO-SOURCE
> Task :src:release:testClasses UP-TO-DATE
> Task :src:release:checkstyleTest NO-SOURCE
> Task :src:release:spotbugsMain NO-SOURCE
> Task :src:release:spotbugsTest NO-SOURCE
> Task :src:release:test NO-SOURCE
> Task :src:release:check
> Task :src:release:jar UP-TO-DATE
> Task :src:release:assemble UP-TO-DATE
> Task :src:config:autostyleKotlinGradleCheck
> Task :src:config:autostyleMarkdownCheck NO-SOURCE
> Task :src:config:autostyleCheck
> Task :src:config:compileJava NO-SOURCE
> Task :src:config:processResources NO-SOURCE
> Task :src:config:classes UP-TO-DATE
> Task :src:config:checkstyleMain NO-SOURCE
> Task :src:config:compileTestJava NO-SOURCE
> Task :src:config:processTestResources NO-SOURCE
> Task :src:config:testClasses UP-TO-DATE
> Task :src:config:checkstyleTest NO-SOURCE
> Task :src:config:spotbugsMain NO-SOURCE
> Task :src:config:spotbugsTest NO-SOURCE
> Task :src:config:test NO-SOURCE
> Task :src:config:check
> Task :src:protocol:autostyleKotlinGradleCheck
> Task :src:protocol:autostyleMarkdownCheck NO-SOURCE
> Task :src:protocol:autostyleCheck
> Task :src:bshclient:checkstyleMain UP-TO-DATE
> Task :src:testkit:checkstyleMain UP-TO-DATE
> Task :src:testkit:compileTestJava NO-SOURCE
> Task :src:bshclient:compileTestJava NO-SOURCE
> Task :src:jorphan:checkstyleMain UP-TO-DATE
> Task :src:protocol:compileJava NO-SOURCE
> Task :src:testkit:processTestResources NO-SOURCE
> Task :src:bshclient:processTestResources NO-SOURCE
> Task :src:testkit:testClasses UP-TO-DATE
> Task :src:bshclient:testClasses UP-TO-DATE
> Task :src:protocol:processResources NO-SOURCE
> Task :src:bom:autostyleKotlinGradleCheck
> Task :src:autostyleKotlinGradleCheck
> Task :src:testkit:checkstyleTest NO-SOURCE
> Task :src:protocol:classes UP-TO-DATE
> Task :src:bom:autostyleMarkdownCheck NO-SOURCE
> Task :src:autostyleMarkdownCheck NO-SOURCE
> Task :src:launcher:checkstyleMain UP-TO-DATE
> Task :src:testkit-wiremock:checkstyleMain UP-TO-DATE
> Task :src:bshclient:checkstyleTest NO-SOURCE
> Task :src:testkit:checkstyleTestFixtures NO-SOURCE
> Task :src:autostyleCheck
> Task :src:dist-check:autostyleKotlinGradleCheck
> Task :src:bom:autostyleCheck
> Task :src:launcher:compileTestJava NO-SOURCE
> Task :src:jorphan:checkstyleTest UP-TO-DATE
> Task :src:dist-check:autostyleMarkdownCheck NO-SOURCE
> Task :src:dist-check:autostyleCheck
> Task :src:testkit-wiremock:compileTestJava NO-SOURCE
> Task :src:check
> Task :src:protocol:checkstyleMain NO-SOURCE
> Task :src:bom:check
> Task :src:bom:assemble UP-TO-DATE
> Task :src:assemble UP-TO-DATE
> Task :src:launcher:processTestResources NO-SOURCE
> Task :src:testkit-wiremock:processTestResources NO-SOURCE
> Task :src:launcher:testClasses UP-TO-DATE
> Task :src:testkit-wiremock:testClasses UP-TO-DATE
> Task :src:protocol:compileTestJava NO-SOURCE
> Task :src:dist-check:processResources NO-SOURCE
> Task :src:testkit-wiremock:checkstyleTest NO-SOURCE
> Task :src:licenses:autostyleKotlinGradleCheck
> Task :src:licenses:autostyleMarkdownCheck NO-SOURCE
> Task :src:protocol:processTestResources NO-SOURCE
> Task :src:launcher:checkstyleTest NO-SOURCE
> Task :src:testkit-wiremock:checkstyleTestFixtures NO-SOURCE
> Task :src:licenses:autostyleCheck
> Task :src:protocol:testClasses UP-TO-DATE
> Task :src:protocol:checkstyleTest NO-SOURCE
> Task :src:dist-check:processTestResources UP-TO-DATE
> Task :src:protocol:spotbugsMain NO-SOURCE
> Task :src:licenses:compileJava NO-SOURCE
> Task :src:protocol:spotbugsTest NO-SOURCE
> Task :src:licenses:processResources NO-SOURCE
> Task :src:protocol:test NO-SOURCE
> Task :src:protocol:check
> Task :src:licenses:classes UP-TO-DATE
> Task :src:protocol:jar UP-TO-DATE
> Task :src:licenses:checkstyleMain NO-SOURCE
> Task :src:protocol:assemble UP-TO-DATE
> Task :src:licenses:compileTestJava NO-SOURCE
> Task :src:licenses:processTestResources NO-SOURCE
> Task :src:licenses:testClasses UP-TO-DATE
> Task :src:licenses:checkstyleTest NO-SOURCE
> Task :src:licenses:spotbugsMain NO-SOURCE
> Task :src:licenses:spotbugsTest NO-SOURCE
> Task :src:licenses:test NO-SOURCE
> Task :src:licenses:check
> Task :src:licenses:gatherSourceLicenses UP-TO-DATE
> Task :src:licenses:renderLicenseForSource UP-TO-DATE
> Task :src:testkit:spotbugsMain UP-TO-DATE
> Task :src:testkit-wiremock:spotbugsMain UP-TO-DATE
> Task :src:testkit:spotbugsTest NO-SOURCE
> Task :src:testkit-wiremock:spotbugsTest NO-SOURCE
> Task :src:testkit:spotbugsTestFixtures NO-SOURCE
> Task :src:testkit-wiremock:spotbugsTestFixtures NO-SOURCE
> Task :src:testkit-wiremock:test NO-SOURCE
> Task :src:testkit-wiremock:check
> Task :src:testkit-wiremock:assemble UP-TO-DATE
> Task :src:launcher:spotbugsMain UP-TO-DATE
> Task :src:jorphan:spotbugsMain UP-TO-DATE
> Task :src:launcher:spotbugsTest NO-SOURCE
> Task :src:bshclient:spotbugsMain UP-TO-DATE
> Task :src:testkit:test NO-SOURCE
> Task :src:launcher:test NO-SOURCE
> Task :src:testkit:check
> Task :src:dist:autostyleKotlinGradleCheck
> Task :src:testkit:assemble UP-TO-DATE
> Task :src:launcher:check
> Task :src:dist:autostyleMarkdownCheck NO-SOURCE
> Task :src:dist:autostyleCheck
> Task :src:launcher:assemble UP-TO-DATE
> Task :src:dist:processResources NO-SOURCE
> Task :src:dist:processTestResources NO-SOURCE
> Task :src:bshclient:spotbugsTest NO-SOURCE
> Task :src:dist:preparePropertiesbuildPrintableDoc UP-TO-DATE
> Task :src:bshclient:test NO-SOURCE
> Task :src:bshclient:check
> Task :src:components:autostyleJavaCheck FAILED
> Task :src:dist-check:populateLibs
> Task :src:bshclient:jar UP-TO-DATE
> Task :src:core:compileJava
> Task :autostyleKotlinGradleCheck
> Task :src:licenses:renderLicenseForSourceCopySpec
> Task :src:jorphan:spotbugsTest UP-TO-DATE
> Task :src:dist:buildPrintableDoc
checksum-dependency elapsed time: 9129ms, configurations processed: 127 (add -PchecksumTimingsPrint
to print detailed timings)

FAILURE: Build failed with an exception.

* What went wrong:
Execution failed for task ':src:components:autostyleJavaCheck'.
> The following files have format violations:
    src/components/src/main/java/org/apache/jmeter/control/gui/ThroughputControllerGui.java
      @@ -20,7 +20,6 @@
       import java.awt.BorderLayout;
       import java.awt.event.ItemEvent;
       
      -import javax.swing.BorderFactory;
       import javax.swing.DefaultComboBoxModel;
       import javax.swing.JCheckBox;
       import javax.swing.JComboBox;
  Run './gradlew autostyleApply' to fix the violations.

* Try:
Run with --stacktrace option to get the stack trace. Run with --info or --debug option to
get more log output. Run with --scan to get full insights.

* Get more help at https://help.gradle.org

Deprecated Gradle features were used in this build, making it incompatible with Gradle 7.0.
Use '--warning-mode all' to show the individual deprecation warnings.
See https://docs.gradle.org/6.3/userguide/command_line_interface.html#sec:command_line_warnings

BUILD FAILED in 21s
138 actionable tasks: 62 executed, 76 up-to-date

See the profiling report at: file://<https://builds.apache.org/job/JMeter-trunk/ws/build/reports/profile/profile-2020-03-29-13-57-42.html>
A fine-grained performance profile is available: use the --scan option.
Build step 'Invoke Gradle script' changed build result to FAILURE
Build step 'Invoke Gradle script' marked build as failure
Xvfb stopping
Archiving artifacts
Recording test results
ERROR: Step ?Publish JUnit test result report? failed: No test report files were found. Configuration
error?

Mime
View raw message