jmeter-dev mailing list archives

Site index · List index
Message view « Date » · « Thread »
Top « Date » · « Thread »
From Apache Jenkins Server <jenk...@builds.apache.org>
Subject Build failed in Jenkins: JMeter-trunk #7699
Date Sun, 29 Mar 2020 19:04:17 GMT
See <https://builds.apache.org/job/JMeter-trunk/7699/display/redirect?page=changes>

Changes:

[sitnikov.vladimir] Bug 64285 - Avoid NPE when Clearing after switching to a different LAF


------------------------------------------
[...truncated 20.46 KB...]
> Task :src:dist:autostyleConfigsCheck NO-SOURCE
> Task :src:dist:autostyleJavaCheck NO-SOURCE
> Task :src:protocol:ftp:processResources NO-SOURCE
> Task :src:functions:processResources UP-TO-DATE
> Task :src:config:autostyleJavaCheck NO-SOURCE
> Task :src:protocol:junit:processResources NO-SOURCE
> Task :src:protocol:ldap:processResources NO-SOURCE
> Task :src:protocol:ldap:processTestResources NO-SOURCE
> Task :src:protocol:ftp:processTestResources NO-SOURCE
> Task :src:protocol:native:processResources NO-SOURCE
> Task :src:protocol:jms:processResources NO-SOURCE
> Task :src:protocol:junit:processTestResources NO-SOURCE
> Task :src:protocol:http:processResources UP-TO-DATE
> Task :src:protocol:mail:processResources UP-TO-DATE
> Task :src:protocol:jms:processTestResources NO-SOURCE
> Task :src:launcher:compileJava UP-TO-DATE
> Task :src:testkit:compileJava UP-TO-DATE
> Task :src:protocol:tcp:processResources NO-SOURCE
> Task :src:dist-check:autostyleConfigsCheck NO-SOURCE
> Task :src:testkit:processResources NO-SOURCE
> Task :src:protocol:bolt:processResources UP-TO-DATE
> Task :src:testkit:classes UP-TO-DATE
> Task :src:protocol:mongodb:processResources UP-TO-DATE
> Task :src:protocol:native:processTestResources NO-SOURCE
> Task :src:generator:processResources NO-SOURCE
> Task :src:protocol:junit-sample:processResources NO-SOURCE
> Task :src:protocol:bolt:processTestResources NO-SOURCE
> Task :src:functions:processTestResources UP-TO-DATE
> Task :src:protocol:java:processResources UP-TO-DATE
> Task :src:generator:autostyleConfigsCheck NO-SOURCE
> Task :src:protocol:mail:processTestResources NO-SOURCE
> Task :src:testkit:jar UP-TO-DATE
> Task :src:protocol:mongodb:processTestResources NO-SOURCE
> Task :src:protocol:tcp:processTestResources NO-SOURCE
> Task :src:launcher:processResources UP-TO-DATE
> Task :src:protocol:java:processTestResources NO-SOURCE
> Task :src:testkit:compileTestFixturesJava NO-SOURCE
> Task :src:protocol:autostyleConfigsCheck NO-SOURCE
> Task :src:release:autostyleConfigsCheck NO-SOURCE
> Task :src:launcher:classes UP-TO-DATE
> Task :src:protocol:jdbc:processResources UP-TO-DATE
> Task :src:licenses:autostyleConfigsCheck NO-SOURCE
> Task :src:launcher:jar UP-TO-DATE
> Task :src:licenses:autostyleJavaCheck NO-SOURCE
> Task :src:release:autostyleJavaCheck NO-SOURCE
> Task :src:launcher:autostyleConfigsCheck NO-SOURCE
> Task :src:protocol:ftp:autostyleConfigsCheck NO-SOURCE
> Task :src:protocol:jdbc:processTestResources NO-SOURCE
> Task :src:protocol:autostyleJavaCheck NO-SOURCE
> Task :src:testkit:processTestFixturesResources NO-SOURCE
> Task :src:testkit:testFixturesClasses UP-TO-DATE
> Task :src:protocol:http:processTestResources UP-TO-DATE
> Task :src:core:versionClass
> Task :src:testkit:testFixturesJar UP-TO-DATE
> Task :src:testkit:autostyleConfigsCheck NO-SOURCE
> Task :src:autostyleConfigsCheck
> Task :src:functions:autostyleConfigsCheck
> Task :src:examples:autostyleConfigsCheck
> Task :src:protocol:java:autostyleConfigsCheck
> Task :src:protocol:bolt:autostyleConfigsCheck
> Task :src:protocol:http:autostyleConfigsCheck
> Task :src:protocol:bolt:autostyleGroovyCheck
> Task :src:protocol:jdbc:autostyleConfigsCheck
> Task :src:functions:autostyleGroovyCheck
> Task :src:dist-check:autostyleGroovyCheck
> Task :src:protocol:jdbc:autostyleGroovyCheck
> Task :src:components:autostyleConfigsCheck
> Task :src:protocol:http:autostyleGroovyCheck
> Task :src:testkit-wiremock:compileJava UP-TO-DATE
> Task :src:testkit-wiremock:processResources NO-SOURCE
> Task :src:testkit-wiremock:classes UP-TO-DATE
> Task :src:testkit-wiremock:jar UP-TO-DATE
> Task :src:testkit-wiremock:compileTestFixturesJava NO-SOURCE
> Task :src:testkit-wiremock:processTestFixturesResources NO-SOURCE
> Task :src:testkit-wiremock:testFixturesClasses UP-TO-DATE
> Task :src:testkit-wiremock:testFixturesJar UP-TO-DATE
> Task :src:components:autostyleGroovyCheck
> Task :src:testkit-wiremock:autostyleConfigsCheck NO-SOURCE
> Task :autostyleConfigsCheck
> Task :autostyleJavaCheck NO-SOURCE
> Task :src:core:processResources
> Task :src:core:processTestResources UP-TO-DATE
> Task :src:core:autostyleConfigsCheck
> Task :src:testkit-wiremock:autostyleJavaCheck
> Task :src:bshclient:autostyleJavaCheck
> Task :src:testkit:autostyleJavaCheck
> Task :src:generator:autostyleJavaCheck
> Task :src:core:autostyleGroovyCheck
> Task :src:launcher:autostyleJavaCheck
> Task :src:protocol:bolt:autostyleJavaCheck
> Task :src:examples:autostyleJavaCheck
> Task :src:protocol:bolt:autostyleKotlinGradleCheck NO-SOURCE
> Task :src:protocol:bolt:autostyleMarkdownCheck NO-SOURCE
> Task :src:protocol:bolt:autostyleCheck
> Task :src:protocol:jms:autostyleConfigsCheck NO-SOURCE
> Task :src:protocol:ftp:autostyleJavaCheck
> Task :src:protocol:ftp:autostyleKotlinGradleCheck NO-SOURCE
> Task :src:protocol:ftp:autostyleMarkdownCheck NO-SOURCE
> Task :src:protocol:ftp:autostyleCheck
> Task :src:protocol:junit:autostyleConfigsCheck NO-SOURCE
> Task :src:dist-check:autostyleJavaCheck
> Task :src:protocol:jdbc:autostyleJavaCheck
> Task :src:protocol:jdbc:autostyleKotlinGradleCheck NO-SOURCE
> Task :src:protocol:jdbc:autostyleMarkdownCheck NO-SOURCE
> Task :src:protocol:jdbc:autostyleCheck
> Task :src:protocol:junit-sample:autostyleConfigsCheck NO-SOURCE
> Task :src:protocol:junit:autostyleJavaCheck
> Task :src:protocol:junit:autostyleKotlinGradleCheck NO-SOURCE
> Task :src:protocol:junit:autostyleMarkdownCheck NO-SOURCE
> Task :src:protocol:junit:autostyleCheck
> Task :src:protocol:ldap:autostyleConfigsCheck NO-SOURCE
> Task :src:protocol:java:autostyleJavaCheck
> Task :src:protocol:java:autostyleKotlinGradleCheck NO-SOURCE
> Task :src:protocol:java:autostyleMarkdownCheck NO-SOURCE
> Task :src:protocol:java:autostyleCheck
> Task :src:protocol:mail:autostyleConfigsCheck NO-SOURCE
> Task :src:protocol:junit-sample:autostyleJavaCheck
> Task :src:protocol:junit-sample:autostyleKotlinGradleCheck NO-SOURCE
> Task :src:protocol:junit-sample:autostyleMarkdownCheck NO-SOURCE
> Task :src:protocol:junit-sample:autostyleCheck
> Task :src:protocol:junit-sample:processTestResources NO-SOURCE
> Task :src:protocol:mongodb:autostyleConfigsCheck

> Task :src:jorphan:compileJava
<https://builds.apache.org/job/JMeter-trunk/ws/src/jorphan/src/main/java/org/apache/jorphan/gui/JMeterUIDefaults.java>:37:
warning: FontDesignMetrics is internal proprietary API and may be removed in a future release
import sun.font.FontDesignMetrics;
               ^

> Task :src:protocol:mongodb:autostyleJavaCheck
> Task :src:protocol:mongodb:autostyleKotlinGradleCheck NO-SOURCE
> Task :src:protocol:mongodb:autostyleMarkdownCheck NO-SOURCE
> Task :src:protocol:mongodb:autostyleCheck
> Task :src:protocol:native:autostyleConfigsCheck NO-SOURCE
> Task :src:protocol:ldap:autostyleJavaCheck
> Task :src:protocol:ldap:autostyleKotlinGradleCheck NO-SOURCE
> Task :src:protocol:native:autostyleJavaCheck
> Task :src:protocol:ldap:autostyleMarkdownCheck NO-SOURCE
> Task :src:protocol:ldap:autostyleCheck
> Task :src:protocol:native:autostyleKotlinGradleCheck NO-SOURCE
> Task :src:protocol:native:autostyleMarkdownCheck NO-SOURCE
> Task :src:protocol:tcp:autostyleConfigsCheck NO-SOURCE
> Task :src:protocol:native:autostyleCheck
> Task :src:protocol:mail:autostyleJavaCheck
> Task :src:protocol:mail:autostyleKotlinGradleCheck NO-SOURCE
> Task :src:protocol:mail:autostyleMarkdownCheck NO-SOURCE
> Task :src:protocol:mail:autostyleCheck
> Task :src:protocol:jms:autostyleJavaCheck
> Task :src:protocol:jms:autostyleKotlinGradleCheck NO-SOURCE
> Task :src:protocol:jms:autostyleMarkdownCheck NO-SOURCE
> Task :src:protocol:jms:autostyleCheck
> Task :src:protocol:tcp:autostyleJavaCheck
> Task :src:protocol:tcp:autostyleKotlinGradleCheck NO-SOURCE
> Task :src:protocol:tcp:autostyleMarkdownCheck NO-SOURCE
> Task :src:protocol:tcp:autostyleCheck
> Task :src:functions:autostyleJavaCheck

> Task :src:jorphan:compileJava
<https://builds.apache.org/job/JMeter-trunk/ws/src/jorphan/src/main/java/org/apache/jorphan/gui/JMeterUIDefaults.java>:172:
warning: FontDesignMetrics is internal proprietary API and may be removed in a future release
            return FontDesignMetrics.getMetrics(f).getHeight();
                   ^
Note: <https://builds.apache.org/job/JMeter-trunk/ws/src/jorphan/src/main/java/org/apache/jorphan/gui/DynamicStyle.java>
uses unchecked or unsafe operations.
Note: Recompile with -Xlint:unchecked for details.
2 warnings

> Task :src:jorphan:compileGroovy NO-SOURCE
> Task :src:jorphan:processResources UP-TO-DATE
> Task :src:jorphan:classes
> Task :src:jorphan:jar
> Task :src:jorphan:compileTestJava UP-TO-DATE
> Task :src:protocol:http:autostyleJavaCheck
> Task :src:protocol:http:autostyleKotlinGradleCheck NO-SOURCE
> Task :src:protocol:http:autostyleMarkdownCheck NO-SOURCE
> Task :src:protocol:http:autostyleCheck
> Task :src:generator:autostyleKotlinGradleCheck
> Task :src:testkit:autostyleKotlinGradleCheck
> Task :src:examples:autostyleKotlinGradleCheck
> Task :src:generator:autostyleMarkdownCheck NO-SOURCE
> Task :src:testkit:autostyleMarkdownCheck NO-SOURCE
> Task :src:generator:autostyleCheck
> Task :src:bshclient:autostyleKotlinGradleCheck
> Task :src:examples:autostyleMarkdownCheck NO-SOURCE
> Task :src:generator:processTestResources NO-SOURCE
> Task :src:testkit-wiremock:autostyleKotlinGradleCheck
> Task :src:examples:autostyleCheck
> Task :src:bshclient:autostyleMarkdownCheck NO-SOURCE
> Task :src:bshclient:autostyleCheck
> Task :src:testkit-wiremock:autostyleMarkdownCheck NO-SOURCE
> Task :src:testkit:autostyleCheck
> Task :src:testkit-wiremock:autostyleCheck
> Task :src:examples:processResources UP-TO-DATE
> Task :src:functions:autostyleKotlinGradleCheck
> Task :src:bshclient:compileJava UP-TO-DATE
> Task :src:examples:processTestResources NO-SOURCE
> Task :src:components:autostyleJavaCheck FAILED
> Task :src:bshclient:processResources NO-SOURCE
> Task :src:functions:autostyleMarkdownCheck NO-SOURCE
> Task :src:launcher:autostyleKotlinGradleCheck
> Task :src:release:autostyleKotlinGradleCheck
> Task :src:config:autostyleKotlinGradleCheck
> Task :src:bom:autostyleKotlinGradleCheck
> Task :src:protocol:autostyleKotlinGradleCheck
> Task :src:autostyleKotlinGradleCheck
> Task :src:testkit:checkstyleMain UP-TO-DATE
> Task :src:testkit-wiremock:checkstyleMain UP-TO-DATE
> Task :src:dist-check:autostyleKotlinGradleCheck
> Task :src:licenses:autostyleKotlinGradleCheck
> Task :src:dist:autostyleKotlinGradleCheck
> Task :autostyleKotlinGradleCheck
> Task :src:core:autostyleJavaCheck
> Task :src:jorphan:compileTestGroovy
checksum-dependency elapsed time: 12307ms, configurations processed: 97 (add -PchecksumTimingsPrint
to print detailed timings)

FAILURE: Build failed with an exception.

* What went wrong:
Execution failed for task ':src:components:autostyleJavaCheck'.
> The following files have format violations:
    src/components/src/main/java/org/apache/jmeter/extractor/gui/XPath2ExtractorGui.java
      @@ -125,7 +125,7 @@
           private JPanel makeParameterPanel() {
               JPanel mainPanel = new JPanel(new BorderLayout());
               mainPanel.add(createScopePanel(true, true, true), BorderLayout.NORTH);
      -��������\n
      +\n
               JPanel panel = new JPanel(new MigLayout("fillx, wrap 2", "[][fill,grow]"));
               panel.setBorder(BorderFactory.createTitledBorder(
                       JMeterUtils.getResString("xpath2_extractor_properties")));
  Run './gradlew autostyleApply' to fix the violations.

* Try:
Run with --stacktrace option to get the stack trace. Run with --info or --debug option to
get more log output. Run with --scan to get full insights.

* Get more help at https://help.gradle.org

Deprecated Gradle features were used in this build, making it incompatible with Gradle 7.0.
Use '--warning-mode all' to show the individual deprecation warnings.
See https://docs.gradle.org/6.3/userguide/command_line_interface.html#sec:command_line_warnings

BUILD FAILED in 33s
117 actionable tasks: 63 executed, 54 up-to-date

See the profiling report at: file://<https://builds.apache.org/job/JMeter-trunk/ws/build/reports/profile/profile-2020-03-29-19-03-45.html>
A fine-grained performance profile is available: use the --scan option.
Build step 'Invoke Gradle script' changed build result to FAILURE
Build step 'Invoke Gradle script' marked build as failure
Xvfb stopping
Archiving artifacts
Recording test results
ERROR: Step ?Publish JUnit test result report? failed: No test report files were found. Configuration
error?

Mime
View raw message