jmeter-dev mailing list archives

Site index · List index
Message view « Date » · « Thread »
Top « Date » · « Thread »
From Apache Jenkins Server <jenk...@builds.apache.org>
Subject Build failed in Jenkins: JMeter Windows #1632
Date Sat, 07 Mar 2020 11:27:58 GMT
See <https://builds.apache.org/job/JMeter%20Windows/1632/display/redirect?page=changes>

Changes:

[felix.schumacher] Correct link to usermanuals build ws test plan

[felix.schumacher] correct typo

[felix.schumacher] Markup changes for code

[felix.schumacher] Use better suited domain names for examples

[felix.schumacher] Markup changes

[felix.schumacher] The button is called 'Create Test Plan'

[pmouawad] Updated jsoup to 1.13.1 from 1.12.2

[pmouawad] Updated httpmime and httpclient to 4.5.12 from 4.5.11

[pmouawad] Updated SaxonHE to 9.9.1-7 (from 9.9.1-5)

[pmouawad] Updated ph-css to 6.2.1 (from 6.2.0)

[pmouawad] Updated Apache log4j to 2.13.1 (from 2.13.0


------------------------------------------
[...truncated 182.09 KB...]
          0.0sec,    4 completed,   0 failed,   0 skipped, org.apache.jmeter.extractor.TestBoundaryExtractor
          0.1sec,   14 completed,   0 failed,   0 skipped, org.apache.jmeter.extractor.TestHtmlExtractorJodd
          0.1sec,   14 completed,   0 failed,   0 skipped, org.apache.jmeter.extractor.TestHtmlExtractorJSoup
          0.0sec,    9 completed,   0 failed,   0 skipped, org.apache.jmeter.extractor.TestJSONPostProcessor
          0.0sec,   25 completed,   0 failed,   0 skipped, org.apache.jmeter.extractor.TestRegexExtractor
          0.1sec,    7 completed,   0 failed,   0 skipped, org.apache.jmeter.extractor.TestXPath2Extractor
          0.1sec,    6 completed,   0 failed,   0 skipped, org.apache.jmeter.extractor.TestXPathExtractor
          0.7sec,    7 completed,   0 failed,   0 skipped, org.apache.jmeter.gui.action.template.TestTemplateManager
          0.0sec,    1 completed,   0 failed,   0 skipped, org.apache.jmeter.gui.action.TestSave
          0.0sec,    5 completed,   0 failed,   0 skipped, org.apache.jmeter.reporters.TestResultSaver
          0.2sec,    1 completed,   0 failed,   0 skipped, org.apache.jmeter.resources.ResourceKeyUsageTestComponents
          0.9sec,    9 completed,   0 failed,   0 skipped, org.apache.jmeter.timers.ConstantThroughputTimerTest
          0.2sec,    6 completed,   0 failed,   0 skipped, org.apache.jmeter.timers.poissonarrivals.PreciseThroughputTimerTest
          0.6sec,    4 completed,   0 failed,   0 skipped, org.apache.jmeter.timers.SyncTimerTest
          0.0sec,    4 completed,   0 failed,   0 skipped, org.apache.jmeter.timers.TimerServiceTest
          1.1sec,    4 completed,   0 failed,   0 skipped, org.apache.jmeter.visualizers.backend.influxdb.HttpMetricsSenderTest
          0.1sec,    3 completed,   0 failed,   0 skipped, org.apache.jmeter.visualizers.backend.SamplerMetricFixedModeTest
          0.0sec,    2 completed,   0 failed,   0 skipped, org.apache.jmeter.visualizers.backend.SamplerMetricTimedModeTest
          0.0sec,    8 completed,   0 failed,   0 skipped, org.apache.jmeter.visualizers.TestRenderAsJson
          0.0sec,    2 completed,   0 failed,   0 skipped, org.apache.jmeter.visualizers.TestSamplingStatCalculator
          0.2sec,   27 completed,   0 failed,   0 skipped, org.apache.jmeter.assertions.jmespath.TestJMESPathAssertion$TestAssertion
          0.3sec,   27 completed,   0 failed,   0 skipped, org.apache.jmeter.assertions.jmespath.TestJMESPathAssertion
          0.0sec,   10 completed,   0 failed,   0 skipped, org.apache.jmeter.extractor.json.jmespath.TestJMESPathExtractor$SourceVarOrResponse
          0.0sec,   10 completed,   0 failed,   0 skipped, org.apache.jmeter.extractor.json.jmespath.TestJMESPathExtractor$MatchNumberMoreThanZeroOn1ExtractedValue
          0.0sec,    6 completed,   0 failed,   0 skipped, org.apache.jmeter.extractor.json.jmespath.TestJMESPathExtractor$MultipleMatchesOnAllExtractedValues
          0.0sec,    6 completed,   0 failed,   0 skipped, org.apache.jmeter.extractor.json.jmespath.TestJMESPathExtractor$OneMatchOnAllExtractedValues
          0.0sec,   32 completed,   0 failed,   0 skipped, org.apache.jmeter.extractor.json.jmespath.TestJMESPathExtractor
          0.0sec,    9 completed,   0 failed,   0 skipped, org.apache.jmeter.visualizers.TestSampleCompareTo
          0.2sec,    7 completed,   0 failed,   0 skipped, org.apache.jmeter.assertions.CompareAssertionSpec
          0.5sec,    5 completed,   0 failed,   0 skipped, org.apache.jmeter.assertions.gui.AssertionGuiSpec
          0.0sec,    7 completed,   0 failed,   0 skipped, org.apache.jmeter.assertions.MD5HexAssertionSpec
          0.1sec,    4 completed,   0 failed,   0 skipped, org.apache.jmeter.control.RandomOrderControllerSpec
          1.1sec,    5 completed,   0 failed,   0 skipped, org.apache.jmeter.control.RunTimeSpec
          0.0sec,    8 completed,   0 failed,   0 skipped, org.apache.jmeter.control.ThroughputControllerSpec
          0.1sec,   37 completed,   0 failed,   0 skipped, org.apache.jmeter.extractor.BoundaryExtractorSpec
          0.0sec,    4 completed,   0 failed,   0 skipped, org.apache.jmeter.extractor.JoddExtractorSpec
          0.2sec,    8 completed,   0 failed,   0 skipped, org.apache.jmeter.extractor.json.render.RenderAsJmesPathRendererSpec
          0.1sec,    8 completed,   0 failed,   0 skipped, org.apache.jmeter.extractor.json.render.RenderAsJsonRendererSpec
          0.0sec,    6 completed,   0 failed,   0 skipped, org.apache.jmeter.timers.UniformRandomTimerSpec
          0.2sec,    7 completed,   0 failed,   0 skipped, org.apache.jmeter.visualizers.backend.graphite.PickleGraphiteMetricsSenderSpec
          0.0sec,    5 completed,   0 failed,   0 skipped, org.apache.jmeter.visualizers.backend.graphite.TextGraphiteMetricsSenderSpec
          2.4sec, org.apache.jmeter.visualizers.backend.influxdb.InfluxdbBackendListenerClientSpec,
Sending metrics when empty does not raise an exception
          2.4sec,    3 completed,   0 failed,   0 skipped, org.apache.jmeter.visualizers.backend.influxdb.InfluxdbBackendListenerClientSpec
WARNING  17.1sec,  487 completed,   0 failed,   1 skipped, Gradle Test Run :src:components:test

> Task :src:components:check
> Task :src:components:jar
> Task :src:examples:spotbugsMain SKIPPED
> Task :src:generator:spotbugsMain SKIPPED
> Task :src:generator:spotbugsTest SKIPPED
> Task :src:examples:spotbugsTest SKIPPED
> Task :src:generator:test NO-SOURCE
> Task :src:examples:test NO-SOURCE
> Task :src:examples:check
> Task :src:generator:check
> Task :src:components:testJar
> Task :src:components:assemble

> Task :src:functions:compileJava
Note: F:\jenkins\jenkins-slave\workspace\JMeter Windows\src\functions\src\main\java\org\apache\jmeter\functions\StringFromFile.java
uses or overrides a deprecated API.
Note: Recompile with -Xlint:deprecation for details.

> Task :src:functions:compileGroovy NO-SOURCE
> Task :src:functions:classes
> Task :src:functions:jar

> Task :src:functions:compileTestJava
Note: Some input files use or override a deprecated API.
Note: Recompile with -Xlint:deprecation for details.

> Task :src:functions:compileTestGroovy
> Task :src:functions:testClasses
> Task :src:functions:testJar
> Task :src:functions:checkstyleMain
> Task :src:functions:checkstyleTest
> Task :src:functions:spotbugsMain SKIPPED
> Task :src:functions:spotbugsTest SKIPPED

> Task :src:functions:test

Gradle Test Executor 18 STANDARD_OUT
    Setting JMeterHome: F:\jenkins\jenkins-slave\workspace\JMeter Windows\src\functions\..\..\.
    Initializing Properties: ../.././bin/jmeter.properties

Gradle Test Executor 18 STANDARD_ERROR
    Mar 07, 2020 3:26:27 AM java.util.prefs.WindowsPreferences <init>
    WARNING: Could not open/create prefs root node Software\JavaSoft\Prefs at root 0x80000002.
Windows RegCreateKeyEx(...) returned error code 5.

Gradle Test Executor 18 STANDARD_OUT
    JMeterVersion=5.3-SNAPSHOT 69140b7
    java.version=1.8.0_152
    java.vm.name=Java HotSpot(TM) 64-Bit Server VM
    java.vendor=Oracle Corporation
    java.home=F:\jenkins\tools\java\latest1.8\jre
    file.encoding=windows-1252
    default encoding=windows-1252
    user.home=C:\Users\jenkins
    user.dir=F:\jenkins\jenkins-slave\workspace\JMeter Windows\src\functions
    user.language=en
    user.region=null
    user.country=US
    user.variant=
    Locale=en_US
    java.class.version=52.0
    java.awt.headless=null
    os.name=Windows Server 2016
    os.version=10.0
    os.arch=amd64

> Task :src:protocol:http:compileJava
> Task :src:protocol:http:compileGroovy NO-SOURCE
> Task :src:protocol:http:classes
> Task :src:dist:compileJava NO-SOURCE
> Task :src:dist:classes UP-TO-DATE
> Task :src:dist:checkstyleMain NO-SOURCE
> Task :src:dist:jar
> Task :src:protocol:http:jar
> Task :src:dist-check:compileJava NO-SOURCE
> Task :src:dist-check:compileGroovy NO-SOURCE
> Task :src:dist-check:classes UP-TO-DATE
> Task :src:dist-check:checkstyleMain NO-SOURCE
> Task :src:dist-check:spotbugsMain SKIPPED
> Task :src:dist-check:jar
> Task :src:dist-check:assemble

> Task :src:functions:test
          0.2sec,    6 completed,   0 failed,   0 skipped, org.apache.jmeter.functions.CSVReadFunctionTest
          0.0sec,    2 completed,   0 failed,   0 skipped, org.apache.jmeter.functions.EvalFunctionTest
          0.0sec,    2 completed,   0 failed,   0 skipped, org.apache.jmeter.functions.RandomFunctionTest
          0.0sec,    1 completed,   0 failed,   0 skipped, org.apache.jmeter.functions.SplitFunctionTest
          0.1sec,    5 completed,   0 failed,   0 skipped, org.apache.jmeter.functions.StringFromFileFunctionTest
          0.0sec,    1 completed,   0 failed,   0 skipped, org.apache.jmeter.functions.SumFunctionTest
          0.0sec,    8 completed,   0 failed,   0 skipped, org.apache.jmeter.functions.TestChangeCase
          0.0sec,    8 completed,   0 failed,   0 skipped, org.apache.jmeter.functions.TestDateTimeConvertFunction
          0.0sec,    9 completed,   0 failed,   0 skipped, org.apache.jmeter.functions.TestDigestFunction
          0.0sec,    6 completed,   0 failed,   0 skipped, org.apache.jmeter.functions.TestEscapeOroRegexpChars
          0.0sec,    7 completed,   0 failed,   0 skipped, org.apache.jmeter.functions.TestFileRowColContainer
          0.0sec,    5 completed,   0 failed,   0 skipped, org.apache.jmeter.functions.TestFileToString
          0.5sec,    7 completed,   0 failed,   0 skipped, org.apache.jmeter.functions.TestGroovyFunction
          0.0sec,    5 completed,   0 failed,   0 skipped, org.apache.jmeter.functions.TestIsPropDefined
          0.0sec,    6 completed,   0 failed,   0 skipped, org.apache.jmeter.functions.TestIsVarDefined
          1.0sec,    5 completed,   0 failed,   0 skipped, org.apache.jmeter.functions.TestJavascriptFunction
          0.3sec,    5 completed,   0 failed,   0 skipped, org.apache.jmeter.functions.TestJavascriptFunctionWithRhino
          0.1sec,    6 completed,   0 failed,   0 skipped, org.apache.jmeter.functions.TestJexl2Function
          0.1sec,    6 completed,   0 failed,   0 skipped, org.apache.jmeter.functions.TestJexl3Function
          0.0sec,    5 completed,   0 failed,   0 skipped, org.apache.jmeter.functions.TestMachineIPName
          0.0sec,    4 completed,   0 failed,   0 skipped, org.apache.jmeter.functions.TestRandomFromMultipleVars
          0.1sec,   22 completed,   0 failed,   0 skipped, org.apache.jmeter.functions.TestRegexFunction
          0.0sec,    2 completed,   0 failed,   0 skipped, org.apache.jmeter.functions.TestSamplerNameFunction
          0.0sec,    3 completed,   0 failed,   0 skipped, org.apache.jmeter.functions.TestSetProperty
          0.0sec,   18 completed,   0 failed,   0 skipped, org.apache.jmeter.functions.TestSimpleFunctions
          0.1sec,   15 completed,   0 failed,   0 skipped, org.apache.jmeter.functions.TestStringtoFile
          0.0sec,   15 completed,   0 failed,   0 skipped, org.apache.jmeter.functions.TestTimeFunction

> Task :src:protocol:http:compileTestJava
Note: Some input files use or override a deprecated API.
Note: Recompile with -Xlint:deprecation for details.

> Task :src:functions:test
          0.1sec,   14 completed,   0 failed,   0 skipped, org.apache.jmeter.functions.TestTimeRandomDateFunction
FAILURE   0.0sec, org.apache.jmeter.functions.TestTimeShiftFunction > testNowWithComplexPeriod()
    java.lang.AssertionError: 
    Expected: the date is within 1 seconds of Tue, 17 Mar 2020 02:21:36.648 AM
         but: the date is Tue, 17 Mar 2020 03:21:36.000 AM and 3599 seconds different
        at org.hamcrest.MatcherAssert.assertThat(MatcherAssert.java:20)
        at org.junit.Assert.assertThat(Assert.java:964)
        at org.junit.Assert.assertThat(Assert.java:930)
        at org.apache.jmeter.functions.TestTimeShiftFunction.testNowWithComplexPeriod(TestTimeShiftFunction.java:116)

FAILURE   0.2sec,   12 completed,   1 failed,   0 skipped, org.apache.jmeter.functions.TestTimeShiftFunction
          0.0sec,    3 completed,   0 failed,   0 skipped, org.apache.jmeter.functions.TestUrlEncodeDecode
          0.0sec,    1 completed,   0 failed,   0 skipped, org.apache.jmeter.functions.VariableTest
WARNING   0.8sec,    6 completed,   0 failed,   5 skipped, org.apache.jmeter.functions.XPathConcurrencyTest
          0.2sec,    1 completed,   0 failed,   0 skipped, org.apache.jmeter.resources.ResourceKeyUsageTestFunctions
          0.2sec,   10 completed,   0 failed,   0 skipped, org.apache.jmeter.functions.PackageTest
          0.3sec,   22 completed,   0 failed,   0 skipped, org.apache.jmeter.functions.ChangeCaseSpec

> Task :src:protocol:http:compileTestGroovy
> Task :src:protocol:http:testClasses

> Task :src:licenses:gatherBinaryLicenses
License overrides were declared but unused for the following dependencies: [net.sf.saxon:Saxon-HE:9.9.1-5]

> Task :src:protocol:http:testJar

> Task :src:dist:javadocAggregate
javadoc: warning - Multiple sources of package comments found for package "org.apache.jmeter.assertions"

> Task :src:licenses:renderLicenseForBinary
> Task :src:licenses:renderLicenseForBinaryCopySpec

> Task :src:functions:test FAILED
          0.2sec,    9 completed,   0 failed,   0 skipped, org.apache.jmeter.functions.gui.FunctionHelperSpec
          0.4sec,    2 completed,   0 failed,   0 skipped, org.apache.jmeter.functions.IterationCounterSpec
FAILURE   8.7sec,  264 completed,   1 failed,   5 skipped, Gradle Test Run :src:functions:test

264 tests completed, 1 failed, 5 skipped

> Task :src:dist-check:compileTestJava
Note: F:\jenkins\jenkins-slave\workspace\JMeter Windows\src\dist-check\src\test\java\org\apache\jorphan\reflect\TestClassFinder.java
uses or overrides a deprecated API.
Note: Recompile with -Xlint:deprecation for details.

> Task :src:licenses:binLicenseDir

> Task :src:dist:javadocAggregate
javadoc: warning - Multiple sources of package comments found for package "org.apache.jmeter.visualizers"
javadoc: warning - Multiple sources of package comments found for package "org.apache.jmeter.report.config"
javadoc: warning - Multiple sources of package comments found for package "org.apache.jmeter.report.core"
javadoc: warning - Multiple sources of package comments found for package "org.apache.jmeter.report.dashboard"
javadoc: warning - Multiple sources of package comments found for package "org.apache.jmeter.report.processor"
javadoc: warning - Multiple sources of package comments found for package "org.apache.jmeter.report.processor.graph"
javadoc: warning - Multiple sources of package comments found for package "org.apache.jmeter.report.processor.graph.impl"
javadoc: warning - Multiple sources of package comments found for package "org.apache.commons.cli.avalon"

> Task :src:protocol:http:checkstyleMain

> Task :src:dist:javadocAggregate
9 warnings
checksum-dependency elapsed time: 151848ms, configurations processed: 234
    SHA-512 computation time: 210ms (goes in parallel, it might exceed wall-clock time), files
processed: 24, processed: 6MiB, skipped: 2630MiB
    PGP signature resolution time: 93406ms (wall-clock), resolution requests: 137, signatures
resolved: 214
    PGP key resolution time: 9028ms (wall-clock), resolution requests: 137, download time:
10408ms (goes in parallel, it might exceed wall-clock time), keys downloaded: 95
        PGP signature verification time: 7641ms (goes in parallel, it might exceed wall-clock
time), files processed: 365, processed: 441MiB, skipped: 2169MiB

Build jmeter FAILURE reason:                                
    Execution failed for task ':src:functions:test':
        There were failing tests. See the report at: file:///F:/jenkins/jenkins-slave/workspace/JMeter%20Windows/src/functions/build/reports/tests/test/index.html


FAILURE: Build failed with an exception.

* What went wrong:
Execution failed for task ':src:functions:test'.
> There were failing tests. See the report at: file:///F:/jenkins/jenkins-slave/workspace/JMeter%20Windows/src/functions/build/reports/tests/test/index.html

* Try:
Run with --stacktrace option to get the stack trace. Run with --info or --debug option to
get more log output. Run with --scan to get full insights.

* Get more help at https://help.gradle.org

Deprecated Gradle features were used in this build, making it incompatible with Gradle 7.0.
Use '--warning-mode all' to show the individual deprecation warnings.
See https://docs.gradle.org/6.1/userguide/command_line_interface.html#sec:command_line_warnings

BUILD FAILED in 7m 18s
248 actionable tasks: 248 executed
Could not open/create prefs root node Software\JavaSoft\Prefs at root 0x80000002. Windows
RegCreateKeyEx(...) returned error code 5.
Build step 'Invoke Gradle script' changed build result to FAILURE
Build step 'Invoke Gradle script' marked build as failure

Mime
View raw message