jmeter-dev mailing list archives

Site index · List index
Message view « Date » · « Thread »
Top « Date » · « Thread »
From Apache Jenkins Server <jenk...@builds.apache.org>
Subject Build failed in Jenkins: JMeter-trunk #7701
Date Sun, 29 Mar 2020 20:17:15 GMT
See <https://builds.apache.org/job/JMeter-trunk/7701/display/redirect?page=changes>

Changes:

[pmouawad] Fix $NON-NLS-1$

[pmouawad] Remove Etched Border

[pmouawad] Bug 64287 - WhileController: Improve UX

[pmouawad] Bug 64288 - JUnit Request: Improve UX


------------------------------------------
[...truncated 8.93 KB...]
> Task :buildSrc:check
> Task :buildSrc:build
> Task :buildSrc:batchtest:autostyleKotlinGradleCheck
> Task :buildSrc:batchtest:autostyleCheck
> Task :buildSrc:batchtest:compileTestKotlin NO-SOURCE
> Task :buildSrc:batchtest:pluginUnderTestMetadata UP-TO-DATE
> Task :buildSrc:batchtest:compileTestJava NO-SOURCE
> Task :buildSrc:batchtest:processTestResources NO-SOURCE
> Task :buildSrc:batchtest:testClasses UP-TO-DATE
> Task :buildSrc:batchtest:test NO-SOURCE
> Task :buildSrc:batchtest:validatePlugins UP-TO-DATE
> Task :buildSrc:batchtest:check
> Task :buildSrc:batchtest:build
checksum-dependency elapsed time: 2963ms, configurations processed: 21 (add -PchecksumTimingsPrint
to print detailed timings)

See the profiling report at: file://<https://builds.apache.org/job/JMeter-trunk/ws/buildSrc/build/reports/profile/profile-2020-03-29-20-16-40.html>
A fine-grained performance profile is available: use the --scan option.

> Configure project :
Building JMeter 5.3-SNAPSHOT

> Configure project :src:dist-check
Certain tests will be skipped as they depend on external services and fail too often. Please
add -PenableFlaky to enable them: [batchHttp4ImplDigestAuth, batchHttp4ImplPreemptiveBasicAuthJava,
batchSlowCharsFeatureHttpClient4, batchSlowCharsFeatureJava, batchTCP_TESTS, batchTestKeepAlive,
batchTestRedirectionPolicies]

> Task :src:bshclient:cleanTest UP-TO-DATE
> Task :cleanTest UP-TO-DATE
> Task :src:config:cleanTest UP-TO-DATE
> Task :src:dist:cleanTest UP-TO-DATE
> Task :src:examples:cleanTest UP-TO-DATE
> Task :src:generator:cleanTest UP-TO-DATE
> Task :src:dist-check:cleanTest
> Task :src:launcher:cleanTest UP-TO-DATE
> Task :src:licenses:cleanTest UP-TO-DATE
> Task :src:functions:cleanTest
> Task :src:jorphan:cleanTest
> Task :src:components:cleanTest
> Task :src:protocol:cleanTest UP-TO-DATE
> Task :src:testkit:cleanTest UP-TO-DATE
> Task :src:core:cleanTest
> Task :src:release:cleanTest UP-TO-DATE
> Task :src:testkit-wiremock:cleanTest UP-TO-DATE
> Task :src:protocol:ftp:cleanTest
> Task :src:protocol:bolt:cleanTest
> Task :src:protocol:java:cleanTest
> Task :src:protocol:jdbc:cleanTest
> Task :src:protocol:jms:cleanTest
> Task :src:protocol:junit:cleanTest
> Task :src:protocol:junit-sample:cleanTest UP-TO-DATE
> Task :src:protocol:http:cleanTest
> Task :src:protocol:ldap:cleanTest
> Task :src:protocol:mail:cleanTest
> Task :src:protocol:mongodb:cleanTest
> Task :src:protocol:native:cleanTest
> Task :src:protocol:tcp:cleanTest
> Task :src:bom:autostyleConfigsCheck NO-SOURCE
> Task :src:bshclient:autostyleConfigsCheck NO-SOURCE
> Task :src:config:autostyleConfigsCheck NO-SOURCE
> Task :src:dist:autostyleConfigsCheck NO-SOURCE
> Task :src:dist:autostyleJavaCheck NO-SOURCE
> Task :src:config:autostyleJavaCheck NO-SOURCE
> Task :src:protocol:ftp:processResources NO-SOURCE
> Task :src:protocol:junit:processResources NO-SOURCE
> Task :src:protocol:ldap:processResources NO-SOURCE
> Task :src:protocol:jms:processResources NO-SOURCE
> Task :src:protocol:ftp:processTestResources NO-SOURCE
> Task :src:protocol:junit:processTestResources NO-SOURCE
> Task :src:protocol:jms:processTestResources NO-SOURCE
> Task :src:functions:processResources UP-TO-DATE
> Task :src:protocol:ldap:processTestResources NO-SOURCE
> Task :src:protocol:tcp:processResources NO-SOURCE
> Task :src:protocol:mail:processResources UP-TO-DATE
> Task :src:protocol:native:processResources NO-SOURCE
> Task :src:generator:processResources NO-SOURCE
> Task :src:protocol:junit-sample:processResources NO-SOURCE
> Task :src:protocol:bolt:processResources UP-TO-DATE
> Task :src:protocol:mail:processTestResources NO-SOURCE
> Task :src:protocol:tcp:processTestResources NO-SOURCE
> Task :src:protocol:native:processTestResources NO-SOURCE
> Task :src:generator:autostyleConfigsCheck NO-SOURCE
> Task :src:protocol:bolt:processTestResources NO-SOURCE
> Task :src:protocol:http:processResources UP-TO-DATE
> Task :src:protocol:autostyleConfigsCheck NO-SOURCE
> Task :src:dist-check:autostyleConfigsCheck NO-SOURCE
> Task :src:release:autostyleConfigsCheck NO-SOURCE
> Task :src:testkit:compileJava UP-TO-DATE
> Task :src:launcher:compileJava UP-TO-DATE
> Task :src:protocol:autostyleJavaCheck NO-SOURCE
> Task :src:release:autostyleJavaCheck NO-SOURCE
> Task :src:protocol:java:processResources UP-TO-DATE
> Task :src:protocol:mongodb:processResources UP-TO-DATE
> Task :src:functions:processTestResources UP-TO-DATE
> Task :src:licenses:autostyleConfigsCheck NO-SOURCE
> Task :src:licenses:autostyleJavaCheck NO-SOURCE
> Task :src:protocol:java:processTestResources NO-SOURCE
> Task :src:protocol:mongodb:processTestResources NO-SOURCE
> Task :src:testkit:processResources NO-SOURCE
> Task :src:protocol:ftp:autostyleConfigsCheck NO-SOURCE
> Task :src:testkit:classes UP-TO-DATE
> Task :src:launcher:processResources UP-TO-DATE
> Task :src:protocol:jdbc:processResources UP-TO-DATE
> Task :src:launcher:classes UP-TO-DATE
> Task :src:protocol:jdbc:processTestResources NO-SOURCE
> Task :src:launcher:jar UP-TO-DATE
> Task :src:launcher:autostyleConfigsCheck NO-SOURCE
> Task :src:testkit:jar UP-TO-DATE
> Task :src:core:versionClass
> Task :src:testkit:compileTestFixturesJava NO-SOURCE
> Task :src:protocol:http:processTestResources UP-TO-DATE
> Task :src:testkit:processTestFixturesResources NO-SOURCE
> Task :src:testkit:testFixturesClasses UP-TO-DATE
> Task :src:testkit:testFixturesJar UP-TO-DATE
> Task :src:testkit:autostyleConfigsCheck NO-SOURCE
> Task :src:autostyleConfigsCheck
> Task :src:protocol:bolt:autostyleConfigsCheck
> Task :src:examples:autostyleConfigsCheck
> Task :src:protocol:java:autostyleConfigsCheck
> Task :src:functions:autostyleConfigsCheck
> Task :src:jorphan:compileJava UP-TO-DATE
> Task :src:protocol:http:autostyleConfigsCheck
> Task :src:jorphan:compileGroovy NO-SOURCE
> Task :src:jorphan:processResources UP-TO-DATE
> Task :src:jorphan:classes UP-TO-DATE
> Task :src:protocol:jdbc:autostyleConfigsCheck
> Task :src:protocol:bolt:autostyleGroovyCheck
> Task :src:jorphan:jar UP-TO-DATE
> Task :src:protocol:http:autostyleGroovyCheck
> Task :src:functions:autostyleGroovyCheck
> Task :src:dist-check:autostyleGroovyCheck
> Task :src:protocol:jdbc:autostyleGroovyCheck
> Task :src:testkit-wiremock:compileJava UP-TO-DATE
> Task :src:testkit-wiremock:processResources NO-SOURCE
> Task :src:testkit-wiremock:classes UP-TO-DATE
> Task :src:testkit-wiremock:jar UP-TO-DATE
> Task :src:testkit-wiremock:compileTestFixturesJava NO-SOURCE
> Task :src:testkit-wiremock:processTestFixturesResources NO-SOURCE
> Task :src:testkit-wiremock:testFixturesClasses UP-TO-DATE
> Task :src:testkit-wiremock:testFixturesJar UP-TO-DATE
> Task :src:testkit-wiremock:autostyleConfigsCheck NO-SOURCE
> Task :src:components:autostyleConfigsCheck
> Task :src:core:processResources UP-TO-DATE
> Task :src:jorphan:compileTestJava UP-TO-DATE
> Task :src:components:autostyleGroovyCheck
> Task :src:jorphan:compileTestGroovy UP-TO-DATE
> Task :src:jorphan:processTestResources NO-SOURCE
> Task :src:jorphan:testClasses UP-TO-DATE
> Task :src:jorphan:testJar UP-TO-DATE
> Task :src:jorphan:autostyleConfigsCheck NO-SOURCE
> Task :src:jorphan:autostyleGroovyCheck
> Task :autostyleConfigsCheck
> Task :autostyleJavaCheck NO-SOURCE
> Task :src:testkit-wiremock:autostyleJavaCheck
> Task :src:bshclient:autostyleJavaCheck
> Task :src:generator:autostyleJavaCheck
> Task :src:testkit:autostyleJavaCheck
> Task :src:launcher:autostyleJavaCheck
> Task :src:protocol:bolt:autostyleJavaCheck
> Task :src:examples:autostyleJavaCheck
> Task :src:protocol:bolt:autostyleKotlinGradleCheck NO-SOURCE
> Task :src:protocol:bolt:autostyleMarkdownCheck NO-SOURCE
> Task :src:protocol:bolt:autostyleCheck
> Task :src:protocol:jms:autostyleConfigsCheck NO-SOURCE
> Task :src:protocol:ftp:autostyleJavaCheck
> Task :src:protocol:ftp:autostyleKotlinGradleCheck NO-SOURCE
> Task :src:protocol:ftp:autostyleMarkdownCheck NO-SOURCE
> Task :src:protocol:ftp:autostyleCheck
> Task :src:protocol:junit:autostyleConfigsCheck NO-SOURCE
> Task :src:dist-check:autostyleJavaCheck
> Task :src:protocol:jdbc:autostyleJavaCheck
> Task :src:protocol:jdbc:autostyleKotlinGradleCheck NO-SOURCE
> Task :src:protocol:jdbc:autostyleMarkdownCheck NO-SOURCE
> Task :src:protocol:jdbc:autostyleCheck
> Task :src:protocol:junit-sample:autostyleConfigsCheck NO-SOURCE
> Task :src:protocol:java:autostyleJavaCheck
> Task :src:protocol:java:autostyleKotlinGradleCheck NO-SOURCE
> Task :src:protocol:java:autostyleMarkdownCheck NO-SOURCE
> Task :src:protocol:java:autostyleCheck
> Task :src:protocol:ldap:autostyleConfigsCheck NO-SOURCE
> Task :src:protocol:junit-sample:autostyleJavaCheck
> Task :src:protocol:junit-sample:autostyleKotlinGradleCheck NO-SOURCE
> Task :src:protocol:junit-sample:autostyleMarkdownCheck NO-SOURCE
> Task :src:protocol:junit-sample:autostyleCheck
> Task :src:protocol:junit-sample:processTestResources NO-SOURCE
> Task :src:protocol:mail:autostyleConfigsCheck NO-SOURCE
> Task :src:protocol:junit:autostyleJavaCheck FAILED
> Task :src:protocol:ldap:autostyleJavaCheck
> Task :src:protocol:mail:autostyleJavaCheck
> Task :src:protocol:jms:autostyleJavaCheck
> Task :src:functions:autostyleJavaCheck
> Task :src:jorphan:autostyleJavaCheck
> Task :src:core:compileJava
> Task :src:components:autostyleJavaCheck
> Task :src:protocol:http:autostyleJavaCheck
> Task :src:generator:autostyleKotlinGradleCheck
> Task :src:testkit:autostyleKotlinGradleCheck
> Task :src:testkit-wiremock:autostyleKotlinGradleCheck
> Task :src:bshclient:autostyleKotlinGradleCheck
> Task :src:examples:autostyleKotlinGradleCheck
> Task :src:launcher:autostyleKotlinGradleCheck
> Task :src:release:autostyleKotlinGradleCheck
> Task :src:config:autostyleKotlinGradleCheck
> Task :src:bom:autostyleKotlinGradleCheck
> Task :src:protocol:autostyleKotlinGradleCheck
> Task :src:autostyleKotlinGradleCheck
> Task :src:dist-check:autostyleKotlinGradleCheck
> Task :src:licenses:autostyleKotlinGradleCheck
> Task :src:dist:autostyleKotlinGradleCheck
> Task :autostyleKotlinGradleCheck
checksum-dependency elapsed time: 7139ms, configurations processed: 88 (add -PchecksumTimingsPrint
to print detailed timings)

FAILURE: Build failed with an exception.

* What went wrong:
Execution failed for task ':src:protocol:junit:autostyleJavaCheck'.
> The following files have format violations:
    src/protocol/junit/src/main/java/org/apache/jmeter/protocol/java/control/gui/JUnitTestSamplerGui.java
      @@ -50,9 +50,10 @@
       import org.slf4j.Logger;
       import org.slf4j.LoggerFactory;
       
      -import junit.framework.TestCase;
       import net.miginfocom.swing.MigLayout;
       
      +import junit.framework.TestCase;
      +
       /**
        * The <code>JUnitTestSamplerGui</code> class provides the user interface
        * for the {@link JUnitSampler}.
  Run './gradlew autostyleApply' to fix the violations.

* Try:
Run with --stacktrace option to get the stack trace. Run with --info or --debug option to
get more log output. Run with --scan to get full insights.

* Get more help at https://help.gradle.org

Deprecated Gradle features were used in this build, making it incompatible with Gradle 7.0.
Use '--warning-mode all' to show the individual deprecation warnings.
See https://docs.gradle.org/6.3/userguide/command_line_interface.html#sec:command_line_warnings

BUILD FAILED in 41s
108 actionable tasks: 70 executed, 38 up-to-date

See the profiling report at: file://<https://builds.apache.org/job/JMeter-trunk/ws/build/reports/profile/profile-2020-03-29-20-16-37.html>
A fine-grained performance profile is available: use the --scan option.
Build step 'Invoke Gradle script' changed build result to FAILURE
Build step 'Invoke Gradle script' marked build as failure
Xvfb stopping
Archiving artifacts
Recording test results
ERROR: Step ?Publish JUnit test result report? failed: No test report files were found. Configuration
error?

Mime
View raw message