jmeter-dev mailing list archives

Site index · List index
Message view « Date » · « Thread »
Top « Date » · « Thread »
From Apache Jenkins Server <jenk...@builds.apache.org>
Subject Build failed in Jenkins: JMeter Windows #1650
Date Sun, 29 Mar 2020 19:46:17 GMT
See <https://builds.apache.org/job/JMeter%20Windows/1650/display/redirect?page=changes>

Changes:

[sitnikov.vladimir] Bug 64285 - Avoid NPE when Clearing after switching to a different LAF

[sitnikov.vladimir] Fix trailing whitespace in XPath2ExtractorGui


------------------------------------------
[...truncated 202.56 KB...]
> Task :src:protocol:http:checkstyleTest
> Task :src:protocol:http:spotbugsMain SKIPPED
> Task :src:protocol:http:spotbugsTest SKIPPED

> Task :src:functions:test
          0.1sec,   15 completed,   0 failed,   0 skipped, org.apache.jmeter.functions.TestStringtoFile
          0.0sec,   15 completed,   0 failed,   0 skipped, org.apache.jmeter.functions.TestTimeFunction
          0.1sec,   14 completed,   0 failed,   0 skipped, org.apache.jmeter.functions.TestTimeRandomDateFunction
          0.1sec,   12 completed,   0 failed,   0 skipped, org.apache.jmeter.functions.TestTimeShiftFunction
          0.0sec,    3 completed,   0 failed,   0 skipped, org.apache.jmeter.functions.TestUrlEncodeDecode
          0.0sec,    1 completed,   0 failed,   0 skipped, org.apache.jmeter.functions.VariableTest
WARNING   0.4sec,    6 completed,   0 failed,   5 skipped, org.apache.jmeter.functions.XPathConcurrencyTest
          0.1sec,    1 completed,   0 failed,   0 skipped, org.apache.jmeter.resources.ResourceKeyUsageTestFunctions
          0.2sec,   10 completed,   0 failed,   0 skipped, org.apache.jmeter.functions.PackageTest
          0.1sec,   22 completed,   0 failed,   0 skipped, org.apache.jmeter.functions.ChangeCaseSpec
WARNING   8.0sec,  264 completed,   0 failed,   5 skipped, Gradle Test Run :src:functions:test

> Task :src:functions:check
> Task :src:functions:assemble UP-TO-DATE

> Task :src:dist-check:batchBUG_62847
Mar 29, 2020 12:44:20 PM java.util.prefs.WindowsPreferences <init>
WARNING: Could not open/create prefs root node Software\JavaSoft\Prefs at root 0x80000002.
Windows RegCreateKeyEx(...) returned error code 5.
Creating summariser <summary>
Created the tree successfully using F:\jenkins\jenkins-slave\workspace\JMeter Windows\bin\testfiles\BUG_62847.jmx
Starting standalone test @ Sun Mar 29 12:44:20 PDT 2020 (1585511060504)
Waiting for possible Shutdown/StopTestNow/HeapDump/ThreadDump message on port 4445
summary =      6 in 00:00:01 =    5.8/s Avg:     0 Min:     0 Max:     2 Err:     0 (0.00%)
Tidying up ...    @ Sun Mar 29 12:44:22 PDT 2020 (1585511062007)
... end of run
No errors present in the logfile F:\jenkins\jenkins-slave\workspace\JMeter Windows\bin\BUG_62847.log
(the file is empty)

> Task :src:protocol:http:test

Gradle Test Executor 18 STANDARD_OUT
    Setting JMeterHome: F:\jenkins\jenkins-slave\workspace\JMeter Windows\src\protocol\http\..\..\..\.
    Initializing Properties: ../../.././bin/jmeter.properties

Gradle Test Executor 18 STANDARD_ERROR
    Mar 29, 2020 12:44:22 PM java.util.prefs.WindowsPreferences <init>
    WARNING: Could not open/create prefs root node Software\JavaSoft\Prefs at root 0x80000002.
Windows RegCreateKeyEx(...) returned error code 5.

Gradle Test Executor 18 STANDARD_OUT
    JMeterVersion=5.3-SNAPSHOT e9b7351
    java.version=1.8.0_152
    java.vm.name=Java HotSpot(TM) 64-Bit Server VM
    java.vendor=Oracle Corporation
    java.home=F:\jenkins\tools\java\latest1.8\jre
    file.encoding=windows-1252
    default encoding=windows-1252
    user.home=C:\Users\jenkins
    user.dir=F:\jenkins\jenkins-slave\workspace\JMeter Windows\src\protocol\http
    user.language=en
    user.region=null
    user.country=US
    user.variant=
    Locale=en_US
    java.class.version=52.0
    java.awt.headless=null
    os.name=Windows Server 2016
    os.version=10.0
    os.arch=amd64
          0.7sec,   55 completed,   0 failed,   0 skipped, org.apache.jmeter.curl.BasicCurlParserTest
          0.2sec,   21 completed,   0 failed,   0 skipped, org.apache.jmeter.gui.action.ParseCurlCommandActionTest
          0.0sec,    3 completed,   0 failed,   0 skipped, org.apache.jmeter.protocol.http.config.MultipartUrlConfigTest
          0.0sec,    2 completed,   0 failed,   0 skipped, org.apache.jmeter.protocol.http.config.UrlConfigTest
FAILURE   1.1sec, org.apache.jmeter.protocol.http.control.TestCacheManagerHC4 > testCacheHttpClientBug51932()
    org.opentest4j.AssertionFailedError: Should not find valid entry ==> expected: <false>
but was: <true>
        at org.junit.jupiter.api.AssertionUtils.fail(AssertionUtils.java:55)
        at org.junit.jupiter.api.AssertFalse.assertFalse(AssertFalse.java:40)
        at org.junit.jupiter.api.Assertions.assertFalse(Assertions.java:218)
        at org.apache.jmeter.protocol.http.control.TestCacheManagerBase.testCacheHttpClientBug51932(TestCacheManagerBase.java:365)
        at org.junit.platform.commons.util.ReflectionUtils.invokeMethod(ReflectionUtils.java:686)
        at org.junit.jupiter.engine.execution.MethodInvocation.proceed(MethodInvocation.java:60)
        at org.junit.jupiter.engine.execution.InvocationInterceptorChain$ValidatingInvocation.proceed(InvocationInterceptorChain.java:131)
        at org.junit.jupiter.engine.extension.TimeoutInvocation.proceed(TimeoutInvocation.java:46)
        at org.junit.jupiter.engine.extension.TimeoutExtension.intercept(TimeoutExtension.java:149)
        at org.junit.jupiter.engine.extension.TimeoutExtension.interceptTestableMethod(TimeoutExtension.java:140)
        at org.junit.jupiter.engine.extension.TimeoutExtension.interceptTestMethod(TimeoutExtension.java:84)
        at org.junit.jupiter.engine.execution.ExecutableInvoker$ReflectiveInterceptorCall.lambda$ofVoidMethod$0(ExecutableInvoker.java:115)
        at org.junit.jupiter.engine.execution.ExecutableInvoker.lambda$invoke$0(ExecutableInvoker.java:105)
        at org.junit.jupiter.engine.execution.InvocationInterceptorChain$InterceptedInvocation.proceed(InvocationInterceptorChain.java:106)
        at org.junit.jupiter.engine.execution.InvocationInterceptorChain.proceed(InvocationInterceptorChain.java:64)
        at org.junit.jupiter.engine.execution.InvocationInterceptorChain.chainAndInvoke(InvocationInterceptorChain.java:45)
        at org.junit.jupiter.engine.execution.InvocationInterceptorChain.invoke(InvocationInterceptorChain.java:37)
        at org.junit.jupiter.engine.execution.ExecutableInvoker.invoke(ExecutableInvoker.java:104)
        at org.junit.jupiter.engine.execution.ExecutableInvoker.invoke(ExecutableInvoker.java:98)
        at org.junit.jupiter.engine.descriptor.TestMethodTestDescriptor.lambda$invokeTestMethod$6(TestMethodTestDescriptor.java:205)
        at org.junit.platform.engine.support.hierarchical.ThrowableCollector.execute(ThrowableCollector.java:73)
        at org.junit.jupiter.engine.descriptor.TestMethodTestDescriptor.invokeTestMethod(TestMethodTestDescriptor.java:201)
        at org.junit.jupiter.engine.descriptor.TestMethodTestDescriptor.execute(TestMethodTestDescriptor.java:137)
        at org.junit.jupiter.engine.descriptor.TestMethodTestDescriptor.execute(TestMethodTestDescriptor.java:71)
        at org.junit.platform.engine.support.hierarchical.NodeTestTask.lambda$executeRecursively$5(NodeTestTask.java:135)
        at org.junit.platform.engine.support.hierarchical.ThrowableCollector.execute(ThrowableCollector.java:73)
        at org.junit.platform.engine.support.hierarchical.NodeTestTask.lambda$executeRecursively$7(NodeTestTask.java:125)
        at org.junit.platform.engine.support.hierarchical.Node.around(Node.java:135)
        at org.junit.platform.engine.support.hierarchical.NodeTestTask.lambda$executeRecursively$8(NodeTestTask.java:123)
        at org.junit.platform.engine.support.hierarchical.ThrowableCollector.execute(ThrowableCollector.java:73)
        at org.junit.platform.engine.support.hierarchical.NodeTestTask.executeRecursively(NodeTestTask.java:122)
        at org.junit.platform.engine.support.hierarchical.NodeTestTask.execute(NodeTestTask.java:80)

          1.4sec,    2 completed,   0 failed,   0 skipped, org.apache.jmeter.protocol.http.sampler.TestHTTPHC4Impl

> Task :src:dist-check:compileTestJava
Note: F:\jenkins\jenkins-slave\workspace\JMeter Windows\src\dist-check\src\test\java\org\apache\jorphan\reflect\TestClassFinder.java
uses or overrides a deprecated API.
Note: Recompile with -Xlint:deprecation for details.

> Task :src:dist:javadocAggregate
javadoc: warning - Multiple sources of package comments found for package "org.apache.jmeter.assertions"
javadoc: warning - Multiple sources of package comments found for package "org.apache.jmeter.visualizers"
javadoc: warning - Multiple sources of package comments found for package "org.apache.jmeter.report.config"
javadoc: warning - Multiple sources of package comments found for package "org.apache.jmeter.report.core"
javadoc: warning - Multiple sources of package comments found for package "org.apache.jmeter.report.dashboard"
javadoc: warning - Multiple sources of package comments found for package "org.apache.jmeter.report.processor"
javadoc: warning - Multiple sources of package comments found for package "org.apache.jmeter.report.processor.graph"
javadoc: warning - Multiple sources of package comments found for package "org.apache.jmeter.report.processor.graph.impl"
javadoc: warning - Multiple sources of package comments found for package "org.apache.commons.cli.avalon"

> Task :src:dist-check:compileTestGroovy
> Task :src:dist-check:testClasses
> Task :src:dist-check:checkstyleTest
> Task :src:dist-check:spotbugsTest SKIPPED

> Task :src:protocol:http:test
          2.4sec,   10 completed,   0 failed,   0 skipped, org.apache.jmeter.protocol.http.proxy.TestHttpRequestHdr
          2.1sec, org.apache.jmeter.protocol.http.control.TestCacheManagerHC4 > testExpires()
          2.1sec, org.apache.jmeter.protocol.http.control.TestCacheManagerHC4 > testExpiresBug59962()
          2.0sec, org.apache.jmeter.protocol.http.control.TestCacheManagerHC4 > testPrivateCacheExpireNoMaxAge()
          3.0sec, org.apache.jmeter.protocol.http.control.TestCacheManagerHC4 > testPrivateCacheNoMaxAgeNoExpire()
          3.0sec, org.apache.jmeter.protocol.http.control.TestCacheManagerUrlConnection >
testPrivateCacheNoMaxAgeNoExpire()
          2.1sec, org.apache.jmeter.protocol.http.control.TestCacheManagerUrlConnection >
testExpires()
          3.1sec, org.apache.jmeter.protocol.http.control.TestCacheManagerHC4 > testNoCacheControlNoMaxAgeNoExpire()
FAILURE   5.5sec,   25 completed,   1 failed,   0 skipped, org.apache.jmeter.protocol.http.control.TestCacheManagerHC4
          2.1sec, org.apache.jmeter.protocol.http.control.TestCacheManagerUrlConnection >
testExpiresBug59962()
          2.1sec, org.apache.jmeter.protocol.http.control.TestCacheManagerUrlConnection >
testPrivateCacheExpireNoMaxAge()
          3.1sec, org.apache.jmeter.protocol.http.control.TestCacheManagerUrlConnection >
testNoCacheControlNoMaxAgeNoExpire()
          7.6sec,   24 completed,   0 failed,   0 skipped, org.apache.jmeter.protocol.http.control.TestCacheManagerUrlConnection
          6.1sec, org.apache.jmeter.protocol.http.control.DnsManagerTest > badDnsInCustomResolverShouldFailHttpSampler(String,
WireMockServer)[1], [1] HttpClient4
WARNING   7.6sec,    2 completed,   0 failed,   1 skipped, org.apache.jmeter.protocol.http.control.DnsManagerTest
          0.1sec,    1 completed,   0 failed,   0 skipped, org.apache.jmeter.protocol.http.control.gui.TestHttpTestSampleGui
          0.0sec,    6 completed,   0 failed,   0 skipped, org.apache.jmeter.protocol.http.control.TestAuthManager
          0.0sec,    2 completed,   0 failed,   0 skipped, org.apache.jmeter.protocol.http.control.TestAuthManagerThreadIteration
          0.0sec,    1 completed,   0 failed,   0 skipped, org.apache.jmeter.protocol.http.control.TestAuthorization
          0.1sec,    5 completed,   0 failed,   0 skipped, org.apache.jmeter.protocol.http.control.TestCacheManagerThreadIteration
          0.1sec,    4 completed,   0 failed,   0 skipped, org.apache.jmeter.protocol.http.control.TestCookieManagerThreadIteration
          0.1sec,   33 completed,   0 failed,   0 skipped, org.apache.jmeter.protocol.http.control.TestHC4CookieManager
          0.6sec,   18 completed,   0 failed,   0 skipped, org.apache.jmeter.protocol.http.modifier.TestAnchorModifier
          0.0sec,   17 completed,   0 failed,   0 skipped, org.apache.jmeter.protocol.http.modifier.TestURLRewritingModifier
          0.0sec,    2 completed,   0 failed,   0 skipped, org.apache.jmeter.protocol.http.parser.TestBaseParser
          0.4sec,    4 completed,   0 failed,   0 skipped, org.apache.jmeter.protocol.http.parser.TestCssParser
          0.0sec,    6 completed,   0 failed,   0 skipped, org.apache.jmeter.protocol.http.parser.TestHtmlParsingUtils
          0.4sec,    7 completed,   0 failed,   0 skipped, org.apache.jmeter.protocol.http.proxy.TestProxyControl
          0.1sec,    1 completed,   0 failed,   0 skipped, org.apache.jmeter.protocol.http.sampler.PackageTest

> Task :src:dist-check:batchBatchTestLocal
Mar 29, 2020 12:44:28 PM java.util.prefs.WindowsPreferences <init>
WARNING: Could not open/create prefs root node Software\JavaSoft\Prefs at root 0x80000002.
Windows RegCreateKeyEx(...) returned error code 5.
Creating summariser <summary>
Created the tree successfully using F:\jenkins\jenkins-slave\workspace\JMeter Windows\bin\testfiles\BatchTestLocal.jmx
Starting standalone test @ Sun Mar 29 12:44:28 PDT 2020 (1585511068183)
Waiting for possible Shutdown/StopTestNow/HeapDump/ThreadDump message on port 4445
summary +     55 in 00:00:05 =   10.6/s Avg:     3 Min:     0 Max:     7 Err:     8 (14.55%)
Active: 1 Started: 2 Finished: 1
summary +     77 in 00:00:01 =   65.4/s Avg:    10 Min:     0 Max:   103 Err:     8 (10.39%)
Active: 0 Started: 1 Finished: 1
summary =    132 in 00:00:06 =   20.7/s Avg:     7 Min:     0 Max:   103 Err:    16 (12.12%)
Tidying up ...    @ Sun Mar 29 12:44:35 PDT 2020 (1585511075015)
... end of run
No errors present in the logfile F:\jenkins\jenkins-slave\workspace\JMeter Windows\bin\BatchTestLocal.log
(the file is empty)

> Task :src:protocol:http:test
          2.3sec,   16 completed,   0 failed,   0 skipped, org.apache.jmeter.protocol.http.sampler.ParallelResourcesAndIpSource
          0.1sec,    8 completed,   0 failed,   0 skipped, org.apache.jmeter.protocol.http.sampler.PostWriterTest
          0.0sec,    2 completed,   0 failed,   0 skipped, org.apache.jmeter.protocol.http.sampler.PutWriterTest
          1.1sec,    8 completed,   0 failed,   0 skipped, org.apache.jmeter.protocol.http.sampler.TestDecompression
          0.0sec,   18 completed,   0 failed,   0 skipped, org.apache.jmeter.protocol.http.sampler.TestHTTPSamplers
          0.0sec,    2 completed,   0 failed,   0 skipped, org.apache.jmeter.protocol.http.sampler.TestHttpWebdav
          0.6sec,    1 completed,   0 failed,   0 skipped, org.apache.jmeter.protocol.http.sampler.TestSerializedHTTPSampler
          0.0sec,    6 completed,   0 failed,   0 skipped, org.apache.jmeter.protocol.http.util.accesslog.TestLogFilter
          0.0sec,    3 completed,   0 failed,   0 skipped, org.apache.jmeter.protocol.http.util.accesslog.TestSessionFilter
          0.0sec,    4 completed,   0 failed,   0 skipped, org.apache.jmeter.protocol.http.util.accesslog.TestTCLogParser
          0.0sec,    3 completed,   0 failed,   0 skipped, org.apache.jmeter.protocol.http.util.TestHTTPArgument
          0.0sec,    3 completed,   0 failed,   0 skipped, org.apache.jmeter.protocol.http.util.TestHTTPFileArg
          0.0sec,    5 completed,   0 failed,   0 skipped, org.apache.jmeter.protocol.http.util.TestHTTPFileArgs
          0.0sec,    7 completed,   0 failed,   0 skipped, org.apache.jmeter.protocol.http.visualizers.RequestViewHTTPTest
          0.2sec,    1 completed,   0 failed,   0 skipped, org.apache.jmeter.resources.ResourceKeyUsageTestHttp
          0.0sec,    2 completed,   0 failed,   0 skipped, org.apache.jmeter.testelement.TestHeaderManager
          1.0sec,    9 completed,   0 failed,   0 skipped, org.apache.jmeter.protocol.http.control.TestHTTPMirrorThread
          0.3sec,   46 completed,   0 failed,   0 skipped, org.apache.jmeter.protocol.http.parser.TestBug60842HtmlParser

> Task :src:dist-check:batchBug50898
Mar 29, 2020 12:44:37 PM java.util.prefs.WindowsPreferences <init>
WARNING: Could not open/create prefs root node Software\JavaSoft\Prefs at root 0x80000002.
Windows RegCreateKeyEx(...) returned error code 5.
Creating summariser <summary>
Created the tree successfully using F:\jenkins\jenkins-slave\workspace\JMeter Windows\bin\testfiles\Bug50898.jmx
Starting standalone test @ Sun Mar 29 12:44:37 PDT 2020 (1585511077988)
Waiting for possible Shutdown/StopTestNow/HeapDump/ThreadDump message on port 4445
summary =      2 in 00:00:01 =    3.1/s Avg:     8 Min:     8 Max:     8 Err:     0 (0.00%)
Tidying up ...    @ Sun Mar 29 12:44:39 PDT 2020 (1585511079372)
... end of run
No errors present in the logfile F:\jenkins\jenkins-slave\workspace\JMeter Windows\bin\Bug50898.log
(the file is empty)

> Task :src:protocol:http:test
          1.3sec,  103 completed,   0 failed,   0 skipped, org.apache.jmeter.protocol.http.parser.TestHTMLParser
WARNING   0.0sec,    2 completed,   0 failed,   2 skipped, org.apache.jmeter.protocol.http.sampler.SamplingNamingTest
          0.5sec,   53 completed,   0 failed,   0 skipped, org.apache.jmeter.protocol.http.sampler.TestHTTPSamplersAgainstHttpMirrorServer
          0.0sec,    7 completed,   0 failed,   0 skipped, org.apache.jmeter.protocol.http.visualizers.RequestViewHTTPTest
          0.3sec,   11 completed,   0 failed,   0 skipped, org.apache.jmeter.protocol.http.control.DNSCacheManagerSpec
          0.1sec,   58 completed,   0 failed,   0 skipped, org.apache.jmeter.protocol.http.util.HTTPUtilsSpec
FAILURE  23.1sec,  629 completed,   1 failed,   3 skipped, Gradle Test Run :src:protocol:http:test

629 tests completed, 1 failed, 3 skipped

> Task :src:protocol:http:test FAILED

> Task :src:dist-check:batchBug52968
Mar 29, 2020 12:44:41 PM java.util.prefs.WindowsPreferences <init>
WARNING: Could not open/create prefs root node Software\JavaSoft\Prefs at root 0x80000002.
Windows RegCreateKeyEx(...) returned error code 5.
Creating summariser <summary>
Created the tree successfully using F:\jenkins\jenkins-slave\workspace\JMeter Windows\bin\testfiles\Bug52968.jmx
Starting standalone test @ Sun Mar 29 12:44:41 PDT 2020 (1585511081995)
Waiting for possible Shutdown/StopTestNow/HeapDump/ThreadDump message on port 4445
summary =     30 in 00:00:00 =   61.2/s Avg:     5 Min:     4 Max:     7 Err:     9 (30.00%)
Tidying up ...    @ Sun Mar 29 12:44:43 PDT 2020 (1585511083165)
... end of run
No errors present in the logfile F:\jenkins\jenkins-slave\workspace\JMeter Windows\bin\Bug52968.log
(the file is empty)

> Task :src:dist:javadocAggregate
9 warnings
checksum-dependency elapsed time: 12353ms, configurations processed: 243 (add -PchecksumTimingsPrint
to print detailed timings)

FAILURE: Build failed with an exception.

* What went wrong:
Execution failed for task ':src:protocol:http:test'.
> There were failing tests. See the report at: file:///F:/jenkins/jenkins-slave/workspace/JMeter%20Windows/src/protocol/http/build/reports/tests/test/index.html

* Try:
Run with --stacktrace option to get the stack trace. Run with --info or --debug option to
get more log output. Run with --scan to get full insights.

* Get more help at https://help.gradle.org

Deprecated Gradle features were used in this build, making it incompatible with Gradle 7.0.
Use '--warning-mode all' to show the individual deprecation warnings.
See https://docs.gradle.org/6.3/userguide/command_line_interface.html#sec:command_line_warnings

BUILD FAILED in 4m 42s
260 actionable tasks: 182 executed, 78 up-to-date
Could not open/create prefs root node Software\JavaSoft\Prefs at root 0x80000002. Windows
RegCreateKeyEx(...) returned error code 5.
Build step 'Invoke Gradle script' changed build result to FAILURE
Build step 'Invoke Gradle script' marked build as failure

Mime
View raw message