jmeter-dev mailing list archives

Site index · List index
Message view « Date » · « Thread »
Top « Date » · « Thread »
From Apache Jenkins Server <jenk...@builds.apache.org>
Subject Build failed in Jenkins: JMeter-trunk #7670
Date Sun, 22 Mar 2020 22:20:31 GMT
See <https://builds.apache.org/job/JMeter-trunk/7670/display/redirect?page=changes>

Changes:

[sitnikov.vladimir] Support SVG icons for the toolbar


------------------------------------------
[...truncated 52.20 KB...]
> Task :src:protocol:mongodb:autostyleCheck
> Task :src:protocol:tcp:autostyleJavaCheck
> Task :src:protocol:tcp:autostyleKotlinGradleCheck NO-SOURCE
> Task :src:protocol:tcp:autostyleMarkdownCheck NO-SOURCE
> Task :src:protocol:tcp:autostyleCheck
> Task :src:protocol:mail:autostyleJavaCheck
> Task :src:protocol:mail:autostyleKotlinGradleCheck NO-SOURCE
> Task :src:protocol:mail:autostyleMarkdownCheck NO-SOURCE
> Task :src:protocol:mail:autostyleCheck
> Task :src:functions:autostyleJavaCheck
> Task :src:protocol:http:autostyleJavaCheck
> Task :src:protocol:http:autostyleKotlinGradleCheck NO-SOURCE
> Task :src:protocol:http:autostyleMarkdownCheck NO-SOURCE
> Task :src:protocol:http:autostyleCheck
> Task :src:components:autostyleJavaCheck

> Task :src:jorphan:compileJava
Note: Some input files use or override a deprecated API.
Note: Recompile with -Xlint:deprecation for details.

> Task :src:testkit:autostyleKotlinGradleCheck
> Task :src:testkit:autostyleMarkdownCheck NO-SOURCE
> Task :src:testkit:autostyleCheck
> Task :src:examples:autostyleKotlinGradleCheck
> Task :src:generator:autostyleKotlinGradleCheck
> Task :src:bshclient:autostyleKotlinGradleCheck
> Task :src:generator:autostyleMarkdownCheck NO-SOURCE
> Task :src:generator:autostyleCheck
> Task :src:bshclient:autostyleMarkdownCheck NO-SOURCE
> Task :src:bshclient:autostyleCheck
> Task :src:examples:autostyleMarkdownCheck NO-SOURCE
> Task :src:examples:autostyleCheck
> Task :src:generator:processTestResources NO-SOURCE
> Task :src:functions:autostyleKotlinGradleCheck
> Task :src:functions:autostyleMarkdownCheck NO-SOURCE
> Task :src:functions:autostyleCheck
> Task :src:examples:processResources
> Task :src:examples:processTestResources NO-SOURCE
> Task :src:launcher:autostyleKotlinGradleCheck
> Task :src:launcher:autostyleMarkdownCheck NO-SOURCE
> Task :src:launcher:autostyleCheck
> Task :src:release:autostyleKotlinGradleCheck
> Task :src:release:autostyleMarkdownCheck NO-SOURCE
> Task :src:release:autostyleCheck
> Task :src:release:compileJava NO-SOURCE
> Task :src:release:processResources NO-SOURCE
> Task :src:release:classes UP-TO-DATE
> Task :src:components:autostyleKotlinGradleCheck
> Task :src:release:checkstyleMain NO-SOURCE
> Task :src:config:autostyleKotlinGradleCheck
> Task :src:config:autostyleMarkdownCheck NO-SOURCE
> Task :src:config:autostyleCheck
> Task :src:release:compileTestJava NO-SOURCE
> Task :src:bshclient:compileJava
> Task :src:bshclient:processResources NO-SOURCE
> Task :src:release:processTestResources NO-SOURCE
> Task :src:bshclient:classes
> Task :src:config:compileJava NO-SOURCE
> Task :src:release:testClasses UP-TO-DATE
> Task :src:components:autostyleMarkdownCheck NO-SOURCE
> Task :src:config:processResources NO-SOURCE
> Task :src:release:checkstyleTest NO-SOURCE
> Task :src:config:classes UP-TO-DATE
> Task :src:release:spotbugsMain NO-SOURCE
> Task :src:components:autostyleCheck
> Task :src:release:spotbugsTest NO-SOURCE
> Task :src:config:checkstyleMain NO-SOURCE
> Task :src:config:compileTestJava NO-SOURCE
> Task :src:release:test NO-SOURCE
> Task :src:release:check
> Task :src:config:processTestResources NO-SOURCE
> Task :src:config:testClasses UP-TO-DATE
> Task :src:config:checkstyleTest NO-SOURCE
> Task :src:config:spotbugsMain NO-SOURCE
> Task :src:config:spotbugsTest NO-SOURCE
> Task :src:config:test NO-SOURCE
> Task :src:config:check
> Task :src:release:jar
> Task :src:release:assemble
> Task :src:bom:autostyleKotlinGradleCheck
> Task :src:bom:autostyleMarkdownCheck NO-SOURCE
> Task :src:protocol:autostyleKotlinGradleCheck
> Task :src:bom:autostyleCheck
> Task :src:bom:check
> Task :src:protocol:autostyleMarkdownCheck NO-SOURCE
> Task :src:protocol:autostyleCheck
> Task :src:bom:assemble UP-TO-DATE
> Task :src:protocol:compileJava NO-SOURCE
> Task :src:protocol:processResources NO-SOURCE
> Task :src:protocol:classes UP-TO-DATE
> Task :src:protocol:checkstyleMain NO-SOURCE
> Task :src:autostyleKotlinGradleCheck
> Task :src:protocol:compileTestJava NO-SOURCE
> Task :src:dist-check:autostyleKotlinGradleCheck
> Task :src:autostyleMarkdownCheck NO-SOURCE
> Task :src:protocol:processTestResources NO-SOURCE
> Task :src:autostyleCheck
> Task :src:protocol:testClasses UP-TO-DATE
> Task :src:check
> Task :src:protocol:checkstyleTest NO-SOURCE
> Task :src:dist-check:autostyleMarkdownCheck NO-SOURCE
> Task :src:dist-check:autostyleCheck
> Task :src:assemble UP-TO-DATE
> Task :src:protocol:spotbugsMain NO-SOURCE
> Task :src:dist-check:processResources NO-SOURCE
> Task :src:protocol:spotbugsTest NO-SOURCE
> Task :src:licenses:autostyleKotlinGradleCheck
> Task :src:protocol:test NO-SOURCE
> Task :src:protocol:check
> Task :src:licenses:autostyleMarkdownCheck NO-SOURCE
> Task :src:licenses:autostyleCheck
> Task :src:licenses:compileJava NO-SOURCE
> Task :src:licenses:processResources NO-SOURCE
> Task :src:licenses:classes UP-TO-DATE
> Task :src:licenses:checkstyleMain NO-SOURCE
> Task :src:licenses:compileTestJava NO-SOURCE
> Task :src:protocol:jar
> Task :src:protocol:assemble
> Task :src:licenses:processTestResources NO-SOURCE
> Task :src:dist-check:processTestResources
> Task :src:licenses:testClasses UP-TO-DATE
> Task :src:licenses:checkstyleTest NO-SOURCE
> Task :src:licenses:spotbugsMain NO-SOURCE
> Task :src:licenses:spotbugsTest NO-SOURCE
> Task :src:licenses:test NO-SOURCE
> Task :src:licenses:check
> Task :src:licenses:gatherSourceLicenses
> Task :src:dist:autostyleKotlinGradleCheck
> Task :src:dist:autostyleMarkdownCheck NO-SOURCE
> Task :src:dist:autostyleCheck
> Task :src:dist:processResources NO-SOURCE
> Task :src:dist:processTestResources NO-SOURCE
> Task :src:dist:preparePropertiesbuildPrintableDoc
> Task :src:components:processResources
> Task :src:components:processTestResources
> Task :autostyleKotlinGradleCheck
> Task :autostyleMarkdownCheck
> Task :autostyleCheck
> Task :compileJava NO-SOURCE
> Task :processResources NO-SOURCE
> Task :classes UP-TO-DATE
> Task :checkstyleMain NO-SOURCE
> Task :compileTestJava NO-SOURCE
> Task :processTestResources NO-SOURCE
> Task :testClasses UP-TO-DATE
> Task :checkstyleTest NO-SOURCE

> Task :src:licenses:renderLicenseForSource
Dependencies of license category B are not allowed for SOURCE artifacts
=======================================================================

CC-BY-SA-3.0
* openiconlibrary:openiconlibrary:

OFL-1.1
* font-awesome-font:font-awesome-font:4.2.0


> Task :src:licenses:renderLicenseForSourceCopySpec
> Task :src:licenses:srcLicenseDir
> Task :src:licenses:jar
> Task :src:jorphan:compileGroovy NO-SOURCE
> Task :src:jorphan:processResources
> Task :src:jorphan:classes
> Task :gitProps
> Task :src:jorphan:jar
> Task :src:core:autostyleJavaCheck FAILED
> Task :src:config:jar
> Task :src:dist-check:populateLibs
> Task :src:testkit-wiremock:compileJava

> Task :src:jorphan:compileTestJava
Note: Some input files use or override a deprecated API.
Note: Recompile with -Xlint:deprecation for details.

> Task :src:dist:buildPrintableDoc
> Task :rat
> Task :src:bshclient:checkstyleMain
> Task :src:testkit:checkstyleMain
> Task :src:launcher:checkstyleMain
checksum-dependency elapsed time: 44425ms, configurations processed: 103
    SHA-512 computation time: 493ms (goes in parallel, it might exceed wall-clock time), files
processed: 13, processed: 4MiB, skipped: 1005MiB
    PGP signature resolution time: 18183ms (wall-clock), resolution requests: 61, signatures
resolved: 161
    PGP key resolution time: 20819ms (wall-clock), resolution requests: 61, download time:
32303ms (goes in parallel, it might exceed wall-clock time), keys downloaded: 68
        PGP signature verification time: 17087ms (goes in parallel, it might exceed wall-clock
time), files processed: 531, processed: 793MiB, skipped: 211MiB

FAILURE: Build failed with an exception.

* What went wrong:
Execution failed for task ':src:core:autostyleJavaCheck'.
> The following files have format violations:
    src/core/src/main/java/org/apache/jmeter/gui/util/IconToolbarBean.java
      @@ -17,13 +17,13 @@
       
       package org.apache.jmeter.gui.util;
       
      +import java.util.regex.Matcher;
      +import java.util.regex.Pattern;
      +
       import org.apache.jmeter.gui.action.ActionNames;
       import org.slf4j.Logger;
       import org.slf4j.LoggerFactory;
       
      -import java.util.regex.Matcher;
      -import java.util.regex.Pattern;
      -
       public final class IconToolbarBean {
       
           private static final Logger log = LoggerFactory.getLogger(IconToolbarBean.class);
    src/core/src/main/java/org/apache/jmeter/gui/util/JMeterToolBar.java
      @@ -32,8 +32,6 @@
       import javax.swing.JOptionPane;
       import javax.swing.JToolBar;
       
      -import com.github.weisj.darklaf.icons.ThemedSVGIcon;
      -
       import org.apache.commons.lang3.StringUtils;
       import org.apache.jmeter.gui.UndoHistory;
       import org.apache.jmeter.gui.action.ActionNames;
      @@ -44,6 +42,7 @@
       import org.slf4j.Logger;
       import org.slf4j.LoggerFactory;
       
      +import com.github.weisj.darklaf.icons.ThemedSVGIcon;
       import com.github.weisj.darklaf.ui.button.DarkButtonUI;
       
       /**
  Run './gradlew autostyleApply' to fix the violations.

* Try:
Run with --stacktrace option to get the stack trace. Run with --info or --debug option to
get more log output. Run with --scan to get full insights.

* Get more help at https://help.gradle.org

Deprecated Gradle features were used in this build, making it incompatible with Gradle 7.0.
Use '--warning-mode all' to show the individual deprecation warnings.
See https://docs.gradle.org/6.1/userguide/command_line_interface.html#sec:command_line_warnings

BUILD FAILED in 2m 30s
131 actionable tasks: 101 executed, 30 up-to-date

See the profiling report at: file://<https://builds.apache.org/job/JMeter-trunk/ws/build/reports/profile/profile-2020-03-22-22-18-10.html>
A fine-grained performance profile is available: use the --scan option.
Build step 'Invoke Gradle script' changed build result to FAILURE
Build step 'Invoke Gradle script' marked build as failure
Xvfb stopping
Archiving artifacts
Recording test results
ERROR: Step ?Publish JUnit test result report? failed: No test report files were found. Configuration
error?

Mime
View raw message