jmeter-dev mailing list archives

Site index · List index
Message view « Date » · « Thread »
Top « Date » · « Thread »
From Apache Jenkins Server <jenk...@builds.apache.org>
Subject Build failed in Jenkins: JMeter-trunk #7703
Date Sun, 29 Mar 2020 21:30:51 GMT
See <https://builds.apache.org/job/JMeter-trunk/7703/display/redirect?page=changes>

Changes:

[sitnikov.vladimir] Fix imports in JUnitTestSamplerGui


------------------------------------------
[...truncated 61.68 KB...]
> Task :src:functions:autostyleCheck
> Task :src:bshclient:compileJava UP-TO-DATE
> Task :src:launcher:autostyleKotlinGradleCheck
> Task :src:launcher:autostyleMarkdownCheck NO-SOURCE
> Task :src:launcher:autostyleCheck
> Task :src:bshclient:processResources NO-SOURCE
> Task :src:bshclient:classes UP-TO-DATE
> Task :src:examples:processResources UP-TO-DATE
> Task :src:examples:processTestResources NO-SOURCE
> Task :src:config:autostyleKotlinGradleCheck
> Task :src:release:autostyleKotlinGradleCheck
> Task :src:config:autostyleMarkdownCheck NO-SOURCE
> Task :src:config:autostyleCheck
> Task :src:release:autostyleMarkdownCheck NO-SOURCE
> Task :src:release:autostyleCheck
> Task :src:config:compileJava NO-SOURCE
> Task :src:config:processResources NO-SOURCE
> Task :src:config:classes UP-TO-DATE
> Task :src:release:compileJava NO-SOURCE
> Task :src:config:checkstyleMain NO-SOURCE
> Task :src:release:processResources NO-SOURCE
> Task :src:release:classes UP-TO-DATE
> Task :src:config:compileTestJava NO-SOURCE
> Task :src:config:processTestResources NO-SOURCE
> Task :src:config:testClasses UP-TO-DATE
> Task :src:release:checkstyleMain NO-SOURCE
> Task :src:config:checkstyleTest NO-SOURCE
> Task :src:release:compileTestJava NO-SOURCE
> Task :src:release:processTestResources NO-SOURCE
> Task :src:release:testClasses UP-TO-DATE
> Task :src:release:checkstyleTest NO-SOURCE
> Task :src:config:spotbugsMain NO-SOURCE
> Task :src:release:spotbugsMain NO-SOURCE
> Task :src:config:spotbugsTest NO-SOURCE
> Task :src:protocol:http:autostyleJavaCheck
> Task :src:release:spotbugsTest NO-SOURCE
> Task :src:config:test NO-SOURCE
> Task :src:bom:autostyleKotlinGradleCheck
> Task :src:release:test NO-SOURCE
> Task :src:config:check
> Task :src:bom:autostyleMarkdownCheck NO-SOURCE
> Task :src:release:check
> Task :src:protocol:http:autostyleKotlinGradleCheck NO-SOURCE
> Task :src:bom:autostyleCheck
> Task :src:bom:check
> Task :src:bom:assemble UP-TO-DATE
> Task :src:protocol:autostyleKotlinGradleCheck
> Task :src:protocol:autostyleMarkdownCheck NO-SOURCE
> Task :src:protocol:autostyleCheck
> Task :src:release:jar UP-TO-DATE
> Task :src:protocol:compileJava NO-SOURCE
> Task :src:release:assemble UP-TO-DATE
> Task :src:bshclient:checkstyleMain UP-TO-DATE
> Task :src:testkit:checkstyleMain UP-TO-DATE
> Task :src:protocol:processResources NO-SOURCE
> Task :src:protocol:http:autostyleMarkdownCheck NO-SOURCE
> Task :src:testkit:compileTestJava NO-SOURCE
> Task :src:protocol:http:autostyleCheck
> Task :src:bshclient:compileTestJava NO-SOURCE
> Task :src:testkit:processTestResources NO-SOURCE
> Task :src:protocol:classes UP-TO-DATE
> Task :src:testkit:testClasses UP-TO-DATE
> Task :src:bshclient:processTestResources NO-SOURCE
> Task :src:launcher:checkstyleMain UP-TO-DATE
> Task :src:testkit-wiremock:checkstyleMain UP-TO-DATE
> Task :src:testkit:checkstyleTest NO-SOURCE
> Task :src:bshclient:testClasses UP-TO-DATE
> Task :src:testkit-wiremock:compileTestJava NO-SOURCE
> Task :src:testkit:checkstyleTestFixtures NO-SOURCE
> Task :src:protocol:checkstyleMain NO-SOURCE
> Task :src:launcher:compileTestJava NO-SOURCE
> Task :src:bshclient:checkstyleTest NO-SOURCE
> Task :src:protocol:compileTestJava NO-SOURCE
> Task :src:launcher:processTestResources NO-SOURCE
> Task :src:launcher:testClasses UP-TO-DATE
> Task :src:testkit-wiremock:processTestResources NO-SOURCE
> Task :src:autostyleKotlinGradleCheck
> Task :src:launcher:checkstyleTest NO-SOURCE
> Task :src:protocol:processTestResources NO-SOURCE
> Task :src:protocol:testClasses UP-TO-DATE
> Task :src:protocol:checkstyleTest NO-SOURCE
> Task :src:autostyleMarkdownCheck NO-SOURCE
> Task :src:testkit-wiremock:testClasses UP-TO-DATE
> Task :src:autostyleCheck
> Task :src:check
> Task :src:protocol:spotbugsMain NO-SOURCE
> Task :src:testkit-wiremock:checkstyleTest NO-SOURCE
> Task :src:assemble UP-TO-DATE
> Task :src:testkit-wiremock:checkstyleTestFixtures NO-SOURCE
> Task :src:protocol:spotbugsTest NO-SOURCE
> Task :src:protocol:test NO-SOURCE
> Task :src:protocol:check
> Task :src:dist-check:autostyleKotlinGradleCheck
> Task :src:dist-check:autostyleMarkdownCheck NO-SOURCE
> Task :src:dist-check:autostyleCheck
> Task :src:dist-check:processResources NO-SOURCE
> Task :src:protocol:jar UP-TO-DATE
> Task :src:protocol:assemble UP-TO-DATE
> Task :src:licenses:autostyleKotlinGradleCheck
> Task :src:dist-check:processTestResources UP-TO-DATE
> Task :src:licenses:autostyleMarkdownCheck NO-SOURCE
> Task :src:licenses:autostyleCheck
> Task :src:licenses:compileJava NO-SOURCE
> Task :src:licenses:processResources NO-SOURCE
> Task :src:licenses:classes UP-TO-DATE
> Task :src:licenses:checkstyleMain NO-SOURCE
> Task :src:licenses:compileTestJava NO-SOURCE
> Task :src:licenses:processTestResources NO-SOURCE
> Task :src:licenses:testClasses UP-TO-DATE
> Task :src:licenses:checkstyleTest NO-SOURCE
> Task :src:licenses:spotbugsMain NO-SOURCE
> Task :src:licenses:spotbugsTest NO-SOURCE
> Task :src:licenses:test NO-SOURCE
> Task :src:licenses:check
> Task :src:licenses:gatherSourceLicenses UP-TO-DATE
> Task :src:components:autostyleJavaCheck
> Task :src:licenses:renderLicenseForSource UP-TO-DATE
> Task :src:launcher:spotbugsMain UP-TO-DATE
> Task :src:bshclient:spotbugsMain UP-TO-DATE
> Task :src:testkit:spotbugsMain UP-TO-DATE
> Task :src:launcher:spotbugsTest NO-SOURCE
> Task :src:bshclient:spotbugsTest NO-SOURCE
> Task :src:testkit:spotbugsTest NO-SOURCE
> Task :src:launcher:test NO-SOURCE
> Task :src:testkit:spotbugsTestFixtures NO-SOURCE
> Task :src:launcher:check
> Task :src:bshclient:test NO-SOURCE
> Task :src:bshclient:check
> Task :src:launcher:assemble UP-TO-DATE
> Task :src:testkit:test NO-SOURCE
> Task :src:testkit:check
> Task :src:testkit:assemble UP-TO-DATE
> Task :src:bshclient:jar UP-TO-DATE
> Task :src:bshclient:assemble UP-TO-DATE
> Task :src:testkit-wiremock:spotbugsMain UP-TO-DATE
> Task :src:testkit-wiremock:spotbugsTest NO-SOURCE
> Task :src:testkit-wiremock:spotbugsTestFixtures NO-SOURCE
> Task :src:testkit-wiremock:test NO-SOURCE
> Task :src:testkit-wiremock:check
> Task :src:testkit-wiremock:assemble UP-TO-DATE
> Task :src:dist-check:populateLibs
> Task :src:dist:autostyleKotlinGradleCheck
> Task :src:dist:autostyleMarkdownCheck NO-SOURCE
> Task :src:dist:autostyleCheck
> Task :src:dist:processResources NO-SOURCE
> Task :src:dist:processTestResources NO-SOURCE
> Task :src:dist:preparePropertiesbuildPrintableDoc UP-TO-DATE
> Task :src:components:autostyleKotlinGradleCheck
> Task :src:components:autostyleMarkdownCheck NO-SOURCE
> Task :src:components:autostyleCheck
> Task :autostyleKotlinGradleCheck
> Task :src:components:processResources UP-TO-DATE
> Task :src:components:processTestResources UP-TO-DATE
> Task :src:licenses:renderLicenseForSourceCopySpec
> Task :autostyleMarkdownCheck
> Task :autostyleCheck
> Task :compileJava NO-SOURCE
> Task :src:licenses:srcLicenseDir UP-TO-DATE
> Task :processResources NO-SOURCE
> Task :classes UP-TO-DATE
> Task :checkstyleMain NO-SOURCE
> Task :src:licenses:jar UP-TO-DATE
> Task :compileTestJava NO-SOURCE
> Task :processTestResources NO-SOURCE
> Task :testClasses UP-TO-DATE
> Task :checkstyleTest NO-SOURCE
> Task :src:config:jar UP-TO-DATE
> Task :src:config:assemble UP-TO-DATE
> Task :gitProps
> Task :src:dist:buildPrintableDoc
> Task :src:jorphan:compileTestGroovy
> Task :src:jorphan:processTestResources NO-SOURCE
> Task :src:jorphan:testClasses
> Task :src:jorphan:testJar UP-TO-DATE
> Task :src:jorphan:autostyleConfigsCheck NO-SOURCE
> Task :src:jorphan:autostyleGroovyCheck
> Task :spotbugsMain NO-SOURCE
> Task :spotbugsTest NO-SOURCE
> Task :test NO-SOURCE
> Task :jar UP-TO-DATE
> Task :assemble UP-TO-DATE
> Task :src:core:compileJava
> Task :src:core:compileGroovy NO-SOURCE
> Task :src:core:classes
> Task :src:jorphan:autostyleJavaCheck FAILED
> Task :src:protocol:junit-sample:compileJava UP-TO-DATE
> Task :src:core:jar
> Task :src:protocol:mongodb:compileJava
> Task :src:protocol:native:compileJava

> Task :src:protocol:ftp:compileJava
Note: <https://builds.apache.org/job/JMeter-trunk/ws/src/protocol/ftp/src/main/java/org/apache/jmeter/protocol/ftp/sampler/FTPSampler.java>
uses or overrides a deprecated API.
Note: Recompile with -Xlint:deprecation for details.

> Task :src:protocol:junit:compileJava

> Task :src:protocol:tcp:compileJava
Note: Some input files use or override a deprecated API.
Note: Recompile with -Xlint:deprecation for details.

> Task :src:protocol:java:compileJava
> Task :src:protocol:ldap:compileJava
> Task :src:protocol:mail:compileJava

> Task :src:protocol:jms:compileJava
Note: Some input files use or override a deprecated API.
Note: Recompile with -Xlint:deprecation for details.

> Task :rat
> Task :src:dist:distTarSource
checksum-dependency elapsed time: 9455ms, configurations processed: 145 (add -PchecksumTimingsPrint
to print detailed timings)

FAILURE: Build failed with an exception.

* What went wrong:
Execution failed for task ':src:jorphan:autostyleJavaCheck'.
> The following files have format violations:
    src/jorphan/src/main/java/org/apache/jorphan/gui/JFactory.java
      @@ -17,7 +17,6 @@
       
       package org.apache.jorphan.gui;
       
      -import java.awt.Font;
       import java.awt.event.InputEvent;
       import java.awt.event.KeyEvent;
       import java.util.function.Consumer;
  Run './gradlew autostyleApply' to fix the violations.

* Try:
Run with --stacktrace option to get the stack trace. Run with --info or --debug option to
get more log output. Run with --scan to get full insights.

* Get more help at https://help.gradle.org

Deprecated Gradle features were used in this build, making it incompatible with Gradle 7.0.
Use '--warning-mode all' to show the individual deprecation warnings.
See https://docs.gradle.org/6.3/userguide/command_line_interface.html#sec:command_line_warnings

BUILD FAILED in 39s
157 actionable tasks: 79 executed, 78 up-to-date

See the profiling report at: file://<https://builds.apache.org/job/JMeter-trunk/ws/build/reports/profile/profile-2020-03-29-21-30-04.html>
A fine-grained performance profile is available: use the --scan option.
Build step 'Invoke Gradle script' changed build result to FAILURE
Build step 'Invoke Gradle script' marked build as failure
Xvfb stopping
Archiving artifacts
[Fast Archiver] Compressed 15.42 MB of artifacts by 11.6% relative to #7700
Recording test results
ERROR: Step ?Publish JUnit test result report? failed: No test report files were found. Configuration
error?

Mime
View raw message