jmeter-dev mailing list archives

Site index · List index
Message view « Date » · « Thread »
Top « Date » · « Thread »
From Apache Jenkins Server <jenk...@builds.apache.org>
Subject Build failed in Jenkins: JMeter-trunk #7724
Date Sat, 25 Apr 2020 20:06:35 GMT
See <https://builds.apache.org/job/JMeter-trunk/7724/display/redirect?page=changes>

Changes:

[pmouawad] Show PreciseThroughputTimer details in schematic overview


------------------------------------------
[...truncated 66 B...]
Building remotely on H25 (ubuntu) in workspace <https://builds.apache.org/job/JMeter-trunk/ws/>
No credentials specified
 > git rev-parse --is-inside-work-tree # timeout=10
Fetching changes from the remote Git repository
 > git config remote.origin.url https://gitbox.apache.org/repos/asf/jmeter.git # timeout=10
Fetching upstream changes from https://gitbox.apache.org/repos/asf/jmeter.git
 > git --version # timeout=10
 > git fetch --tags --progress -- https://gitbox.apache.org/repos/asf/jmeter.git +refs/heads/*:refs/remotes/origin/*
 > git rev-parse refs/remotes/origin/master^{commit} # timeout=10
 > git rev-parse refs/remotes/origin/origin/master^{commit} # timeout=10
Checking out Revision d0be716b568d93ffd67406528d187e0e7bba6705 (refs/remotes/origin/master)
 > git config core.sparsecheckout # timeout=10
 > git checkout -f d0be716b568d93ffd67406528d187e0e7bba6705
Commit message: "Show PreciseThroughputTimer details in schematic overview"
 > git rev-list --no-walk caace287dbd4f1d16d67ad647104076d5e6b0d69 # timeout=10
Xvfb starting$ /usr/bin/Xvfb :1 -fbdir /home/jenkins/jenkins-slave/xvfb-7724-..fbdir1690273601101643848
[EnvInject] - Executing scripts and injecting environment variables after the SCM step.
[EnvInject] - Injecting as environment variables the properties content 
SONAR_HOST_URL=https://sonarcloud.io

[EnvInject] - Variables injected successfully.
[EnvInject] - Mask passwords that will be passed as build parameters.
[JMeter-trunk] $ /bin/bash -xe /tmp/jenkins4026502483301767269.sh
+ rm -rf src/dist/build/distributions
[Gradle] - Launching build.
[JMeter-trunk] $ <https://builds.apache.org/job/JMeter-trunk/ws/gradlew> "-Dorg.gradle.jvmargs=-Xmx512m
-XX:MaxMetaspaceSize=512m" -PignoreSpotBugsFailures=true -Pspotbugs=true -PCI=true -Pcoverage=true
--profile --no-daemon cleanTest check assemble sonarqube
To honour the JVM settings for this build a new JVM will be forked. Please consider using
the daemon: https://docs.gradle.org/6.3/userguide/gradle_daemon.html.
Daemon will be stopped at the end of the build stopping after processing
> Task :buildSrc:compileKotlin NO-SOURCE
> Task :buildSrc:compileJava NO-SOURCE
> Task :buildSrc:compileGroovy NO-SOURCE
> Task :buildSrc:pluginDescriptors
> Task :buildSrc:processResources NO-SOURCE
> Task :buildSrc:classes UP-TO-DATE
> Task :buildSrc:inspectClassesForKotlinIC

> Task :buildSrc:jar
:jar: No valid plugin descriptors were found in META-INF/gradle-plugins

> Task :buildSrc:assemble
> Task :buildSrc:autostyleKotlinCheck NO-SOURCE
> Task :buildSrc:batchtest:pluginDescriptors
> Task :buildSrc:batchtest:processResources
> Task :buildSrc:autostyleKotlinGradleCheck
> Task :buildSrc:autostyleCheck
> Task :buildSrc:compileTestKotlin NO-SOURCE
> Task :buildSrc:compileTestJava NO-SOURCE
> Task :buildSrc:compileTestGroovy NO-SOURCE
> Task :buildSrc:processTestResources NO-SOURCE
> Task :buildSrc:testClasses UP-TO-DATE
> Task :buildSrc:validatePlugins
> Task :buildSrc:batchtest:autostyleKotlinCheck
> Task :buildSrc:batchtest:autostyleKotlinGradleCheck
> Task :buildSrc:batchtest:autostyleCheck
> Task :buildSrc:batchtest:processTestResources NO-SOURCE
> Task :buildSrc:batchtest:compileKotlin
> Task :buildSrc:batchtest:compileJava NO-SOURCE
> Task :buildSrc:batchtest:classes
> Task :buildSrc:batchtest:inspectClassesForKotlinIC
> Task :buildSrc:batchtest:jar
> Task :buildSrc:batchtest:assemble
> Task :buildSrc:batchtest:compileTestKotlin NO-SOURCE
> Task :buildSrc:batchtest:pluginUnderTestMetadata
> Task :buildSrc:pluginUnderTestMetadata
> Task :buildSrc:batchtest:compileTestJava NO-SOURCE
> Task :buildSrc:batchtest:testClasses UP-TO-DATE
> Task :buildSrc:test NO-SOURCE
> Task :buildSrc:check
> Task :buildSrc:build
> Task :buildSrc:batchtest:test NO-SOURCE
> Task :buildSrc:batchtest:validatePlugins
> Task :buildSrc:batchtest:check
> Task :buildSrc:batchtest:build
checksum-dependency elapsed time: 15089ms, configurations processed: 21 (add -PchecksumTimingsPrint
to print detailed timings)

See the profiling report at: file://<https://builds.apache.org/job/JMeter-trunk/ws/buildSrc/build/reports/profile/profile-2020-04-25-20-05-02.html>
A fine-grained performance profile is available: use the --scan option.

> Configure project :
Building JMeter 5.3-SNAPSHOT

> Configure project :src:dist-check
Certain tests will be skipped as they depend on external services and fail too often. Please
add -PenableFlaky to enable them: [batchHttp4ImplDigestAuth, batchHttp4ImplPreemptiveBasicAuthJava,
batchSlowCharsFeatureHttpClient4, batchSlowCharsFeatureJava, batchTCP_TESTS, batchTestKeepAlive,
batchTestRedirectionPolicies]

> Task :cleanTest UP-TO-DATE
> Task :src:components:cleanTest UP-TO-DATE
> Task :src:bshclient:cleanTest UP-TO-DATE
> Task :src:config:cleanTest UP-TO-DATE
> Task :src:core:cleanTest UP-TO-DATE
> Task :src:dist:cleanTest UP-TO-DATE
> Task :src:dist-check:cleanTest UP-TO-DATE
> Task :src:examples:cleanTest UP-TO-DATE
> Task :src:functions:cleanTest UP-TO-DATE
> Task :src:generator:cleanTest UP-TO-DATE
> Task :src:jorphan:cleanTest UP-TO-DATE
> Task :src:launcher:cleanTest UP-TO-DATE
> Task :src:licenses:cleanTest UP-TO-DATE
> Task :src:protocol:cleanTest UP-TO-DATE
> Task :src:testkit-wiremock:cleanTest UP-TO-DATE
> Task :src:release:cleanTest UP-TO-DATE
> Task :src:testkit:cleanTest UP-TO-DATE
> Task :src:protocol:bolt:cleanTest UP-TO-DATE
> Task :src:protocol:ftp:cleanTest UP-TO-DATE
> Task :src:protocol:http:cleanTest UP-TO-DATE
> Task :src:protocol:java:cleanTest UP-TO-DATE
> Task :src:protocol:jdbc:cleanTest UP-TO-DATE
> Task :src:protocol:jms:cleanTest UP-TO-DATE
> Task :src:protocol:junit:cleanTest UP-TO-DATE
> Task :src:protocol:junit-sample:cleanTest UP-TO-DATE
> Task :src:protocol:ldap:cleanTest UP-TO-DATE
> Task :src:protocol:mail:cleanTest UP-TO-DATE
> Task :src:protocol:mongodb:cleanTest UP-TO-DATE
> Task :src:protocol:native:cleanTest UP-TO-DATE
> Task :src:protocol:tcp:cleanTest UP-TO-DATE
> Task :src:bom:autostyleConfigsCheck NO-SOURCE
> Task :src:bshclient:autostyleConfigsCheck NO-SOURCE
> Task :src:config:autostyleConfigsCheck NO-SOURCE
> Task :src:dist:autostyleConfigsCheck NO-SOURCE
> Task :src:protocol:ftp:processResources NO-SOURCE
> Task :src:dist:autostyleJavaCheck NO-SOURCE
> Task :src:config:autostyleJavaCheck NO-SOURCE
> Task :src:protocol:jms:processResources NO-SOURCE
> Task :src:protocol:junit:processResources NO-SOURCE
> Task :src:protocol:ldap:processResources NO-SOURCE
> Task :src:protocol:junit:processTestResources NO-SOURCE
> Task :src:protocol:ftp:processTestResources NO-SOURCE
> Task :src:protocol:jms:processTestResources NO-SOURCE
> Task :src:protocol:ldap:processTestResources NO-SOURCE
> Task :src:protocol:native:processResources NO-SOURCE
> Task :src:protocol:tcp:processResources NO-SOURCE
> Task :src:generator:processResources NO-SOURCE
> Task :src:protocol:native:processTestResources NO-SOURCE
> Task :src:protocol:tcp:processTestResources NO-SOURCE
> Task :src:protocol:junit-sample:processResources NO-SOURCE
> Task :src:generator:autostyleConfigsCheck NO-SOURCE
> Task :src:protocol:autostyleConfigsCheck NO-SOURCE
> Task :src:dist-check:autostyleConfigsCheck NO-SOURCE
> Task :src:protocol:autostyleJavaCheck NO-SOURCE
> Task :src:protocol:mail:processResources
> Task :src:licenses:autostyleConfigsCheck NO-SOURCE
> Task :src:licenses:autostyleJavaCheck NO-SOURCE
> Task :src:protocol:mail:processTestResources NO-SOURCE
> Task :src:release:autostyleConfigsCheck NO-SOURCE
> Task :src:release:autostyleJavaCheck NO-SOURCE
> Task :src:functions:processResources
> Task :src:core:versionClass
> Task :src:functions:processTestResources
> Task :src:protocol:bolt:processResources
> Task :src:protocol:bolt:processTestResources NO-SOURCE
> Task :src:protocol:mongodb:processResources
> Task :src:autostyleConfigsCheck
> Task :src:protocol:bolt:autostyleConfigsCheck
> Task :src:functions:autostyleConfigsCheck
> Task :src:protocol:http:processResources
> Task :src:protocol:mongodb:processTestResources NO-SOURCE
> Task :src:protocol:ftp:autostyleConfigsCheck NO-SOURCE
> Task :src:examples:autostyleConfigsCheck
> Task :src:protocol:java:processResources
> Task :src:protocol:java:processTestResources NO-SOURCE
> Task :src:protocol:bolt:autostyleGroovyCheck
> Task :src:functions:autostyleGroovyCheck
> Task :src:protocol:java:autostyleConfigsCheck
> Task :src:dist-check:autostyleGroovyCheck
> Task :src:protocol:jdbc:processResources
> Task :src:protocol:jdbc:processTestResources NO-SOURCE
> Task :src:protocol:http:processTestResources
> Task :src:protocol:jdbc:autostyleConfigsCheck
> Task :src:protocol:jdbc:autostyleGroovyCheck
> Task :src:protocol:http:autostyleConfigsCheck
> Task :src:components:autostyleConfigsCheck
> Task :src:protocol:http:autostyleGroovyCheck
> Task :src:components:autostyleGroovyCheck
> Task :autostyleConfigsCheck
> Task :autostyleJavaCheck NO-SOURCE
> Task :src:core:processResources
> Task :src:core:processTestResources
> Task :src:core:autostyleConfigsCheck FAILED
> Task :src:testkit:compileJava
> Task :src:launcher:compileJava
> Task :src:bshclient:autostyleJavaCheck
> Task :src:generator:autostyleJavaCheck
> Task :src:examples:autostyleJavaCheck
> Task :src:protocol:bolt:autostyleJavaCheck
> Task :src:protocol:ftp:autostyleJavaCheck
> Task :src:dist-check:autostyleJavaCheck
> Task :src:protocol:jdbc:autostyleJavaCheck
> Task :src:protocol:java:autostyleJavaCheck
> Task :src:functions:autostyleJavaCheck
> Task :src:protocol:http:autostyleJavaCheck
> Task :src:components:autostyleJavaCheck

> Task :src:jorphan:compileJava
Note: Some input files use or override a deprecated API.
Note: Recompile with -Xlint:deprecation for details.
Note: <https://builds.apache.org/job/JMeter-trunk/ws/src/jorphan/src/main/java/org/apache/jorphan/gui/DynamicStyle.java>
uses unchecked or unsafe operations.
Note: Recompile with -Xlint:unchecked for details.

> Task :src:release:autostyleKotlinGradleCheck
> Task :src:config:autostyleKotlinGradleCheck
> Task :src:bom:autostyleKotlinGradleCheck
> Task :src:protocol:autostyleKotlinGradleCheck
> Task :src:autostyleKotlinGradleCheck
> Task :src:licenses:autostyleKotlinGradleCheck
> Task :src:dist:autostyleKotlinGradleCheck
> Task :autostyleKotlinGradleCheck
> Task :src:testkit-wiremock:compileJava
checksum-dependency elapsed time: 47083ms, configurations processed: 60
    SHA-512 computation time: 441ms (goes in parallel, it might exceed wall-clock time), files
processed: 10, processed: 3MiB, skipped: 492MiB
    PGP signature resolution time: 27634ms (wall-clock), resolution requests: 33, signatures
resolved: 118
    PGP key resolution time: 13255ms (wall-clock), resolution requests: 33, download time:
34067ms (goes in parallel, it might exceed wall-clock time), keys downloaded: 51
        PGP signature verification time: 14042ms (goes in parallel, it might exceed wall-clock
time), files processed: 352, processed: 488MiB, skipped: 4MiB

FAILURE: Build failed with an exception.

* What went wrong:
Execution failed for task ':src:core:autostyleConfigsCheck'.
> The following files have format violations:
    src/core/src/main/resources/org/apache/jmeter/gui/action/schematic.xsl
      @@ -552,7 +552,7 @@
       <xsl:template match="PreciseThroughputTimer">
       <li>
           <xsl:call-template name="header"/>
      -����(throughput:<xsl:value-of�select='stringProp[@name="throughput"]'/>�samples�per�\n
      +����(throughput:<xsl:value-of�select='stringProp[@name="throughput"]'/>�samples�per\n
           <xsl:value-of select='intProp[@name="throughputPeriod"]'/>sec for test duration:<xsl:value-of
select='longProp[@name="duration"]'/>)
           <xsl:call-template name="comment"/>
       </li>
  Run './gradlew autostyleApply' to fix the violations.

* Try:
Run with --stacktrace option to get the stack trace. Run with --info or --debug option to
get more log output. Run with --scan to get full insights.

* Get more help at https://help.gradle.org

Deprecated Gradle features were used in this build, making it incompatible with Gradle 7.0.
Use '--warning-mode all' to show the individual deprecation warnings.
See https://docs.gradle.org/6.3/userguide/command_line_interface.html#sec:command_line_warnings

BUILD FAILED in 2m 1s
81 actionable tasks: 51 executed, 30 up-to-date

See the profiling report at: file://<https://builds.apache.org/job/JMeter-trunk/ws/build/reports/profile/profile-2020-04-25-20-04-37.html>
A fine-grained performance profile is available: use the --scan option.
Build step 'Invoke Gradle script' changed build result to FAILURE
Build step 'Invoke Gradle script' marked build as failure
Xvfb stopping
Archiving artifacts
Recording test results
ERROR: Step ?Publish JUnit test result report? failed: No test report files were found. Configuration
error?

Mime
View raw message