jmeter-dev mailing list archives

Site index · List index
Message view « Date » · « Thread »
Top « Date » · « Thread »
From Apache Jenkins Server <jenk...@builds.apache.org>
Subject Build failed in Jenkins: JMeter-trunk #7717
Date Sat, 11 Apr 2020 17:05:08 GMT
See <https://builds.apache.org/job/JMeter-trunk/7717/display/redirect?page=changes>

Changes:

[sitnikov.vladimir] Revert "Bug 64340 - Workbench reappears in menu to add Non Test

[sitnikov.vladimir] Bug 64340 - Hide Workbench from Add context menu


------------------------------------------
[...truncated 185.65 KB...]
    Thread[/127.0.0.1:52258 to /127.0.0.1:41615 workers Thread 2,5,main], stackTrace:sun.nio.ch.FileDispatcherImpl#write0
    sun.nio.ch.SocketDispatcher#write at line:47
    sun.nio.ch.IOUtil#writeFromNativeBuffer at line:93
    sun.nio.ch.IOUtil#write at line:51
    sun.nio.ch.SocketChannelImpl#write at line:471
    org.gradle.internal.remote.internal.inet.SocketConnection$SocketOutputStream#writeWithNonBlockingRetry
at line:279
    org.gradle.internal.remote.internal.inet.SocketConnection$SocketOutputStream#writeBufferToChannel
at line:267
    org.gradle.internal.remote.internal.inet.SocketConnection$SocketOutputStream#flush at
line:261
    org.gradle.internal.remote.internal.inet.SocketConnection#flush at line:138
    org.gradle.internal.remote.internal.hub.MessageHub$ConnectionDispatch#run at line:335
    org.gradle.internal.concurrent.ExecutorPolicy$CatchAndRecordFailures#onExecute at line:64
    org.gradle.internal.concurrent.ManagedExecutorImpl$1#run at line:48
    java.util.concurrent.ThreadPoolExecutor#runWorker at line:1149
    java.util.concurrent.ThreadPoolExecutor$Worker#run at line:624
    org.gradle.internal.concurrent.ThreadFactoryImpl$ManagedThreadRunnable#run at line:56
    java.lang.Thread#run at line:748

    Thread[Test worker,5,main], stackTrace:java.lang.Object#wait
    java.util.concurrent.ForkJoinTask#externalInterruptibleAwaitDone at line:367
    java.util.concurrent.ForkJoinTask#get at line:1001
    org.junit.platform.engine.support.hierarchical.HierarchicalTestEngine#execute at line:51
    org.junit.platform.launcher.core.DefaultLauncher#execute at line:220
    org.junit.platform.launcher.core.DefaultLauncher#lambda$execute$6 at line:188
    org.junit.platform.launcher.core.DefaultLauncher$$Lambda$172/758238115#accept
    org.junit.platform.launcher.core.DefaultLauncher#withInterceptedStreams at line:202
    org.junit.platform.launcher.core.DefaultLauncher#execute at line:181
    org.junit.platform.launcher.core.DefaultLauncher#execute at line:128
    org.gradle.api.internal.tasks.testing.junitplatform.JUnitPlatformTestClassProcessor$CollectAllTestClassesExecutor#processAllTestClasses
at line:99
    org.gradle.api.internal.tasks.testing.junitplatform.JUnitPlatformTestClassProcessor$CollectAllTestClassesExecutor#access$000
at line:79
    org.gradle.api.internal.tasks.testing.junitplatform.JUnitPlatformTestClassProcessor#stop
at line:75
    org.gradle.api.internal.tasks.testing.SuiteTestClassProcessor#stop at line:61
    sun.reflect.NativeMethodAccessorImpl#invoke0
    sun.reflect.NativeMethodAccessorImpl#invoke at line:62
    sun.reflect.DelegatingMethodAccessorImpl#invoke at line:43
    java.lang.reflect.Method#invoke at line:498
    org.gradle.internal.dispatch.ReflectionDispatch#dispatch at line:36
    org.gradle.internal.dispatch.ReflectionDispatch#dispatch at line:24
    org.gradle.internal.dispatch.ContextClassLoaderDispatch#dispatch at line:33
    org.gradle.internal.dispatch.ProxyDispatchAdapter$DispatchingInvocationHandler#invoke
at line:94
    com.sun.proxy.$Proxy2#stop
    org.gradle.api.internal.tasks.testing.worker.TestWorker#stop at line:132
    sun.reflect.NativeMethodAccessorImpl#invoke0
    sun.reflect.NativeMethodAccessorImpl#invoke at line:62
    sun.reflect.DelegatingMethodAccessorImpl#invoke at line:43
    java.lang.reflect.Method#invoke at line:498
    org.gradle.internal.dispatch.ReflectionDispatch#dispatch at line:36
    org.gradle.internal.dispatch.ReflectionDispatch#dispatch at line:24
    org.gradle.internal.remote.internal.hub.MessageHubBackedObjectConnection$DispatchWrapper#dispatch
at line:182
    org.gradle.internal.remote.internal.hub.MessageHubBackedObjectConnection$DispatchWrapper#dispatch
at line:164
    org.gradle.internal.remote.internal.hub.MessageHub$Handler#run at line:412
    org.gradle.internal.concurrent.ExecutorPolicy$CatchAndRecordFailures#onExecute at line:64
    org.gradle.internal.concurrent.ManagedExecutorImpl$1#run at line:48
    java.util.concurrent.ThreadPoolExecutor#runWorker at line:1149
    java.util.concurrent.ThreadPoolExecutor$Worker#run at line:624
    org.gradle.internal.concurrent.ThreadFactoryImpl$ManagedThreadRunnable#run at line:56
    java.lang.Thread#run at line:748


PackageTest > checkI18n fr: messages STANDARD_OUT
    Ignoring missing junit_failure_default_code=0001 in org/apache/jmeter/resources/messages_fr.properties
    Ignoring missing aggregate_report_90=90% in org/apache/jmeter/resources/messages_fr.properties
    Ignoring missing junit_error_default_code=9999 in org/apache/jmeter/resources/messages_fr.properties
    Ignoring missing junit_success_default_code=1000 in org/apache/jmeter/resources/messages_fr.properties

> Task :src:functions:compileTestGroovy
> Task :src:functions:testClasses
> Task :src:functions:testJar UP-TO-DATE
> Task :src:functions:checkstyleMain
> Task :src:functions:checkstyleTest
> Task :src:protocol:http:compileJava
> Task :src:protocol:http:compileGroovy NO-SOURCE
> Task :src:protocol:http:classes
> Task :src:dist:compileJava NO-SOURCE
> Task :src:dist:classes UP-TO-DATE
> Task :src:dist:checkstyleMain NO-SOURCE
> Task :src:dist:jar UP-TO-DATE
> Task :src:protocol:http:jar UP-TO-DATE
> Task :src:dist-check:compileJava NO-SOURCE
> Task :src:dist-check:compileGroovy NO-SOURCE
> Task :src:dist-check:classes UP-TO-DATE
> Task :src:dist-check:checkstyleMain NO-SOURCE
> Task :src:dist-check:spotbugsMain NO-SOURCE
> Task :src:dist-check:jar UP-TO-DATE
> Task :src:dist-check:assemble UP-TO-DATE
> Task :src:core:check
> Task :src:core:assemble

> Task :src:protocol:http:compileTestJava
Note: Some input files use or override a deprecated API.
Note: Recompile with -Xlint:deprecation for details.

> Task :src:protocol:http:compileTestGroovy
> Task :src:protocol:http:testClasses
> Task :src:protocol:http:testJar UP-TO-DATE

> Task :src:licenses:gatherBinaryLicenses
License overrides were declared but unused for the following dependencies: [com.thoughtworks.xstream:xstream:1.4.11,
net.sf.saxon:Saxon-HE:9.9.1-5, org.exparity:hamcrest-date:2.0.4]

> Task :src:licenses:renderLicenseForBinary UP-TO-DATE
> Task :src:licenses:renderLicenseForBinaryCopySpec
> Task :src:protocol:http:checkstyleMain
> Task :src:licenses:binLicenseDir UP-TO-DATE
> Task :src:licenses:assemble UP-TO-DATE
> Task :src:protocol:http:checkstyleTest
> Task :src:dist-check:compileTestJava
> Task :src:dist-check:compileTestGroovy
> Task :src:dist-check:testClasses
> Task :src:dist-check:checkstyleTest
> Task :src:examples:spotbugsMain
> Task :src:examples:spotbugsTest NO-SOURCE
> Task :src:examples:test NO-SOURCE
> Task :src:examples:check
> Task :src:generator:spotbugsMain
> Task :src:generator:spotbugsTest NO-SOURCE
> Task :src:generator:test NO-SOURCE
> Task :src:generator:check

> Task :src:functions:spotbugsMain
SpotBugs rule violations were found. See the report at: file://<https://builds.apache.org/job/JMeter-trunk/ws/src/functions/build/reports/spotbugs/main.xml>

> Task :src:dist-check:spotbugsTest
SpotBugs rule violations were found. See the report at: file://<https://builds.apache.org/job/JMeter-trunk/ws/src/dist-check/build/reports/spotbugs/test.xml>

> Task :src:dist:javadocAggregate
> Task :src:protocol:http:spotbugsMain

> Task :src:functions:spotbugsTest
SpotBugs rule violations were found. See the report at: file://<https://builds.apache.org/job/JMeter-trunk/ws/src/functions/build/reports/spotbugs/test.xml>

> Task :src:functions:test

Gradle Test Executor 52 STANDARD_OUT
    Setting JMeterHome: <https://builds.apache.org/job/JMeter-trunk/ws/src/functions/../../.>
    Initializing Properties: ../.././bin/jmeter.properties
    JMeterVersion=5.3-SNAPSHOT 7897df5
    java.version=1.8.0_241
    java.vm.name=Java HotSpot(TM) 64-Bit Server VM
    java.vendor=Oracle Corporation
    java.home=/usr/local/asfpackages/java/jdk1.8.0_241/jre
    file.encoding=ISO-8859-1
    default encoding=ISO-8859-1
    user.home=/home/jenkins
    user.dir=<https://builds.apache.org/job/JMeter-trunk/ws/src/functions>
    user.language=en
    user.region=null
    user.country=US
    user.variant=
    Locale=en_US
    java.class.version=52.0
    java.awt.headless=null
    os.name=Linux
    os.version=4.15.0-76-generic
    os.arch=amd64

> Task :src:protocol:http:spotbugsMain
SpotBugs rule violations were found. See the report at: file://<https://builds.apache.org/job/JMeter-trunk/ws/src/protocol/http/build/reports/spotbugs/main.xml>

> Task :src:functions:check
> Task :src:functions:assemble UP-TO-DATE

> Task :src:protocol:http:spotbugsTest
SpotBugs rule violations were found. See the report at: file://<https://builds.apache.org/job/JMeter-trunk/ws/src/protocol/http/build/reports/spotbugs/test.xml>

> Task :src:protocol:http:test

Gradle Test Executor 54 STANDARD_OUT
    Setting JMeterHome: <https://builds.apache.org/job/JMeter-trunk/ws/src/protocol/http/../../../.>
    Initializing Properties: ../../.././bin/jmeter.properties
    JMeterVersion=5.3-SNAPSHOT 7897df5
    java.version=1.8.0_241
    java.vm.name=Java HotSpot(TM) 64-Bit Server VM
    java.vendor=Oracle Corporation
    java.home=/usr/local/asfpackages/java/jdk1.8.0_241/jre
    file.encoding=ISO-8859-1
    default encoding=ISO-8859-1
    user.home=/home/jenkins
    user.dir=<https://builds.apache.org/job/JMeter-trunk/ws/src/protocol/http>
    user.language=en
    user.region=null
    user.country=US
    user.variant=
    Locale=en_US
    java.class.version=52.0
    java.awt.headless=null
    os.name=Linux
    os.version=4.15.0-76-generic
    os.arch=amd64

> Task :src:protocol:http:check
> Task :src:protocol:http:assemble UP-TO-DATE
> Task :src:dist:compileTestJava NO-SOURCE
> Task :src:dist:testClasses UP-TO-DATE
> Task :src:dist:checkstyleTest NO-SOURCE
> Task :src:dist:spotbugsMain NO-SOURCE
> Task :src:dist:spotbugsTest NO-SOURCE
> Task :src:dist:test NO-SOURCE
> Task :src:dist:check
> Task :src:dist:populateLibs
> Task :src:dist:copyBinLibs UP-TO-DATE
> Task :src:dist:copyLibs
> Task :src:dist:createDist
> Task :src:dist-check:copyExtraTestLibs
> Task :src:dist-check:batchBUG_62847
> Task :src:dist:distTar
> Task :src:dist:distTarSha512
> Task :src:dist-check:batchBatchTestLocal
> Task :src:dist-check:batchBug50898
> Task :src:dist:distZip
> Task :src:dist-check:batchBug52968
> Task :src:dist:distZipSha512
> Task :src:dist:previewSite UP-TO-DATE
> Task :src:dist:assemble
> Task :src:dist-check:batchBug54685
> Task :src:dist-check:batchBug55375
> Task :src:dist-check:batchBug56243
> Task :src:dist-check:batchBug56811
> Task :src:dist-check:batchBug62239
> Task :src:dist-check:batchFTP_TESTS
> Task :src:dist-check:batchHTMLParserTestFile_2
> Task :src:dist-check:batchHttp4ImplDigestAuth SKIPPED
> Task :src:dist-check:batchHttp4ImplPreemptiveBasicAuth FAILED
checksum-dependency elapsed time: 17475ms, configurations processed: 353 (add -PchecksumTimingsPrint
to print detailed timings)

FAILURE: Build failed with an exception.

* What went wrong:
Execution failed for task ':src:dist-check:batchHttp4ImplPreemptiveBasicAuth'.
> Failures detected while testing <https://builds.apache.org/job/JMeter-trunk/ws/bin/testfiles/Http4ImplPreemptiveBasicAuth.jmx>:
[unexpected output Http4ImplPreemptiveBasicAuth.csv, unexpected output Http4ImplPreemptiveBasicAuth.xml]

* Try:
Run with --stacktrace option to get the stack trace. Run with --info or --debug option to
get more log output. Run with --scan to get full insights.

* Get more help at https://help.gradle.org

Deprecated Gradle features were used in this build, making it incompatible with Gradle 7.0.
Use '--warning-mode all' to show the individual deprecation warnings.
See https://docs.gradle.org/6.3/userguide/command_line_interface.html#sec:command_line_warnings

BUILD FAILED in 6m 35s
343 actionable tasks: 223 executed, 120 up-to-date

See the profiling report at: file://<https://builds.apache.org/job/JMeter-trunk/ws/build/reports/profile/profile-2020-04-11-16-58-16.html>
A fine-grained performance profile is available: use the --scan option.
Build step 'Invoke Gradle script' changed build result to FAILURE
Build step 'Invoke Gradle script' marked build as failure
Xvfb stopping
Archiving artifacts
[Fast Archiver] Compressed 161.19 MB of artifacts by 80.3% relative to #7715
Recording test results

Mime
View raw message