jmeter-dev mailing list archives

Site index · List index
Message view « Date » · « Thread »
Top « Date » · « Thread »
From Apache Jenkins Server <jenk...@builds.apache.org>
Subject Build failed in Jenkins: JMeter-trunk #7766
Date Sat, 30 May 2020 14:11:03 GMT
See <https://builds.apache.org/job/JMeter-trunk/7766/display/redirect?page=changes>

Changes:

[felix.schumacher] Remove deprecated sudo setting.


------------------------------------------
[...truncated 50.46 KB...]
> Task :src:testkit-wiremock:autostyleJavaCheck
> Task :src:protocol:mongodb:autostyleJavaCheck
> Task :src:protocol:mongodb:autostyleKotlinGradleCheck NO-SOURCE
> Task :src:protocol:mongodb:autostyleMarkdownCheck NO-SOURCE
> Task :src:protocol:mongodb:autostyleCheck
> Task :src:protocol:native:autostyleConfigsCheck NO-SOURCE
> Task :src:protocol:ldap:autostyleJavaCheck
> Task :src:protocol:native:autostyleJavaCheck
> Task :src:protocol:ldap:autostyleKotlinGradleCheck NO-SOURCE
> Task :src:protocol:native:autostyleKotlinGradleCheck NO-SOURCE
> Task :src:protocol:ldap:autostyleMarkdownCheck NO-SOURCE
> Task :src:protocol:native:autostyleMarkdownCheck NO-SOURCE
> Task :src:protocol:ldap:autostyleCheck
> Task :src:protocol:native:autostyleCheck
> Task :src:protocol:tcp:autostyleConfigsCheck NO-SOURCE
> Task :src:protocol:mail:autostyleJavaCheck
> Task :src:protocol:mail:autostyleKotlinGradleCheck NO-SOURCE
> Task :src:protocol:mail:autostyleMarkdownCheck NO-SOURCE
> Task :src:protocol:mail:autostyleCheck
> Task :src:protocol:jms:autostyleJavaCheck
> Task :src:protocol:jms:autostyleKotlinGradleCheck NO-SOURCE
> Task :src:protocol:jms:autostyleMarkdownCheck NO-SOURCE
> Task :src:protocol:jms:autostyleCheck
> Task :src:jorphan:compileTestJava UP-TO-DATE
> Task :src:protocol:tcp:autostyleJavaCheck
> Task :src:protocol:tcp:autostyleKotlinGradleCheck NO-SOURCE
> Task :src:protocol:tcp:autostyleMarkdownCheck NO-SOURCE
> Task :src:protocol:tcp:autostyleCheck
> Task :src:functions:autostyleJavaCheck
> Task :src:generator:autostyleKotlinGradleCheck
> Task :src:bshclient:autostyleKotlinGradleCheck
> Task :src:generator:autostyleMarkdownCheck NO-SOURCE
> Task :src:generator:autostyleCheck
> Task :src:testkit:autostyleKotlinGradleCheck
> Task :src:examples:autostyleKotlinGradleCheck
> Task :src:testkit-wiremock:autostyleKotlinGradleCheck
> Task :src:bshclient:autostyleMarkdownCheck NO-SOURCE
> Task :src:bshclient:autostyleCheck
> Task :src:testkit:autostyleMarkdownCheck NO-SOURCE
> Task :src:testkit-wiremock:autostyleMarkdownCheck NO-SOURCE
> Task :src:testkit:autostyleCheck
> Task :src:examples:autostyleMarkdownCheck NO-SOURCE
> Task :src:examples:autostyleCheck
> Task :src:testkit-wiremock:autostyleCheck
> Task :src:generator:processTestResources NO-SOURCE
> Task :src:bshclient:compileJava UP-TO-DATE
> Task :src:bshclient:processResources NO-SOURCE
> Task :src:examples:processResources UP-TO-DATE
> Task :src:bshclient:classes UP-TO-DATE
> Task :src:examples:processTestResources NO-SOURCE
> Task :src:launcher:autostyleKotlinGradleCheck
> Task :src:launcher:autostyleMarkdownCheck NO-SOURCE
> Task :src:launcher:autostyleCheck
> Task :src:functions:autostyleKotlinGradleCheck
> Task :src:functions:autostyleMarkdownCheck NO-SOURCE
> Task :src:functions:autostyleCheck
> Task :src:release:autostyleKotlinGradleCheck
> Task :src:config:autostyleKotlinGradleCheck
> Task :src:release:autostyleMarkdownCheck NO-SOURCE
> Task :src:config:autostyleMarkdownCheck NO-SOURCE
> Task :src:release:autostyleCheck
> Task :src:config:autostyleCheck
> Task :src:release:compileJava NO-SOURCE
> Task :src:release:processResources NO-SOURCE
> Task :src:release:classes UP-TO-DATE
> Task :src:config:compileJava NO-SOURCE
> Task :src:config:processResources NO-SOURCE
> Task :src:release:checkstyleMain NO-SOURCE
> Task :src:config:classes UP-TO-DATE
> Task :src:release:compileTestJava NO-SOURCE
> Task :src:config:checkstyleMain NO-SOURCE
> Task :src:config:compileTestJava NO-SOURCE
> Task :src:release:processTestResources NO-SOURCE
> Task :src:config:processTestResources NO-SOURCE
> Task :src:release:testClasses UP-TO-DATE
> Task :src:config:testClasses UP-TO-DATE
> Task :src:config:checkstyleTest NO-SOURCE
> Task :src:config:spotbugsMain NO-SOURCE
> Task :src:config:spotbugsTest NO-SOURCE
> Task :src:release:checkstyleTest NO-SOURCE
> Task :src:config:test NO-SOURCE
> Task :src:release:spotbugsMain NO-SOURCE
> Task :src:release:spotbugsTest NO-SOURCE
> Task :src:release:test NO-SOURCE
> Task :src:release:check
> Task :src:config:check
> Task :src:protocol:autostyleKotlinGradleCheck
> Task :src:protocol:autostyleMarkdownCheck NO-SOURCE
> Task :src:protocol:autostyleCheck
> Task :src:bom:autostyleKotlinGradleCheck
> Task :src:protocol:compileJava NO-SOURCE
> Task :src:bom:autostyleMarkdownCheck NO-SOURCE
> Task :src:bom:autostyleCheck
> Task :src:protocol:processResources NO-SOURCE
> Task :src:protocol:classes UP-TO-DATE
> Task :src:bom:check
> Task :src:bom:assemble UP-TO-DATE
> Task :src:protocol:checkstyleMain NO-SOURCE
> Task :src:autostyleKotlinGradleCheck
> Task :src:protocol:compileTestJava NO-SOURCE
> Task :src:autostyleMarkdownCheck NO-SOURCE
> Task :src:protocol:processTestResources NO-SOURCE
> Task :src:protocol:testClasses UP-TO-DATE
> Task :src:autostyleCheck
> Task :src:check
> Task :src:protocol:checkstyleTest NO-SOURCE
> Task :src:assemble UP-TO-DATE
> Task :src:protocol:spotbugsMain NO-SOURCE
> Task :src:protocol:spotbugsTest NO-SOURCE
> Task :src:protocol:test NO-SOURCE
> Task :src:protocol:check
> Task :src:licenses:autostyleKotlinGradleCheck
> Task :src:licenses:autostyleMarkdownCheck NO-SOURCE
> Task :src:licenses:autostyleCheck
> Task :src:dist-check:autostyleKotlinGradleCheck
> Task :src:licenses:compileJava NO-SOURCE
> Task :src:dist-check:autostyleMarkdownCheck NO-SOURCE
> Task :src:licenses:processResources NO-SOURCE
> Task :src:dist-check:autostyleCheck
> Task :src:licenses:classes UP-TO-DATE
> Task :src:licenses:checkstyleMain NO-SOURCE
> Task :src:dist-check:processResources NO-SOURCE
> Task :src:licenses:compileTestJava NO-SOURCE
> Task :src:licenses:processTestResources NO-SOURCE
> Task :src:licenses:testClasses UP-TO-DATE
> Task :src:protocol:jar UP-TO-DATE
> Task :src:protocol:assemble UP-TO-DATE
> Task :src:dist-check:processTestResources UP-TO-DATE
> Task :src:licenses:checkstyleTest NO-SOURCE
> Task :src:licenses:spotbugsMain NO-SOURCE
> Task :src:licenses:spotbugsTest NO-SOURCE
> Task :src:licenses:test NO-SOURCE
> Task :src:licenses:check
> Task :src:release:jar UP-TO-DATE
> Task :src:release:assemble UP-TO-DATE
> Task :src:dist:autostyleKotlinGradleCheck
> Task :autostyleKotlinGradleCheck
> Task :src:jorphan:compileTestGroovy UP-TO-DATE
> Task :src:dist:autostyleMarkdownCheck NO-SOURCE
> Task :src:dist:autostyleCheck
> Task :src:jorphan:processTestResources NO-SOURCE
> Task :src:jorphan:testClasses UP-TO-DATE
> Task :src:dist:processResources NO-SOURCE
> Task :src:dist:processTestResources NO-SOURCE
> Task :src:dist:preparePropertiesbuildPrintableDoc UP-TO-DATE
> Task :src:licenses:gatherSourceLicenses UP-TO-DATE
> Task :src:licenses:renderLicenseForSource UP-TO-DATE
> Task :src:jorphan:testJar UP-TO-DATE
> Task :src:jorphan:autostyleConfigsCheck NO-SOURCE
> Task :src:jorphan:autostyleGroovyCheck
> Task :src:licenses:renderLicenseForSourceCopySpec
> Task :src:licenses:srcLicenseDir UP-TO-DATE
> Task :src:jorphan:autostyleJavaCheck
> Task :src:testkit:checkstyleMain UP-TO-DATE
> Task :src:launcher:checkstyleMain UP-TO-DATE
> Task :src:testkit-wiremock:checkstyleMain UP-TO-DATE
> Task :src:bshclient:checkstyleMain UP-TO-DATE
> Task :src:config:jar UP-TO-DATE
> Task :src:config:assemble UP-TO-DATE
> Task :src:licenses:jar UP-TO-DATE
> Task :src:testkit:compileTestJava NO-SOURCE
> Task :src:testkit-wiremock:compileTestJava NO-SOURCE
> Task :src:bshclient:compileTestJava NO-SOURCE
> Task :src:launcher:compileTestJava NO-SOURCE
> Task :src:testkit:processTestResources NO-SOURCE
> Task :src:launcher:processTestResources NO-SOURCE
> Task :src:bshclient:processTestResources NO-SOURCE
> Task :src:bshclient:testClasses UP-TO-DATE
> Task :src:testkit:testClasses UP-TO-DATE
> Task :src:testkit-wiremock:processTestResources NO-SOURCE
> Task :src:bshclient:checkstyleTest NO-SOURCE
> Task :src:testkit:checkstyleTest NO-SOURCE
> Task :src:testkit-wiremock:testClasses UP-TO-DATE
> Task :src:testkit:checkstyleTestFixtures NO-SOURCE
> Task :src:launcher:testClasses UP-TO-DATE
> Task :src:launcher:checkstyleTest NO-SOURCE
> Task :src:testkit-wiremock:checkstyleTest NO-SOURCE
> Task :src:jorphan:autostyleKotlinGradleCheck
> Task :autostyleMarkdownCheck
> Task :autostyleCheck
> Task :src:testkit-wiremock:checkstyleTestFixtures NO-SOURCE
> Task :compileJava NO-SOURCE
> Task :src:jorphan:autostyleMarkdownCheck NO-SOURCE
> Task :src:jorphan:autostyleCheck
> Task :processResources NO-SOURCE
> Task :classes UP-TO-DATE
> Task :checkstyleMain NO-SOURCE
> Task :compileTestJava NO-SOURCE
> Task :processTestResources NO-SOURCE
> Task :testClasses UP-TO-DATE
> Task :checkstyleTest NO-SOURCE
> Task :src:jorphan:checkstyleMain UP-TO-DATE
> Task :src:jorphan:checkstyleTest UP-TO-DATE
> Task :src:dist-check:populateLibs
> Task :src:protocol:http:autostyleJavaCheck FAILED
> Task :src:launcher:spotbugsMain UP-TO-DATE
> Task :src:testkit-wiremock:spotbugsMain UP-TO-DATE
> Task :src:bshclient:spotbugsMain UP-TO-DATE
> Task :src:testkit:spotbugsMain UP-TO-DATE
> Task :src:jorphan:spotbugsMain UP-TO-DATE
> Task :gitProps
> Task :src:components:autostyleJavaCheck

> Task :src:dist:buildPrintableDoc

Error: The element type "li" must be terminated by the matching end-tag "</li>".
       Line: 174 Column: 3


> Task :src:core:autostyleJavaCheck
checksum-dependency elapsed time: 36288ms, configurations processed: 128
    SHA-512 computation time: 761ms (goes in parallel, it might exceed wall-clock time), files
processed: 39, processed: 6MiB, skipped: 1138MiB
    PGP signature resolution time: 4313ms (wall-clock), resolution requests: 76, signatures
resolved: 176
    PGP key resolution time: 20877ms (wall-clock), resolution requests: 76, download time:
0ms (goes in parallel, it might exceed wall-clock time), keys downloaded: 0
        PGP signature verification time: 53952ms (goes in parallel, it might exceed wall-clock
time), files processed: 486, processed: 594MiB, skipped: 543MiB

FAILURE: Build failed with an exception.

* What went wrong:
Execution failed for task ':src:protocol:http:autostyleJavaCheck'.
> The following files have format violations:
    src/protocol/http/src/test/java/org/apache/jmeter/gui/action/ParseCurlCommandActionTest.java
      @@ -517,4 +517,3 @@
               return method;
           }
       }
      -
  Run './gradlew autostyleApply' to fix the violations.

* Try:
Run with --stacktrace option to get the stack trace. Run with --info or --debug option to
get more log output. Run with --scan to get full insights.

* Get more help at https://help.gradle.org

Deprecated Gradle features were used in this build, making it incompatible with Gradle 7.0.
Use '--warning-mode all' to show the individual deprecation warnings.
See https://docs.gradle.org/6.3/userguide/command_line_interface.html#sec:command_line_warnings

BUILD FAILED in 46s
144 actionable tasks: 82 executed, 62 up-to-date

See the profiling report at: file://<https://builds.apache.org/job/JMeter-trunk/ws/build/reports/profile/profile-2020-05-30-14-10-20.html>
A fine-grained performance profile is available: use the --scan option.
Build step 'Invoke Gradle script' changed build result to FAILURE
Build step 'Invoke Gradle script' marked build as failure
Xvfb stopping
Archiving artifacts
Recording test results
ERROR: Step ?Publish JUnit test result report? failed: No test report files were found. Configuration
error?

Mime
View raw message