jmeter-dev mailing list archives

Site index · List index
Message view « Date » · « Thread »
Top « Date » · « Thread »
From Apache Jenkins Server <jenk...@builds.apache.org>
Subject Build failed in Jenkins: JMeter Windows #1687
Date Sat, 16 May 2020 17:09:51 GMT
See <https://builds.apache.org/job/JMeter%20Windows/1687/display/redirect?page=changes>

Changes:

[pmouawad] Update screenshot

[Milamber] Add the 5.3 release


------------------------------------------
[...truncated 229.81 KB...]
Waiting for possible Shutdown/StopTestNow/HeapDump/ThreadDump message on port 4445
summary =      2 in 00:00:02 =    1.1/s Avg:   527 Min:   409 Max:   645 Err:     0 (0.00%)
Tidying up ...    @ Sat May 16 10:07:48 PDT 2020 (1589648868724)
... end of run
No errors present in the logfile F:\jenkins\jenkins-slave\workspace\JMeter Windows\bin\ResponseDecompression.log
(the file is empty)
[server] Created remote object: UnicastServerRef2 [liveRef: [endpoint:[jenkins-win-he-de-5.apache.org:55896,SSLRMIServerSocketFactory(host=jenkins-win-he-de-5.apache.org/176.9.73.62,
keyStoreLocation=rmi_keystore.jks, type=JKS, trustStoreLocation=rmi_keystore.jks, type=JKS,
alias=rmi),SSLRMIClientSocketFactory(keyStoreLocation=rmi_keystore.jks, type=JKS, trustStoreLocation=rmi_keystore.jks,
type=JKS, alias=rmi)](local),objID:[466c78a0:1721e74cb59:-7fff, -1982180345360986154]]]

> Task :src:dist-check:batchServerBatchTestLocal
Creating summariser <summary>
Created the tree successfully using F:\jenkins\jenkins-slave\workspace\JMeter Windows\bin\testfiles\BatchTestLocal.jmx
Configuring remote engine: jenkins-win-he-de-5.apache.org:55889
Starting distributed test with remote engines: [jenkins-win-he-de-5.apache.org:55889] @ Sat
May 16 10:07:53 PDT 2020 (1589648873947)

[server] Starting the test on host jenkins-win-he-de-5.apache.org:55889 @ Sat May 16 10:07:56
PDT 2020 (1589648876465)

> Task :src:dist-check:batchServerBatchTestLocal
Remote engines have been started:[jenkins-win-he-de-5.apache.org:55889]
Waiting for possible Shutdown/StopTestNow/HeapDump/ThreadDump message on port 4445
summary +     55 in 00:00:05 =   10.4/s Avg:     3 Min:     0 Max:     7 Err:     8 (14.55%)
Active: 1 Started: 3 Finished: 2
summary +     77 in 00:00:02 =   46.2/s Avg:     5 Min:     0 Max:   108 Err:     8 (10.39%)
Active: 0 Started: 11 Finished: 11
summary =    132 in 00:00:07 =   19.0/s Avg:     4 Min:     0 Max:   108 Err:    16 (12.12%)
Tidying up remote @ Sat May 16 10:08:03 PDT 2020 (1589648883932)

[server] Finished the test on host jenkins-win-he-de-5.apache.org:55889 @ Sat May 16 10:08:03
PDT 2020 (1589648883932) - exit requested.

> Task :src:dist:compileTestJava NO-SOURCE
> Task :src:dist:testClasses UP-TO-DATE
> Task :src:dist:checkstyleTest NO-SOURCE
> Task :src:dist:spotbugsTest SKIPPED
> Task :src:dist:test NO-SOURCE
> Task :src:dist:check

> Task :src:dist-check:batchServerBatchTestLocal
... end of run
No errors present in the logfile F:\jenkins\jenkins-slave\workspace\JMeter Windows\bin\BatchTestLocal.log
(the file is empty)
No errors present in the logfile F:\jenkins\jenkins-slave\workspace\JMeter Windows\bin\BatchTestLocalServer.log
(the file is empty)

> Task :src:dist-check:batchSlowCharsFeatureHttpClient4 SKIPPED
> Task :src:dist-check:batchSlowCharsFeatureJava SKIPPED
> Task :src:dist-check:batchTCP_TESTS SKIPPED

> Task :src:dist-check:batchTEST_HTTPHttpClient4
Creating summariser <summary>
Created the tree successfully using F:\jenkins\jenkins-slave\workspace\JMeter Windows\bin\testfiles\TEST_HTTP.jmx
Starting standalone test @ Sat May 16 10:08:10 PDT 2020 (1589648890904)
Waiting for possible Shutdown/StopTestNow/HeapDump/ThreadDump message on port 4445
summary =     22 in 00:00:02 =   10.1/s Avg:    68 Min:     2 Max:   973 Err:     0 (0.00%)
Tidying up ...    @ Sat May 16 10:08:13 PDT 2020 (1589648893447)
... end of run
No errors present in the logfile F:\jenkins\jenkins-slave\workspace\JMeter Windows\bin\TEST_HTTP.log
(the file is empty)

> Task :src:dist-check:batchTEST_HTTPJava
Creating summariser <summary>
Created the tree successfully using F:\jenkins\jenkins-slave\workspace\JMeter Windows\bin\testfiles\TEST_HTTP.jmx
Starting standalone test @ Sat May 16 10:08:16 PDT 2020 (1589648896572)
Waiting for possible Shutdown/StopTestNow/HeapDump/ThreadDump message on port 4445

> Task :src:dist:distTar
> Task :src:dist:distTarSha512
> Task :src:dist:distTarSourceSha512

> Task :src:dist-check:batchTEST_HTTPJava
summary =     20 in 00:00:02 =    9.7/s Avg:    71 Min:     1 Max:   952 Err:     0 (0.00%)
Tidying up ...    @ Sat May 16 10:08:18 PDT 2020 (1589648898970)
... end of run
WARNING: the task was configured to ignore errors in the output log
Logfile contents (errors during the test, see F:\jenkins\jenkins-slave\workspace\JMeter Windows\bin\TEST_HTTP.log):
2020-05-16 10:08:18,604 ERROR o.a.j.p.h.s.HTTPJavaImpl: readResponse: java.net.ProtocolException:
Server redirected too many  times (20)
2020-05-16 10:08:18,608 ERROR o.a.j.p.h.s.HTTPJavaImpl: Cause: java.net.ProtocolException:
Server redirected too many  times (20)
2020-05-16 10:08:18,609 ERROR o.a.j.p.h.c.HttpMirrorThread: Invalid request received:''

> Task :src:dist-check:batchTEST_HTTPS
Creating summariser <summary>
Created the tree successfully using F:\jenkins\jenkins-slave\workspace\JMeter Windows\bin\testfiles\TEST_HTTPS.jmx
Starting standalone test @ Sat May 16 10:08:21 PDT 2020 (1589648901563)
Waiting for possible Shutdown/StopTestNow/HeapDump/ThreadDump message on port 4445
summary =      2 in 00:00:02 =    1.0/s Avg:   862 Min:   171 Max:  1553 Err:     0 (0.00%)
Tidying up ...    @ Sat May 16 10:08:23 PDT 2020 (1589648903930)
... end of run
No errors present in the logfile F:\jenkins\jenkins-slave\workspace\JMeter Windows\bin\TEST_HTTPS.log
(the file is empty)

> Task :src:dist:distZip
> Task :src:dist:distZipSha512

> Task :src:dist-check:batchTestCookieManager
Creating summariser <summary>
Created the tree successfully using F:\jenkins\jenkins-slave\workspace\JMeter Windows\bin\testfiles\TestCookieManager.jmx
Starting standalone test @ Sat May 16 10:08:25 PDT 2020 (1589648905726)
Waiting for possible Shutdown/StopTestNow/HeapDump/ThreadDump message on port 4445
summary +      4 in 00:00:03 =    1.2/s Avg:   784 Min:     7 Max:  2016 Err:     0 (0.00%)
Active: 1 Started: 2 Finished: 1

> Task :src:dist:distZipSource
> Task :src:dist:distZipSourceSha512
> Task :src:dist:processSiteXslt

> Task :src:dist-check:batchTestCookieManager
summary +      6 in 00:00:04 =    1.4/s Avg:   722 Min:     2 Max:  2002 Err:     0 (0.00%)
Active: 0 Started: 1 Finished: 1
summary =     10 in 00:00:08 =    1.3/s Avg:   747 Min:     2 Max:  2016 Err:     0 (0.00%)
Tidying up ...    @ Sat May 16 10:08:34 PDT 2020 (1589648914374)
... end of run
No errors present in the logfile F:\jenkins\jenkins-slave\workspace\JMeter Windows\bin\TestCookieManager.log
(the file is empty)

> Task :src:dist-check:batchTestHeaderManagerHttpClient4
Creating summariser <summary>
Created the tree successfully using F:\jenkins\jenkins-slave\workspace\JMeter Windows\bin\testfiles\TestHeaderManager.jmx
Starting standalone test @ Sat May 16 10:08:37 PDT 2020 (1589648917214)
Waiting for possible Shutdown/StopTestNow/HeapDump/ThreadDump message on port 4445
summary =      3 in 00:00:07 =    0.5/s Avg:  2018 Min:  2003 Max:  2048 Err:     0 (0.00%)
Tidying up ...    @ Sat May 16 10:08:44 PDT 2020 (1589648924230)
... end of run
No errors present in the logfile F:\jenkins\jenkins-slave\workspace\JMeter Windows\bin\TestHeaderManager.log
(the file is empty)

> Task :src:dist-check:batchTestHeaderManagerJava
Creating summariser <summary>
Created the tree successfully using F:\jenkins\jenkins-slave\workspace\JMeter Windows\bin\testfiles\TestHeaderManager.jmx
Starting standalone test @ Sat May 16 10:08:45 PDT 2020 (1589648925984)
Waiting for possible Shutdown/StopTestNow/HeapDump/ThreadDump message on port 4445
summary =      3 in 00:00:13 =    0.2/s Avg:  1005 Min:  1001 Max:  1014 Err:     0 (0.00%)
Tidying up ...    @ Sat May 16 10:08:59 PDT 2020 (1589648939508)
... end of run
No errors present in the logfile F:\jenkins\jenkins-slave\workspace\JMeter Windows\bin\TestHeaderManager.log
(the file is empty)

> Task :src:dist-check:batchTestKeepAlive SKIPPED
> Task :src:dist-check:batchTestRedirectionPolicies SKIPPED

> Task :src:dist-check:batchTestResultStatusAction
Creating summariser <summary>
Created the tree successfully using F:\jenkins\jenkins-slave\workspace\JMeter Windows\bin\testfiles\TestResultStatusAction.jmx
Starting standalone test @ Sat May 16 10:09:01 PDT 2020 (1589648941326)
Waiting for possible Shutdown/StopTestNow/HeapDump/ThreadDump message on port 4445
summary +      1 in 00:00:01 =    0.9/s Avg:     1 Min:     1 Max:     1 Err:     0 (0.00%)
Active: 1 Started: 1 Finished: 0

> Task :src:dist:previewSite

> Task :src:dist-check:batchTestResultStatusAction
summary +    134 in 00:00:01 =  147.6/s Avg:     1 Min:     0 Max:   190 Err:    18 (13.43%)
Active: 0 Started: 4 Finished: 4
summary =    135 in 00:00:02 =   67.0/s Avg:     1 Min:     0 Max:   190 Err:    18 (13.33%)
Tidying up ...    @ Sat May 16 10:09:04 PDT 2020 (1589648944186)
... end of run
No errors present in the logfile F:\jenkins\jenkins-slave\workspace\JMeter Windows\bin\TestResultStatusAction.log
(the file is empty)

> Task :src:dist-check:batchTestSchedulerWithTimer
Creating summariser <summary>
Created the tree successfully using F:\jenkins\jenkins-slave\workspace\JMeter Windows\bin\testfiles\TestSchedulerWithTimer.jmx
Starting standalone test @ Sat May 16 10:09:06 PDT 2020 (1589648946187)
Waiting for possible Shutdown/StopTestNow/HeapDump/ThreadDump message on port 4445

> Task :src:dist:assemble

> Task :src:dist-check:batchTestSchedulerWithTimer
summary =      5 in 00:00:06 =    0.8/s Avg:   274 Min:     1 Max:   867 Err:     0 (0.00%)
Tidying up ...    @ Sat May 16 10:09:13 PDT 2020 (1589648953492)
... end of run
No errors present in the logfile F:\jenkins\jenkins-slave\workspace\JMeter Windows\bin\TestSchedulerWithTimer.log
(the file is empty)

> Task :src:dist-check:batchTests

> Task :src:dist-check:test

Gradle Test Executor 20 STANDARD_OUT
    Setting JMeterHome: F:\jenkins\jenkins-slave\workspace\JMeter Windows\src\dist-check\..\..\.
    Initializing Properties: ../.././bin/jmeter.properties
    JMeterVersion=5.3-SNAPSHOT 0dde720
    java.version=1.8.0_152
    java.vm.name=Java HotSpot(TM) 64-Bit Server VM
    java.vendor=Oracle Corporation
    java.home=F:\jenkins\tools\java\latest1.8\jre
    file.encoding=windows-1252
    default encoding=windows-1252
    user.home=C:\Windows\system32\config\systemprofile
    user.dir=F:\jenkins\jenkins-slave\workspace\JMeter Windows\src\dist-check
    user.language=en
    user.region=null
    user.country=US
    user.variant=
    Locale=en_US
    java.class.version=52.0
    java.awt.headless=null
    os.name=Windows Server 2016
    os.version=10.0
    os.arch=amd64
    o.a.j.junit.JMeterTest WARN: org.apache.jmeter.gui.JMeterGUIComponent: NoSuchMethodException
 org.apache.jmeter.gui.menu.StaticJMeterGUIComponent, missing empty Constructor or Constructor
with Object parameter
    Last class=org.apache.jmeter.protocol.smtp.sampler.gui.SmtpSamplerGui
    objects.size=77
    Last error=java.lang.InstantiationException: org.apache.jmeter.gui.menu.StaticJMeterGUIComponent
          0.1sec,    9 completed,   0 failed,   0 skipped, org.apache.jmeter.control.TestSwitchController
          0.0sec,    2 completed,   0 failed,   0 skipped, org.apache.jmeter.resources.TestPropertiesFiles
          1.1sec,    5 completed,   0 failed,   0 skipped, org.apache.jmeter.save.TestSaveService
          0.0sec,    1 completed,   0 failed,   0 skipped, org.apache.jmeter.threads.ThreadGroupLoad
         10.1sec, org.apache.jorphan.reflect.TestClassFinder > testFindClassesThatExtendStringArrayClassOfQArrayTrue()
          4.8sec, org.apache.jorphan.reflect.TestClassFinder > testFindAnnotatedClasses()
         17.1sec,    9 completed,   0 failed,   0 skipped, org.apache.jorphan.reflect.TestClassFinder
          0.1sec,    7 completed,   0 failed,   0 skipped, org.apache.jorphan.TestFunctorUsers
FAILURE   0.0sec, org.apache.jmeter.junit.JMeterTest, initializationError
    java.lang.Exception: Error creating org.apache.jmeter.protocol.smtp.sampler.gui.SmtpSamplerGui
        at org.apache.jmeter.junit.JMeterTest.instantiateClass(JMeterTest.java:543)
        at org.apache.jmeter.junit.JMeterTest.getObjects(JMeterTest.java:473)
        at org.apache.jmeter.junit.JMeterTest.suiteGUIComponents(JMeterTest.java:270)
        at org.apache.jmeter.junit.JMeterTest.suite(JMeterTest.java:147)
        Caused by: java.lang.NullPointerException
            at sun.awt.shell.Win32ShellFolder2.access$200(Win32ShellFolder2.java:72)
            at sun.awt.shell.Win32ShellFolder2$1.call(Win32ShellFolder2.java:242)
            at sun.awt.shell.Win32ShellFolder2$1.call(Win32ShellFolder2.java:237)
            at java.util.concurrent.FutureTask.run(FutureTask.java:266)
            at java.util.concurrent.ThreadPoolExecutor.runWorker(ThreadPoolExecutor.java:1149)
            at java.util.concurrent.ThreadPoolExecutor$Worker.run(ThreadPoolExecutor.java:624)
            at sun.awt.shell.Win32ShellFolderManager2$ComInvoker$3.run(Win32ShellFolderManager2.java:547)
            at java.lang.Thread.run(Thread.java:748)

FAILURE   0.0sec,    1 completed,   1 failed,   0 skipped, org.apache.jmeter.junit.JMeterTest
          0.1sec,  100 completed,   0 failed,   0 skipped, org.apache.jmeter.functions.ComponentReferenceFunctionTest
          1.3sec,   82 completed,   0 failed,   0 skipped, org.apache.jmeter.gui.action.TestLoad
          1.2sec,  374 completed,   0 failed,   0 skipped, org.apache.jmeter.testbeans.gui.PackageTest
          0.2sec,  140 completed,   0 failed,   0 skipped, org.apache.jmeter.testelement.TestElementTest
          0.5sec,   22 completed,   0 failed,   0 skipped, org.apache.jmeter.engine.util.PackageSpec
          2.8sec, org.apache.jmeter.gui.action.HtmlReportGeneratorSpec > check that report
generation succeeds and statistic are generated
          4.4sec,    7 completed,   0 failed,   0 skipped, org.apache.jmeter.gui.action.HtmlReportGeneratorSpec
          0.2sec,    2 completed,   0 failed,   0 skipped, org.apache.jmeter.gui.util.MenuFactorySpec
          0.6sec,    2 completed,   0 failed,   0 skipped, org.apache.jmeter.report.dashboard.ReportGeneratorSpec
FAILURE  33.9sec,  763 completed,   1 failed,   0 skipped, Gradle Test Run :src:dist-check:test

763 tests completed, 1 failed

> Task :src:dist-check:test FAILED
checksum-dependency elapsed time: 33385ms, configurations processed: 279
    SHA-512 computation time: 2970ms (goes in parallel, it might exceed wall-clock time),
files processed: 16, processed: 4MiB, skipped: 3136MiB
    PGP signature resolution time: 4596ms (wall-clock), resolution requests: 167, signatures
resolved: 246
    PGP key resolution time: 15332ms (wall-clock), resolution requests: 167, download time:
0ms (goes in parallel, it might exceed wall-clock time), keys downloaded: 0
        PGP signature verification time: 43714ms (goes in parallel, it might exceed wall-clock
time), files processed: 326, processed: 279MiB, skipped: 2835MiB

FAILURE: Build failed with an exception.

* What went wrong:
Execution failed for task ':src:dist-check:test'.
> There were failing tests. See the report at: file:///F:/jenkins/jenkins-slave/workspace/JMeter%20Windows/src/dist-check/build/reports/tests/test/index.html

* Try:
Run with --stacktrace option to get the stack trace. Run with --info or --debug option to
get more log output. Run with --scan to get full insights.

* Get more help at https://help.gradle.org

Deprecated Gradle features were used in this build, making it incompatible with Gradle 7.0.
Use '--warning-mode all' to show the individual deprecation warnings.
See https://docs.gradle.org/6.3/userguide/command_line_interface.html#sec:command_line_warnings

BUILD FAILED in 6m 4s
287 actionable tasks: 169 executed, 118 up-to-date
Build step 'Invoke Gradle script' changed build result to FAILURE
Build step 'Invoke Gradle script' marked build as failure

Mime
View raw message