jmeter-dev mailing list archives

Site index · List index
Message view « Date » · « Thread »
Top « Date » · « Thread »
From Apache Jenkins Server <jenk...@builds.apache.org>
Subject Build failed in Jenkins: JMeter Windows #1680
Date Fri, 08 May 2020 15:56:22 GMT
See <https://builds.apache.org/job/JMeter%20Windows/1680/display/redirect?page=changes>

Changes:

[felix.schumacher] update apache tika to 2.14.1 (from 1.23)


------------------------------------------
[...truncated 229.57 KB...]
	at java.lang.Thread.run(Thread.java:748) [?:1.8.0_152]
2020-05-08 08:53:58,496 WARN o.a.j.p.j.p.AbstractJDBCProcessor: SQL Problem in JDBC PreProcessor:
java.sql.SQLSyntaxErrorException: unexpected token: USERS
2020-05-08 08:53:58,504 WARN o.a.j.p.j.p.AbstractJDBCProcessor: SQL Problem in JDBC PostProcessor:
java.sql.SQLSyntaxErrorException: unexpected token: USERS

> Task :src:dist:assemble

> Task :src:dist-check:batchJMS_TESTS
Creating summariser <summary>
Created the tree successfully using F:\jenkins\jenkins-slave\workspace\JMeter Windows\bin\testfiles\JMS_TESTS.jmx
Starting standalone test @ Fri May 08 08:54:01 PDT 2020 (1588953241161)
Waiting for possible Shutdown/StopTestNow/HeapDump/ThreadDump message on port 4445
summary +      1 in 00:00:01 =    0.8/s Avg:  1221 Min:  1221 Max:  1221 Err:     0 (0.00%)
Active: 1 Started: 1 Finished: 0
summary +     24 in 00:00:28 =    0.9/s Avg:   563 Min:     0 Max:  3000 Err:     0 (0.00%)
Active: 1 Started: 6 Finished: 5
summary =     25 in 00:00:29 =    0.9/s Avg:   589 Min:     0 Max:  3000 Err:     0 (0.00%)
summary +      2 in 00:00:00 =   31.7/s Avg:    21 Min:     0 Max:    42 Err:     0 (0.00%)
Active: 0 Started: 1 Finished: 1
summary =     27 in 00:00:29 =    0.9/s Avg:   547 Min:     0 Max:  3000 Err:     0 (0.00%)
Tidying up ...    @ Fri May 08 08:54:31 PDT 2020 (1588953271079)
... end of run
No errors present in the logfile F:\jenkins\jenkins-slave\workspace\JMeter Windows\bin\JMS_TESTS.log
(the file is empty)

> Task :src:dist-check:batchOS_TESTS
Creating summariser <summary>
Created the tree successfully using F:\jenkins\jenkins-slave\workspace\JMeter Windows\bin\testfiles\OS_TESTS.jmx
Starting standalone test @ Fri May 08 08:54:34 PDT 2020 (1588953274100)
Waiting for possible Shutdown/StopTestNow/HeapDump/ThreadDump message on port 4445
summary +      1 in 00:00:01 =    1.6/s Avg:    19 Min:    19 Max:    19 Err:     0 (0.00%)
Active: 1 Started: 1 Finished: 0
summary +      2 in 00:00:01 =    1.9/s Avg:   510 Min:    17 Max:  1003 Err:     0 (0.00%)
Active: 0 Started: 1 Finished: 1
summary =      3 in 00:00:02 =    1.8/s Avg:   346 Min:    17 Max:  1003 Err:     0 (0.00%)
Tidying up ...    @ Fri May 08 08:54:35 PDT 2020 (1588953275945)
... end of run
No errors present in the logfile F:\jenkins\jenkins-slave\workspace\JMeter Windows\bin\OS_TESTS.log
(the file is empty)

> Task :src:dist-check:batchResponseDecompression
Creating summariser <summary>
Created the tree successfully using F:\jenkins\jenkins-slave\workspace\JMeter Windows\bin\testfiles\ResponseDecompression.jmx
Starting standalone test @ Fri May 08 08:54:37 PDT 2020 (1588953277849)
Waiting for possible Shutdown/StopTestNow/HeapDump/ThreadDump message on port 4445
summary =      2 in 00:00:02 =    1.1/s Avg:   519 Min:   424 Max:   614 Err:     0 (0.00%)
Tidying up ...    @ Fri May 08 08:54:40 PDT 2020 (1588953280286)
... end of run
No errors present in the logfile F:\jenkins\jenkins-slave\workspace\JMeter Windows\bin\ResponseDecompression.log
(the file is empty)
[server] Created remote object: UnicastServerRef2 [liveRef: [endpoint:[jenkins-win-he-de-5.apache.org:55185,SSLRMIServerSocketFactory(host=jenkins-win-he-de-5.apache.org/176.9.73.62,
keyStoreLocation=rmi_keystore.jks, type=JKS, trustStoreLocation=rmi_keystore.jks, type=JKS,
alias=rmi),SSLRMIClientSocketFactory(keyStoreLocation=rmi_keystore.jks, type=JKS, trustStoreLocation=rmi_keystore.jks,
type=JKS, alias=rmi)](local),objID:[5935b3c7:171f4fef4a2:-7fff, -3465412325262336003]]][server]


> Task :src:dist-check:batchServerBatchTestLocal
Creating summariser <summary>
Created the tree successfully using F:\jenkins\jenkins-slave\workspace\JMeter Windows\bin\testfiles\BatchTestLocal.jmx
Configuring remote engine: jenkins-win-he-de-5.apache.org:55182
Starting distributed test with remote engines: [jenkins-win-he-de-5.apache.org:55182] @ Fri
May 08 08:54:44 PDT 2020 (1588953284743)

[server] Starting the test on host jenkins-win-he-de-5.apache.org:55182 @ Fri May 08 08:54:47
PDT 2020 (1588953287359)

> Task :src:dist-check:batchServerBatchTestLocal
Remote engines have been started:[jenkins-win-he-de-5.apache.org:55182]
Waiting for possible Shutdown/StopTestNow/HeapDump/ThreadDump message on port 4445
summary =    132 in 00:00:07 =   18.9/s Avg:     4 Min:     0 Max:    83 Err:    16 (12.12%)
Tidying up remote @ Fri May 08 08:54:54 PDT 2020 (1588953294893)

[server] Finished the test on host jenkins-win-he-de-5.apache.org:55182 @ Fri May 08 08:54:54
PDT 2020 (1588953294893) - exit requested.[server] 

> Task :src:dist-check:batchServerBatchTestLocal
... end of run
No errors present in the logfile F:\jenkins\jenkins-slave\workspace\JMeter Windows\bin\BatchTestLocal.log
(the file is empty)
No errors present in the logfile F:\jenkins\jenkins-slave\workspace\JMeter Windows\bin\BatchTestLocalServer.log
(the file is empty)

> Task :src:dist-check:batchSlowCharsFeatureHttpClient4 SKIPPED
> Task :src:dist-check:batchSlowCharsFeatureJava SKIPPED
> Task :src:dist-check:batchTCP_TESTS SKIPPED

> Task :src:dist-check:batchTEST_HTTPHttpClient4
Creating summariser <summary>
Created the tree successfully using F:\jenkins\jenkins-slave\workspace\JMeter Windows\bin\testfiles\TEST_HTTP.jmx
Starting standalone test @ Fri May 08 08:55:01 PDT 2020 (1588953301917)
Waiting for possible Shutdown/StopTestNow/HeapDump/ThreadDump message on port 4445
summary +      1 in 00:00:00 =    2.2/s Avg:   425 Min:   425 Max:   425 Err:     0 (0.00%)
Active: 1 Started: 1 Finished: 0
summary +     21 in 00:00:01 =   25.4/s Avg:    21 Min:     2 Max:   199 Err:     0 (0.00%)
Active: 0 Started: 1 Finished: 1
summary =     22 in 00:00:01 =   17.2/s Avg:    39 Min:     2 Max:   425 Err:     0 (0.00%)
Tidying up ...    @ Fri May 08 08:55:03 PDT 2020 (1588953303536)
... end of run
No errors present in the logfile F:\jenkins\jenkins-slave\workspace\JMeter Windows\bin\TEST_HTTP.log
(the file is empty)

> Task :src:dist-check:batchTEST_HTTPJava
Creating summariser <summary>
Created the tree successfully using F:\jenkins\jenkins-slave\workspace\JMeter Windows\bin\testfiles\TEST_HTTP.jmx
Starting standalone test @ Fri May 08 08:55:06 PDT 2020 (1588953306944)
Waiting for possible Shutdown/StopTestNow/HeapDump/ThreadDump message on port 4445
summary =     20 in 00:00:01 =   17.3/s Avg:    43 Min:     1 Max:   443 Err:     0 (0.00%)
Tidying up ...    @ Fri May 08 08:55:08 PDT 2020 (1588953308516)
... end of run
WARNING: the task was configured to ignore errors in the output log
Logfile contents (errors during the test, see F:\jenkins\jenkins-slave\workspace\JMeter Windows\bin\TEST_HTTP.log):
2020-05-08 08:55:08,412 ERROR o.a.j.p.h.s.HTTPJavaImpl: readResponse: java.net.ProtocolException:
Server redirected too many  times (20)
2020-05-08 08:55:08,415 ERROR o.a.j.p.h.s.HTTPJavaImpl: Cause: java.net.ProtocolException:
Server redirected too many  times (20)
2020-05-08 08:55:08,415 ERROR o.a.j.p.h.c.HttpMirrorThread: Invalid request received:''

> Task :src:dist-check:batchTEST_HTTPS
Creating summariser <summary>
Created the tree successfully using F:\jenkins\jenkins-slave\workspace\JMeter Windows\bin\testfiles\TEST_HTTPS.jmx
Starting standalone test @ Fri May 08 08:55:11 PDT 2020 (1588953311359)
Waiting for possible Shutdown/StopTestNow/HeapDump/ThreadDump message on port 4445
summary =      2 in 00:00:02 =    1.1/s Avg:   780 Min:   179 Max:  1381 Err:     0 (0.00%)
Tidying up ...    @ Fri May 08 08:55:13 PDT 2020 (1588953313719)
... end of run
No errors present in the logfile F:\jenkins\jenkins-slave\workspace\JMeter Windows\bin\TEST_HTTPS.log
(the file is empty)

> Task :src:dist-check:batchTestCookieManager
Creating summariser <summary>
Created the tree successfully using F:\jenkins\jenkins-slave\workspace\JMeter Windows\bin\testfiles\TestCookieManager.jmx
Starting standalone test @ Fri May 08 08:55:15 PDT 2020 (1588953315438)
Waiting for possible Shutdown/StopTestNow/HeapDump/ThreadDump message on port 4445
summary =     10 in 00:00:07 =    1.4/s Avg:   690 Min:     2 Max:  2010 Err:     0 (0.00%)
Tidying up ...    @ Fri May 08 08:55:23 PDT 2020 (1588953323386)
... end of run
No errors present in the logfile F:\jenkins\jenkins-slave\workspace\JMeter Windows\bin\TestCookieManager.log
(the file is empty)

> Task :src:dist-check:batchTestHeaderManagerHttpClient4
Creating summariser <summary>
Created the tree successfully using F:\jenkins\jenkins-slave\workspace\JMeter Windows\bin\testfiles\TestHeaderManager.jmx
Starting standalone test @ Fri May 08 08:55:26 PDT 2020 (1588953326106)
Waiting for possible Shutdown/StopTestNow/HeapDump/ThreadDump message on port 4445
summary +      2 in 00:00:04 =    0.5/s Avg:  2023 Min:  2003 Max:  2043 Err:     0 (0.00%)
Active: 1 Started: 1 Finished: 0
summary +      1 in 00:00:02 =    0.5/s Avg:  2002 Min:  2002 Max:  2002 Err:     0 (0.00%)
Active: 0 Started: 2 Finished: 2
summary =      3 in 00:00:06 =    0.5/s Avg:  2016 Min:  2002 Max:  2043 Err:     0 (0.00%)
Tidying up ...    @ Fri May 08 08:55:32 PDT 2020 (1588953332970)
... end of run
No errors present in the logfile F:\jenkins\jenkins-slave\workspace\JMeter Windows\bin\TestHeaderManager.log
(the file is empty)

> Task :src:dist-check:batchTestHeaderManagerJava
Creating summariser <summary>
Created the tree successfully using F:\jenkins\jenkins-slave\workspace\JMeter Windows\bin\testfiles\TestHeaderManager.jmx
Starting standalone test @ Fri May 08 08:55:34 PDT 2020 (1588953334571)
Waiting for possible Shutdown/StopTestNow/HeapDump/ThreadDump message on port 4445
summary =      3 in 00:00:03 =    0.9/s Avg:  1006 Min:  1002 Max:  1014 Err:     0 (0.00%)
Tidying up ...    @ Fri May 08 08:55:38 PDT 2020 (1588953338212)
... end of run
No errors present in the logfile F:\jenkins\jenkins-slave\workspace\JMeter Windows\bin\TestHeaderManager.log
(the file is empty)

> Task :src:dist-check:batchTestKeepAlive SKIPPED
> Task :src:dist-check:batchTestRedirectionPolicies SKIPPED

> Task :src:dist-check:batchTestResultStatusAction
Creating summariser <summary>
Created the tree successfully using F:\jenkins\jenkins-slave\workspace\JMeter Windows\bin\testfiles\TestResultStatusAction.jmx
Starting standalone test @ Fri May 08 08:55:40 PDT 2020 (1588953340134)
Waiting for possible Shutdown/StopTestNow/HeapDump/ThreadDump message on port 4445
summary =    135 in 00:00:01 =  182.4/s Avg:     0 Min:     0 Max:    42 Err:    18 (13.33%)
Tidying up ...    @ Fri May 08 08:55:41 PDT 2020 (1588953341681)
... end of run
No errors present in the logfile F:\jenkins\jenkins-slave\workspace\JMeter Windows\bin\TestResultStatusAction.log
(the file is empty)

> Task :src:dist-check:batchTestSchedulerWithTimer
Creating summariser <summary>
Created the tree successfully using F:\jenkins\jenkins-slave\workspace\JMeter Windows\bin\testfiles\TestSchedulerWithTimer.jmx
Starting standalone test @ Fri May 08 08:55:43 PDT 2020 (1588953343536)
Waiting for possible Shutdown/StopTestNow/HeapDump/ThreadDump message on port 4445
summary =      5 in 00:00:06 =    0.9/s Avg:   107 Min:     1 Max:   454 Err:     0 (0.00%)
Tidying up ...    @ Fri May 08 08:55:50 PDT 2020 (1588953350033)
... end of run
No errors present in the logfile F:\jenkins\jenkins-slave\workspace\JMeter Windows\bin\TestSchedulerWithTimer.log
(the file is empty)

> Task :src:dist-check:batchTests

> Task :src:dist-check:test

Gradle Test Executor 19 STANDARD_OUT
    Setting JMeterHome: F:\jenkins\jenkins-slave\workspace\JMeter Windows\src\dist-check\..\..\.
    Initializing Properties: ../.././bin/jmeter.properties
    JMeterVersion=5.3-SNAPSHOT 43b8957
    java.version=1.8.0_152
    java.vm.name=Java HotSpot(TM) 64-Bit Server VM
    java.vendor=Oracle Corporation
    java.home=F:\jenkins\tools\java\latest1.8\jre
    file.encoding=windows-1252
    default encoding=windows-1252
    user.home=C:\Windows\system32\config\systemprofile
    user.dir=F:\jenkins\jenkins-slave\workspace\JMeter Windows\src\dist-check
    user.language=en
    user.region=null
    user.country=US
    user.variant=
    Locale=en_US
    java.class.version=52.0
    java.awt.headless=null
    os.name=Windows Server 2016
    os.version=10.0
    os.arch=amd64
    o.a.j.junit.JMeterTest WARN: org.apache.jmeter.gui.JMeterGUIComponent: NoSuchMethodException
 org.apache.jmeter.gui.menu.StaticJMeterGUIComponent, missing empty Constructor or Constructor
with Object parameter
    Last class=org.apache.jmeter.protocol.smtp.sampler.gui.SmtpSamplerGui
    objects.size=77
    Last error=java.lang.InstantiationException: org.apache.jmeter.gui.menu.StaticJMeterGUIComponent
          0.1sec,    9 completed,   0 failed,   0 skipped, org.apache.jmeter.control.TestSwitchController
          0.0sec,    2 completed,   0 failed,   0 skipped, org.apache.jmeter.resources.TestPropertiesFiles
          1.2sec,    5 completed,   0 failed,   0 skipped, org.apache.jmeter.save.TestSaveService
          0.0sec,    1 completed,   0 failed,   0 skipped, org.apache.jmeter.threads.ThreadGroupLoad
          8.4sec, org.apache.jorphan.reflect.TestClassFinder > testFindClassesThatExtendStringArrayClassOfQArrayTrue()
          4.2sec, org.apache.jorphan.reflect.TestClassFinder > testFindAnnotatedClasses()
         14.5sec,    9 completed,   0 failed,   0 skipped, org.apache.jorphan.reflect.TestClassFinder
          0.1sec,    7 completed,   0 failed,   0 skipped, org.apache.jorphan.TestFunctorUsers
FAILURE   0.0sec, org.apache.jmeter.junit.JMeterTest, initializationError
    java.lang.Exception: Error creating org.apache.jmeter.protocol.smtp.sampler.gui.SmtpSamplerGui
        at org.apache.jmeter.junit.JMeterTest.instantiateClass(JMeterTest.java:543)
        at org.apache.jmeter.junit.JMeterTest.getObjects(JMeterTest.java:473)
        at org.apache.jmeter.junit.JMeterTest.suiteGUIComponents(JMeterTest.java:270)
        at org.apache.jmeter.junit.JMeterTest.suite(JMeterTest.java:147)
        Caused by: java.lang.NullPointerException
            at sun.awt.shell.Win32ShellFolder2.access$200(Win32ShellFolder2.java:72)
            at sun.awt.shell.Win32ShellFolder2$1.call(Win32ShellFolder2.java:242)
            at sun.awt.shell.Win32ShellFolder2$1.call(Win32ShellFolder2.java:237)
            at java.util.concurrent.FutureTask.run(FutureTask.java:266)
            at java.util.concurrent.ThreadPoolExecutor.runWorker(ThreadPoolExecutor.java:1149)
            at java.util.concurrent.ThreadPoolExecutor$Worker.run(ThreadPoolExecutor.java:624)
            at sun.awt.shell.Win32ShellFolderManager2$ComInvoker$3.run(Win32ShellFolderManager2.java:547)
            at java.lang.Thread.run(Thread.java:748)

FAILURE   0.0sec,    1 completed,   1 failed,   0 skipped, org.apache.jmeter.junit.JMeterTest
          0.1sec,  100 completed,   0 failed,   0 skipped, org.apache.jmeter.functions.ComponentReferenceFunctionTest
          0.9sec,   82 completed,   0 failed,   0 skipped, org.apache.jmeter.gui.action.TestLoad
          1.2sec,  374 completed,   0 failed,   0 skipped, org.apache.jmeter.testbeans.gui.PackageTest
          0.3sec,  140 completed,   0 failed,   0 skipped, org.apache.jmeter.testelement.TestElementTest
          0.4sec,   22 completed,   0 failed,   0 skipped, org.apache.jmeter.engine.util.PackageSpec
          2.8sec, org.apache.jmeter.gui.action.HtmlReportGeneratorSpec, check that report
generation succeeds and statistic are generated
          4.6sec,    3 completed,   0 failed,   0 skipped, org.apache.jmeter.gui.action.HtmlReportGeneratorSpec
          0.1sec,    2 completed,   0 failed,   0 skipped, org.apache.jmeter.gui.util.MenuFactorySpec
          0.7sec,    2 completed,   0 failed,   0 skipped, org.apache.jmeter.report.dashboard.ReportGeneratorSpec
FAILURE  30.9sec,  759 completed,   1 failed,   0 skipped, Gradle Test Run :src:dist-check:test

759 tests completed, 1 failed

> Task :src:dist-check:test FAILED
checksum-dependency elapsed time: 10324ms, configurations processed: 246 (add -PchecksumTimingsPrint
to print detailed timings)

FAILURE: Build failed with an exception.

* What went wrong:
Execution failed for task ':src:dist-check:test'.
> There were failing tests. See the report at: file:///F:/jenkins/jenkins-slave/workspace/JMeter%20Windows/src/dist-check/build/reports/tests/test/index.html

* Try:
Run with --stacktrace option to get the stack trace. Run with --info or --debug option to
get more log output. Run with --scan to get full insights.

* Get more help at https://help.gradle.org

Deprecated Gradle features were used in this build, making it incompatible with Gradle 7.0.
Use '--warning-mode all' to show the individual deprecation warnings.
See https://docs.gradle.org/6.3/userguide/command_line_interface.html#sec:command_line_warnings

BUILD FAILED in 6m 15s
287 actionable tasks: 172 executed, 115 up-to-date
Build step 'Invoke Gradle script' changed build result to FAILURE
Build step 'Invoke Gradle script' marked build as failure

Mime
View raw message