jmeter-dev mailing list archives

Site index · List index
Message view « Date » · « Thread »
Top « Date » · « Thread »
From Apache Jenkins Server <jenk...@builds.apache.org>
Subject Build failed in Jenkins: JMeter Windows #1684
Date Sun, 10 May 2020 16:56:22 GMT
See <https://builds.apache.org/job/JMeter%20Windows/1684/display/redirect?page=changes>

Changes:

[Milamber] prepare new version 5.3


------------------------------------------
[...truncated 235.33 KB...]
... end of run
No errors present in the logfile F:\jenkins\jenkins-slave\workspace\JMeter Windows\bin\OS_TESTS.log
(the file is empty)

> Task :src:dist-check:batchResponseDecompression
Creating summariser <summary>
Created the tree successfully using F:\jenkins\jenkins-slave\workspace\JMeter Windows\bin\testfiles\ResponseDecompression.jmx
Starting standalone test @ Sun May 10 09:54:24 PDT 2020 (1589129664730)
Waiting for possible Shutdown/StopTestNow/HeapDump/ThreadDump message on port 4445
summary =      2 in 00:00:02 =    1.2/s Avg:   418 Min:   275 Max:   562 Err:     0 (0.00%)
Tidying up ...    @ Sun May 10 09:54:26 PDT 2020 (1589129666885)
... end of run
No errors present in the logfile F:\jenkins\jenkins-slave\workspace\JMeter Windows\bin\ResponseDecompression.log
(the file is empty)
[server] Created remote object: UnicastServerRef2 [liveRef: [endpoint:[jenkins-win-he-de-5.apache.org:49479,SSLRMIServerSocketFactory(host=jenkins-win-he-de-5.apache.org/176.9.73.62,
keyStoreLocation=rmi_keystore.jks, type=JKS, trustStoreLocation=rmi_keystore.jks, type=JKS,
alias=rmi),SSLRMIClientSocketFactory(keyStoreLocation=rmi_keystore.jks, type=JKS, trustStoreLocation=rmi_keystore.jks,
type=JKS, alias=rmi)](local),objID:[-2822c726:171ff8267f1:-7fff, -2155753165699416139]]][server]


> Task :src:dist:compileTestJava NO-SOURCE
> Task :src:dist:testClasses UP-TO-DATE
> Task :src:dist:checkstyleTest NO-SOURCE
> Task :src:dist:spotbugsTest SKIPPED
> Task :src:dist:test NO-SOURCE
> Task :src:dist:check

> Task :src:dist-check:batchServerBatchTestLocal
Creating summariser <summary>
Created the tree successfully using F:\jenkins\jenkins-slave\workspace\JMeter Windows\bin\testfiles\BatchTestLocal.jmx
Configuring remote engine: jenkins-win-he-de-5.apache.org:49474
Starting distributed test with remote engines: [jenkins-win-he-de-5.apache.org:49474] @ Sun
May 10 09:54:31 PDT 2020 (1589129671986)

[server] Starting the test on host jenkins-win-he-de-5.apache.org:49474 @ Sun May 10 09:54:34
PDT 2020 (1589129674271)

> Task :src:dist-check:batchServerBatchTestLocal
Remote engines have been started:[jenkins-win-he-de-5.apache.org:49474]
Waiting for possible Shutdown/StopTestNow/HeapDump/ThreadDump message on port 4445
summary +      1 in 00:00:00 =   12.0/s Avg:     1 Min:     1 Max:     1 Err:     0 (0.00%)
Active: 1 Started: 1 Finished: 0

> Task :src:dist:distTar
> Task :src:dist:distTarSha512
> Task :src:dist:distTarSourceSha512
[server] Finished the test on host jenkins-win-he-de-5.apache.org:49474 @ Sun May 10 09:54:41
PDT 2020 (1589129681596) - exit requested.

> Task :src:dist-check:batchServerBatchTestLocal
summary +    131 in 00:00:07 =   19.5/s Avg:     4 Min:     0 Max:    79 Err:    16 (12.21%)
Active: 0 Started: 11 Finished: 11
summary =    132 in 00:00:07 =   19.5/s Avg:     4 Min:     0 Max:    79 Err:    16 (12.12%)
Tidying up remote @ Sun May 10 09:54:41 PDT 2020 (1589129681596)
... end of run
No errors present in the logfile F:\jenkins\jenkins-slave\workspace\JMeter Windows\bin\BatchTestLocal.log
(the file is empty)
No errors present in the logfile F:\jenkins\jenkins-slave\workspace\JMeter Windows\bin\BatchTestLocalServer.log
(the file is empty)

> Task :src:dist-check:batchSlowCharsFeatureHttpClient4 SKIPPED
> Task :src:dist-check:batchSlowCharsFeatureJava SKIPPED
> Task :src:dist-check:batchTCP_TESTS SKIPPED
> Task :src:dist:distZip
> Task :src:dist:distZipSha512

> Task :src:dist-check:batchTEST_HTTPHttpClient4
Creating summariser <summary>
Created the tree successfully using F:\jenkins\jenkins-slave\workspace\JMeter Windows\bin\testfiles\TEST_HTTP.jmx
Starting standalone test @ Sun May 10 09:54:48 PDT 2020 (1589129688879)
Waiting for possible Shutdown/StopTestNow/HeapDump/ThreadDump message on port 4445
summary =     22 in 00:00:02 =   10.8/s Avg:    65 Min:     1 Max:   931 Err:     0 (0.00%)
Tidying up ...    @ Sun May 10 09:54:51 PDT 2020 (1589129691270)
... end of run
No errors present in the logfile F:\jenkins\jenkins-slave\workspace\JMeter Windows\bin\TEST_HTTP.log
(the file is empty)

> Task :src:dist:distZipSource
> Task :src:dist:distZipSourceSha512

> Task :src:dist-check:batchTEST_HTTPJava
Creating summariser <summary>
Created the tree successfully using F:\jenkins\jenkins-slave\workspace\JMeter Windows\bin\testfiles\TEST_HTTP.jmx
Starting standalone test @ Sun May 10 09:54:54 PDT 2020 (1589129694613)
Waiting for possible Shutdown/StopTestNow/HeapDump/ThreadDump message on port 4445

> Task :src:dist:processSiteXslt

> Task :src:dist-check:batchTEST_HTTPJava
summary =     20 in 00:00:02 =    8.5/s Avg:    89 Min:     1 Max:  1267 Err:     0 (0.00%)
Tidying up ...    @ Sun May 10 09:54:57 PDT 2020 (1589129697332)
... end of run
WARNING: the task was configured to ignore errors in the output log
Logfile contents (errors during the test, see F:\jenkins\jenkins-slave\workspace\JMeter Windows\bin\TEST_HTTP.log):
2020-05-10 09:54:57,036 ERROR o.a.j.p.h.s.HTTPJavaImpl: readResponse: java.net.ProtocolException:
Server redirected too many  times (20)
2020-05-10 09:54:57,042 ERROR o.a.j.p.h.s.HTTPJavaImpl: Cause: java.net.ProtocolException:
Server redirected too many  times (20)
2020-05-10 09:54:57,042 ERROR o.a.j.p.h.c.HttpMirrorThread: Invalid request received:''

> Task :src:dist-check:batchTEST_HTTPS
Creating summariser <summary>
Created the tree successfully using F:\jenkins\jenkins-slave\workspace\JMeter Windows\bin\testfiles\TEST_HTTPS.jmx
Starting standalone test @ Sun May 10 09:55:00 PDT 2020 (1589129700273)
Waiting for possible Shutdown/StopTestNow/HeapDump/ThreadDump message on port 4445
summary +      1 in 00:00:02 =    0.6/s Avg:  1503 Min:  1503 Max:  1503 Err:     0 (0.00%)
Active: 1 Started: 1 Finished: 0
summary +      1 in 00:00:00 =    5.6/s Avg:   172 Min:   172 Max:   172 Err:     0 (0.00%)
Active: 0 Started: 1 Finished: 1
summary =      2 in 00:00:02 =    1.0/s Avg:   837 Min:   172 Max:  1503 Err:     0 (0.00%)
Tidying up ...    @ Sun May 10 09:55:02 PDT 2020 (1589129702749)
... end of run
No errors present in the logfile F:\jenkins\jenkins-slave\workspace\JMeter Windows\bin\TEST_HTTPS.log
(the file is empty)

> Task :src:dist-check:batchTestCookieManager
Creating summariser <summary>
Created the tree successfully using F:\jenkins\jenkins-slave\workspace\JMeter Windows\bin\testfiles\TestCookieManager.jmx
Starting standalone test @ Sun May 10 09:55:04 PDT 2020 (1589129704349)
Waiting for possible Shutdown/StopTestNow/HeapDump/ThreadDump message on port 4445
summary =     10 in 00:00:15 =    0.7/s Avg:   748 Min:     1 Max:  2014 Err:     0 (0.00%)
Tidying up ...    @ Sun May 10 09:55:19 PDT 2020 (1589129719776)
... end of run
No errors present in the logfile F:\jenkins\jenkins-slave\workspace\JMeter Windows\bin\TestCookieManager.log
(the file is empty)

> Task :src:dist-check:batchTestHeaderManagerHttpClient4
Creating summariser <summary>
Created the tree successfully using F:\jenkins\jenkins-slave\workspace\JMeter Windows\bin\testfiles\TestHeaderManager.jmx
Starting standalone test @ Sun May 10 09:55:21 PDT 2020 (1589129721578)
Waiting for possible Shutdown/StopTestNow/HeapDump/ThreadDump message on port 4445

> Task :src:dist:previewSite

> Task :src:dist-check:batchTestHeaderManagerHttpClient4
summary =      3 in 00:00:06 =    0.5/s Avg:  2014 Min:  2002 Max:  2037 Err:     0 (0.00%)
Tidying up ...    @ Sun May 10 09:55:28 PDT 2020 (1589129728641)
... end of run
No errors present in the logfile F:\jenkins\jenkins-slave\workspace\JMeter Windows\bin\TestHeaderManager.log
(the file is empty)

> Task :src:dist-check:batchTestHeaderManagerJava
Creating summariser <summary>
Created the tree successfully using F:\jenkins\jenkins-slave\workspace\JMeter Windows\bin\testfiles\TestHeaderManager.jmx
Starting standalone test @ Sun May 10 09:55:30 PDT 2020 (1589129730637)
Waiting for possible Shutdown/StopTestNow/HeapDump/ThreadDump message on port 4445

> Task :src:dist:assemble

> Task :src:dist-check:batchTestHeaderManagerJava
summary +      1 in 00:00:01 =    0.9/s Avg:  1014 Min:  1014 Max:  1014 Err:     0 (0.00%)
Active: 1 Started: 1 Finished: 0
summary +      2 in 00:00:02 =    1.0/s Avg:  1002 Min:  1001 Max:  1003 Err:     0 (0.00%)
Active: 0 Started: 2 Finished: 2
summary =      3 in 00:00:03 =    1.0/s Avg:  1006 Min:  1001 Max:  1014 Err:     0 (0.00%)
Tidying up ...    @ Sun May 10 09:55:34 PDT 2020 (1589129734374)
... end of run
No errors present in the logfile F:\jenkins\jenkins-slave\workspace\JMeter Windows\bin\TestHeaderManager.log
(the file is empty)

> Task :src:dist-check:batchTestKeepAlive SKIPPED
> Task :src:dist-check:batchTestRedirectionPolicies SKIPPED

> Task :src:dist-check:batchTestResultStatusAction
Creating summariser <summary>
Created the tree successfully using F:\jenkins\jenkins-slave\workspace\JMeter Windows\bin\testfiles\TestResultStatusAction.jmx
Starting standalone test @ Sun May 10 09:55:36 PDT 2020 (1589129736028)
Waiting for possible Shutdown/StopTestNow/HeapDump/ThreadDump message on port 4445
summary =    135 in 00:00:01 =  104.6/s Avg:     1 Min:     0 Max:   161 Err:    18 (13.33%)
Tidying up ...    @ Sun May 10 09:55:38 PDT 2020 (1589129738175)
... end of run
No errors present in the logfile F:\jenkins\jenkins-slave\workspace\JMeter Windows\bin\TestResultStatusAction.log
(the file is empty)

> Task :src:dist-check:batchTestSchedulerWithTimer
Creating summariser <summary>
Created the tree successfully using F:\jenkins\jenkins-slave\workspace\JMeter Windows\bin\testfiles\TestSchedulerWithTimer.jmx
Starting standalone test @ Sun May 10 09:55:40 PDT 2020 (1589129740060)
Waiting for possible Shutdown/StopTestNow/HeapDump/ThreadDump message on port 4445
summary =      5 in 00:00:06 =    0.8/s Avg:   265 Min:     1 Max:   935 Err:     0 (0.00%)
Tidying up ...    @ Sun May 10 09:55:47 PDT 2020 (1589129747315)
... end of run
No errors present in the logfile F:\jenkins\jenkins-slave\workspace\JMeter Windows\bin\TestSchedulerWithTimer.log
(the file is empty)

> Task :src:dist-check:batchTests

> Task :src:dist-check:test

Gradle Test Executor 20 STANDARD_OUT
    Setting JMeterHome: F:\jenkins\jenkins-slave\workspace\JMeter Windows\src\dist-check\..\..\.
    Initializing Properties: ../.././bin/jmeter.properties
    JMeterVersion=5.3-SNAPSHOT 8fd448f
    java.version=1.8.0_152
    java.vm.name=Java HotSpot(TM) 64-Bit Server VM
    java.vendor=Oracle Corporation
    java.home=F:\jenkins\tools\java\latest1.8\jre
    file.encoding=windows-1252
    default encoding=windows-1252
    user.home=C:\Windows\system32\config\systemprofile
    user.dir=F:\jenkins\jenkins-slave\workspace\JMeter Windows\src\dist-check
    user.language=en
    user.region=null
    user.country=US
    user.variant=
    Locale=en_US
    java.class.version=52.0
    java.awt.headless=null
    os.name=Windows Server 2016
    os.version=10.0
    os.arch=amd64
    o.a.j.junit.JMeterTest WARN: org.apache.jmeter.gui.JMeterGUIComponent: NoSuchMethodException
 org.apache.jmeter.gui.menu.StaticJMeterGUIComponent, missing empty Constructor or Constructor
with Object parameter
    Last class=org.apache.jmeter.protocol.smtp.sampler.gui.SmtpSamplerGui
    objects.size=77
    Last error=java.lang.InstantiationException: org.apache.jmeter.gui.menu.StaticJMeterGUIComponent
          0.1sec,    9 completed,   0 failed,   0 skipped, org.apache.jmeter.control.TestSwitchController
          0.0sec,    2 completed,   0 failed,   0 skipped, org.apache.jmeter.resources.TestPropertiesFiles
          1.4sec,    5 completed,   0 failed,   0 skipped, org.apache.jmeter.save.TestSaveService
          0.0sec,    1 completed,   0 failed,   0 skipped, org.apache.jmeter.threads.ThreadGroupLoad
          9.8sec, org.apache.jorphan.reflect.TestClassFinder > testFindClassesThatExtendStringArrayClassOfQArrayTrue()
          4.6sec, org.apache.jorphan.reflect.TestClassFinder > testFindAnnotatedClasses()
         16.0sec,    9 completed,   0 failed,   0 skipped, org.apache.jorphan.reflect.TestClassFinder
          0.1sec,    7 completed,   0 failed,   0 skipped, org.apache.jorphan.TestFunctorUsers
FAILURE   0.0sec, org.apache.jmeter.junit.JMeterTest, initializationError
    java.lang.Exception: Error creating org.apache.jmeter.protocol.smtp.sampler.gui.SmtpSamplerGui
        at org.apache.jmeter.junit.JMeterTest.instantiateClass(JMeterTest.java:543)
        at org.apache.jmeter.junit.JMeterTest.getObjects(JMeterTest.java:473)
        at org.apache.jmeter.junit.JMeterTest.suiteGUIComponents(JMeterTest.java:270)
        at org.apache.jmeter.junit.JMeterTest.suite(JMeterTest.java:147)
        Caused by: java.lang.NullPointerException
            at sun.awt.shell.Win32ShellFolder2.access$200(Win32ShellFolder2.java:72)
            at sun.awt.shell.Win32ShellFolder2$1.call(Win32ShellFolder2.java:242)
            at sun.awt.shell.Win32ShellFolder2$1.call(Win32ShellFolder2.java:237)
            at java.util.concurrent.FutureTask.run(FutureTask.java:266)
            at java.util.concurrent.ThreadPoolExecutor.runWorker(ThreadPoolExecutor.java:1149)
            at java.util.concurrent.ThreadPoolExecutor$Worker.run(ThreadPoolExecutor.java:624)
            at sun.awt.shell.Win32ShellFolderManager2$ComInvoker$3.run(Win32ShellFolderManager2.java:547)
            at java.lang.Thread.run(Thread.java:748)

FAILURE   0.0sec,    1 completed,   1 failed,   0 skipped, org.apache.jmeter.junit.JMeterTest
          0.1sec,  100 completed,   0 failed,   0 skipped, org.apache.jmeter.functions.ComponentReferenceFunctionTest
          1.1sec,   82 completed,   0 failed,   0 skipped, org.apache.jmeter.gui.action.TestLoad
          1.0sec,  374 completed,   0 failed,   0 skipped, org.apache.jmeter.testbeans.gui.PackageTest
          0.2sec,  140 completed,   0 failed,   0 skipped, org.apache.jmeter.testelement.TestElementTest
          0.5sec,   22 completed,   0 failed,   0 skipped, org.apache.jmeter.engine.util.PackageSpec
          3.0sec, org.apache.jmeter.gui.action.HtmlReportGeneratorSpec > check that report
generation succeeds and statistic are generated
          4.6sec,    7 completed,   0 failed,   0 skipped, org.apache.jmeter.gui.action.HtmlReportGeneratorSpec
          0.2sec,    2 completed,   0 failed,   0 skipped, org.apache.jmeter.gui.util.MenuFactorySpec
          0.7sec,    2 completed,   0 failed,   0 skipped, org.apache.jmeter.report.dashboard.ReportGeneratorSpec
FAILURE  33.3sec,  763 completed,   1 failed,   0 skipped, Gradle Test Run :src:dist-check:test

763 tests completed, 1 failed

> Task :src:dist-check:test FAILED
checksum-dependency elapsed time: 14133ms, configurations processed: 282 (add -PchecksumTimingsPrint
to print detailed timings)

FAILURE: Build failed with an exception.

* What went wrong:
Execution failed for task ':src:dist-check:test'.
> There were failing tests. See the report at: file:///F:/jenkins/jenkins-slave/workspace/JMeter%20Windows/src/dist-check/build/reports/tests/test/index.html

* Try:
Run with --stacktrace option to get the stack trace. Run with --info or --debug option to
get more log output. Run with --scan to get full insights.

* Get more help at https://help.gradle.org

Deprecated Gradle features were used in this build, making it incompatible with Gradle 7.0.
Use '--warning-mode all' to show the individual deprecation warnings.
See https://docs.gradle.org/6.3/userguide/command_line_interface.html#sec:command_line_warnings

BUILD FAILED in 5m 2s
287 actionable tasks: 224 executed, 63 up-to-date
Build step 'Invoke Gradle script' changed build result to FAILURE
Build step 'Invoke Gradle script' marked build as failure

Mime
View raw message