jmeter-dev mailing list archives

Site index · List index
Message view « Date » · « Thread »
Top « Date » · « Thread »
From Apache Jenkins Server <jenk...@builds.apache.org>
Subject Build failed in Jenkins: JMeter Windows #1681
Date Fri, 08 May 2020 17:47:28 GMT
See <https://builds.apache.org/job/JMeter%20Windows/1681/display/redirect>

Changes:


------------------------------------------
[...truncated 214.09 KB...]
          0.0sec,    7 completed,   0 failed,   0 skipped, org.apache.jmeter.functions.TestFileRowColContainer
          0.0sec,    5 completed,   0 failed,   0 skipped, org.apache.jmeter.functions.TestFileToString
          0.9sec,    7 completed,   0 failed,   0 skipped, org.apache.jmeter.functions.TestGroovyFunction
          0.0sec,    5 completed,   0 failed,   0 skipped, org.apache.jmeter.functions.TestIsPropDefined
          0.0sec,    6 completed,   0 failed,   0 skipped, org.apache.jmeter.functions.TestIsVarDefined
          0.6sec,    5 completed,   0 failed,   0 skipped, org.apache.jmeter.functions.TestJavascriptFunction
          0.3sec,    5 completed,   0 failed,   0 skipped, org.apache.jmeter.functions.TestJavascriptFunctionWithRhino
          0.1sec,    6 completed,   0 failed,   0 skipped, org.apache.jmeter.functions.TestJexl2Function
          0.1sec,    6 completed,   0 failed,   0 skipped, org.apache.jmeter.functions.TestJexl3Function
          0.0sec,    5 completed,   0 failed,   0 skipped, org.apache.jmeter.functions.TestMachineIPName
          0.0sec,    4 completed,   0 failed,   0 skipped, org.apache.jmeter.functions.TestRandomFromMultipleVars
          0.0sec,   22 completed,   0 failed,   0 skipped, org.apache.jmeter.functions.TestRegexFunction
          0.0sec,    2 completed,   0 failed,   0 skipped, org.apache.jmeter.functions.TestSamplerNameFunction
          0.0sec,    3 completed,   0 failed,   0 skipped, org.apache.jmeter.functions.TestSetProperty
          0.1sec,   18 completed,   0 failed,   0 skipped, org.apache.jmeter.functions.TestSimpleFunctions
          0.1sec,   15 completed,   0 failed,   0 skipped, org.apache.jmeter.functions.TestStringtoFile
          0.0sec,   15 completed,   0 failed,   0 skipped, org.apache.jmeter.functions.TestTimeFunction
          0.1sec,   14 completed,   0 failed,   0 skipped, org.apache.jmeter.functions.TestTimeRandomDateFunction
          0.1sec,   12 completed,   0 failed,   0 skipped, org.apache.jmeter.functions.TestTimeShiftFunction
          0.0sec,    3 completed,   0 failed,   0 skipped, org.apache.jmeter.functions.TestUrlEncodeDecode
          0.0sec,    1 completed,   0 failed,   0 skipped, org.apache.jmeter.functions.VariableTest
WARNING   0.6sec,    6 completed,   0 failed,   5 skipped, org.apache.jmeter.functions.XPathConcurrencyTest
          0.1sec,    1 completed,   0 failed,   0 skipped, org.apache.jmeter.resources.ResourceKeyUsageTestFunctions
          0.2sec,   10 completed,   0 failed,   0 skipped, org.apache.jmeter.functions.PackageTest
          0.1sec,   22 completed,   0 failed,   0 skipped, org.apache.jmeter.functions.ChangeCaseSpec
          0.2sec,    9 completed,   0 failed,   0 skipped, org.apache.jmeter.functions.gui.FunctionHelperSpec
          0.2sec,    2 completed,   0 failed,   0 skipped, org.apache.jmeter.functions.IterationCounterSpec

> Task :src:dist-check:batchBug56811
May 08, 2020 10:46:20 AM java.util.prefs.WindowsPreferences <init>
WARNING: Could not open/create prefs root node Software\JavaSoft\Prefs at root 0x80000002.
Windows RegCreateKeyEx(...) returned error code 5.
Creating summariser <summary>
Created the tree successfully using F:\jenkins\jenkins-slave\workspace\JMeter Windows\bin\testfiles\Bug56811.jmx
Starting standalone test @ Fri May 08 10:46:21 PDT 2020 (1588959981051)
Waiting for possible Shutdown/StopTestNow/HeapDump/ThreadDump message on port 4445
summary =      9 in 00:00:00 =   22.9/s Avg:     3 Min:     0 Max:     8 Err:     3 (33.33%)
Tidying up ...    @ Fri May 08 10:46:22 PDT 2020 (1588959982065)
... end of run
No errors present in the logfile F:\jenkins\jenkins-slave\workspace\JMeter Windows\bin\Bug56811.log
(the file is empty)

> Task :src:protocol:http:test
          0.7sec,   55 completed,   0 failed,   0 skipped, org.apache.jmeter.curl.BasicCurlParserTest
          0.5sec,   21 completed,   0 failed,   0 skipped, org.apache.jmeter.gui.action.ParseCurlCommandActionTest
          0.0sec,    3 completed,   0 failed,   0 skipped, org.apache.jmeter.protocol.http.config.MultipartUrlConfigTest
          0.0sec,    2 completed,   0 failed,   0 skipped, org.apache.jmeter.protocol.http.config.UrlConfigTest
FAILURE   1.2sec, org.apache.jmeter.protocol.http.control.TestCacheManagerUrlConnection >
testPrivateCache()
    org.opentest4j.AssertionFailedError: Should not now find valid entry ==> expected:
<false> but was: <true>
        at org.junit.jupiter.api.AssertionUtils.fail(AssertionUtils.java:55)
        at org.junit.jupiter.api.AssertFalse.assertFalse(AssertFalse.java:40)
        at org.junit.jupiter.api.Assertions.assertFalse(Assertions.java:218)
        at org.apache.jmeter.protocol.http.control.TestCacheManagerBase.testPrivateCache(TestCacheManagerBase.java:263)
        at org.junit.platform.commons.util.ReflectionUtils.invokeMethod(ReflectionUtils.java:686)
        at org.junit.jupiter.engine.execution.MethodInvocation.proceed(MethodInvocation.java:60)
        at org.junit.jupiter.engine.execution.InvocationInterceptorChain$ValidatingInvocation.proceed(InvocationInterceptorChain.java:131)
        at org.junit.jupiter.engine.extension.TimeoutInvocation.proceed(TimeoutInvocation.java:46)
        at org.junit.jupiter.engine.extension.TimeoutExtension.intercept(TimeoutExtension.java:149)
        at org.junit.jupiter.engine.extension.TimeoutExtension.interceptTestableMethod(TimeoutExtension.java:140)
        at org.junit.jupiter.engine.extension.TimeoutExtension.interceptTestMethod(TimeoutExtension.java:84)
        at org.junit.jupiter.engine.execution.ExecutableInvoker$ReflectiveInterceptorCall.lambda$ofVoidMethod$0(ExecutableInvoker.java:115)
        at org.junit.jupiter.engine.execution.ExecutableInvoker.lambda$invoke$0(ExecutableInvoker.java:105)
        at org.junit.jupiter.engine.execution.InvocationInterceptorChain$InterceptedInvocation.proceed(InvocationInterceptorChain.java:106)
        at org.junit.jupiter.engine.execution.InvocationInterceptorChain.proceed(InvocationInterceptorChain.java:64)
        at org.junit.jupiter.engine.execution.InvocationInterceptorChain.chainAndInvoke(InvocationInterceptorChain.java:45)
        at org.junit.jupiter.engine.execution.InvocationInterceptorChain.invoke(InvocationInterceptorChain.java:37)
        at org.junit.jupiter.engine.execution.ExecutableInvoker.invoke(ExecutableInvoker.java:104)
        at org.junit.jupiter.engine.execution.ExecutableInvoker.invoke(ExecutableInvoker.java:98)
        at org.junit.jupiter.engine.descriptor.TestMethodTestDescriptor.lambda$invokeTestMethod$6(TestMethodTestDescriptor.java:205)
        at org.junit.platform.engine.support.hierarchical.ThrowableCollector.execute(ThrowableCollector.java:73)
        at org.junit.jupiter.engine.descriptor.TestMethodTestDescriptor.invokeTestMethod(TestMethodTestDescriptor.java:201)
        at org.junit.jupiter.engine.descriptor.TestMethodTestDescriptor.execute(TestMethodTestDescriptor.java:137)
        at org.junit.jupiter.engine.descriptor.TestMethodTestDescriptor.execute(TestMethodTestDescriptor.java:71)
        at org.junit.platform.engine.support.hierarchical.NodeTestTask.lambda$executeRecursively$5(NodeTestTask.java:135)
        at org.junit.platform.engine.support.hierarchical.ThrowableCollector.execute(ThrowableCollector.java:73)
        at org.junit.platform.engine.support.hierarchical.NodeTestTask.lambda$executeRecursively$7(NodeTestTask.java:125)
        at org.junit.platform.engine.support.hierarchical.Node.around(Node.java:135)
        at org.junit.platform.engine.support.hierarchical.NodeTestTask.lambda$executeRecursively$8(NodeTestTask.java:123)
        at org.junit.platform.engine.support.hierarchical.ThrowableCollector.execute(ThrowableCollector.java:73)
        at org.junit.platform.engine.support.hierarchical.NodeTestTask.executeRecursively(NodeTestTask.java:122)
        at org.junit.platform.engine.support.hierarchical.NodeTestTask.execute(NodeTestTask.java:80)
        at org.junit.platform.engine.support.hierarchical.ForkJoinPoolHierarchicalTestExecutorService$ExclusiveTask.compute(ForkJoinPoolHierarchicalTestExecutorService.java:171)
        at java.util.concurrent.RecursiveAction.exec(RecursiveAction.java:189)
        at java.util.concurrent.ForkJoinTask.doExec(ForkJoinTask.java:289)
        at java.util.concurrent.ForkJoinTask.doJoin(ForkJoinTask.java:389)
        at java.util.concurrent.ForkJoinTask.join(ForkJoinTask.java:719)
        at org.junit.platform.engine.support.hierarchical.ForkJoinPoolHierarchicalTestExecutorService.joinConcurrentTasksInReverseOrderToEnableWorkStealing(ForkJoinPoolHierarchicalTestExecutorService.java:148)
        at org.junit.platform.engine.support.hierarchical.ForkJoinPoolHierarchicalTestExecutorService.invokeAll(ForkJoinPoolHierarchicalTestExecutorService.java:122)
        at org.junit.platform.engine.support.hierarchical.NodeTestTask.lambda$executeRecursively$5(NodeTestTask.java:139)
        at org.junit.platform.engine.support.hierarchical.ThrowableCollector.execute(ThrowableCollector.java:73)
        at org.junit.platform.engine.support.hierarchical.NodeTestTask.lambda$executeRecursively$7(NodeTestTask.java:125)
        at org.junit.platform.engine.support.hierarchical.Node.around(Node.java:135)
        at org.junit.platform.engine.support.hierarchical.NodeTestTask.lambda$executeRecursively$8(NodeTestTask.java:123)
        at org.junit.platform.engine.support.hierarchical.ThrowableCollector.execute(ThrowableCollector.java:73)
        at org.junit.platform.engine.support.hierarchical.NodeTestTask.executeRecursively(NodeTestTask.java:122)
        at org.junit.platform.engine.support.hierarchical.NodeTestTask.execute(NodeTestTask.java:80)

          2.0sec,    2 completed,   0 failed,   0 skipped, org.apache.jmeter.protocol.http.sampler.TestHTTPHC4Impl
          2.3sec, org.apache.jmeter.protocol.http.proxy.TestHttpRequestHdr > testEncodedArgumentsIPv6()
          2.7sec, org.apache.jmeter.protocol.http.proxy.TestHttpRequestHdr > testPostMultipartFormData()
          2.1sec, org.apache.jmeter.protocol.http.control.TestCacheManagerHC4 > testExpires()
          3.7sec,   10 completed,   0 failed,   0 skipped, org.apache.jmeter.protocol.http.proxy.TestHttpRequestHdr
          2.0sec, org.apache.jmeter.protocol.http.control.TestCacheManagerHC4 > testExpiresBug59962()
          3.1sec, org.apache.jmeter.protocol.http.control.TestCacheManagerUrlConnection >
testPrivateCacheNoMaxAgeNoExpire()
          3.1sec, org.apache.jmeter.protocol.http.control.TestCacheManagerHC4 > testPrivateCacheNoMaxAgeNoExpire()

> Task :src:functions:test
WARNING   9.0sec,  264 completed,   0 failed,   5 skipped, Gradle Test Run :src:functions:test

> Task :src:functions:check

> Task :src:dist-check:batchBug62239
May 08, 2020 10:46:24 AM java.util.prefs.WindowsPreferences <init>
WARNING: Could not open/create prefs root node Software\JavaSoft\Prefs at root 0x80000002.
Windows RegCreateKeyEx(...) returned error code 5.
Creating summariser <summary>
Created the tree successfully using F:\jenkins\jenkins-slave\workspace\JMeter Windows\bin\testfiles\Bug62239.jmx
Starting standalone test @ Fri May 08 10:46:24 PDT 2020 (1588959984342)
Waiting for possible Shutdown/StopTestNow/HeapDump/ThreadDump message on port 4445
summary =    108 in 00:00:00 =  369.9/s Avg:     0 Min:     0 Max:     1 Err:     0 (0.00%)
Tidying up ...    @ Fri May 08 10:46:24 PDT 2020 (1588959984757)
... end of run
No errors present in the logfile F:\jenkins\jenkins-slave\workspace\JMeter Windows\bin\Bug62239.log
(the file is empty)

> Task :src:protocol:http:test
          2.1sec, org.apache.jmeter.protocol.http.control.TestCacheManagerHC4 > testPrivateCacheExpireNoMaxAge()
          2.0sec, org.apache.jmeter.protocol.http.control.TestCacheManagerUrlConnection >
testExpiresBug59962()
          2.1sec, org.apache.jmeter.protocol.http.control.TestCacheManagerUrlConnection >
testExpires()
          3.1sec, org.apache.jmeter.protocol.http.control.TestCacheManagerHC4 > testNoCacheControlNoMaxAgeNoExpire()
          6.3sec,   25 completed,   0 failed,   0 skipped, org.apache.jmeter.protocol.http.control.TestCacheManagerHC4
          2.1sec, org.apache.jmeter.protocol.http.control.TestCacheManagerUrlConnection >
testPrivateCacheExpireNoMaxAge()
          3.1sec, org.apache.jmeter.protocol.http.control.TestCacheManagerUrlConnection >
testNoCacheControlNoMaxAgeNoExpire()
FAILURE   8.4sec,   24 completed,   1 failed,   0 skipped, org.apache.jmeter.protocol.http.control.TestCacheManagerUrlConnection
          6.1sec, org.apache.jmeter.protocol.http.control.DnsManagerTest > badDnsInCustomResolverShouldFailHttpSampler(String,
WireMockServer)[1], [1] HttpClient4
WARNING   8.2sec,    2 completed,   0 failed,   1 skipped, org.apache.jmeter.protocol.http.control.DnsManagerTest
          0.1sec,    1 completed,   0 failed,   0 skipped, org.apache.jmeter.protocol.http.control.gui.TestHttpTestSampleGui
          0.0sec,    6 completed,   0 failed,   0 skipped, org.apache.jmeter.protocol.http.control.TestAuthManager
          0.0sec,    2 completed,   0 failed,   0 skipped, org.apache.jmeter.protocol.http.control.TestAuthManagerThreadIteration
          0.0sec,    1 completed,   0 failed,   0 skipped, org.apache.jmeter.protocol.http.control.TestAuthorization
          0.1sec,    5 completed,   0 failed,   0 skipped, org.apache.jmeter.protocol.http.control.TestCacheManagerThreadIteration
          0.1sec,    4 completed,   0 failed,   0 skipped, org.apache.jmeter.protocol.http.control.TestCookieManagerThreadIteration
          0.1sec,   33 completed,   0 failed,   0 skipped, org.apache.jmeter.protocol.http.control.TestHC4CookieManager
          0.5sec,   18 completed,   0 failed,   0 skipped, org.apache.jmeter.protocol.http.modifier.TestAnchorModifier
          0.0sec,   17 completed,   0 failed,   0 skipped, org.apache.jmeter.protocol.http.modifier.TestURLRewritingModifier
          0.0sec,    2 completed,   0 failed,   0 skipped, org.apache.jmeter.protocol.http.parser.TestBaseParser
          0.2sec,    4 completed,   0 failed,   0 skipped, org.apache.jmeter.protocol.http.parser.TestCssParser
          0.0sec,    6 completed,   0 failed,   0 skipped, org.apache.jmeter.protocol.http.parser.TestHtmlParsingUtils
          0.2sec,    7 completed,   0 failed,   0 skipped, org.apache.jmeter.protocol.http.proxy.TestProxyControl
          0.0sec,    1 completed,   0 failed,   0 skipped, org.apache.jmeter.protocol.http.sampler.PackageTest

> Task :src:dist-check:batchFTP_TESTS
May 08, 2020 10:46:26 AM java.util.prefs.WindowsPreferences <init>
WARNING: Could not open/create prefs root node Software\JavaSoft\Prefs at root 0x80000002.
Windows RegCreateKeyEx(...) returned error code 5.
Creating summariser <summary>
Created the tree successfully using F:\jenkins\jenkins-slave\workspace\JMeter Windows\bin\testfiles\FTP_TESTS.jmx
Starting standalone test @ Fri May 08 10:46:26 PDT 2020 (1588959986811)
Waiting for possible Shutdown/StopTestNow/HeapDump/ThreadDump message on port 4445
summary +      5 in 00:00:02 =    2.1/s Avg:   223 Min:    18 Max:   890 Err:     0 (0.00%)
Active: 1 Started: 1 Finished: 0
summary +      1 in 00:00:00 =   21.7/s Avg:    41 Min:    41 Max:    41 Err:     0 (0.00%)
Active: 0 Started: 1 Finished: 1
summary =      6 in 00:00:02 =    2.4/s Avg:   193 Min:    18 Max:   890 Err:     0 (0.00%)
Tidying up ...    @ Fri May 08 10:46:30 PDT 2020 (1588959990048)
... end of run
No errors present in the logfile F:\jenkins\jenkins-slave\workspace\JMeter Windows\bin\FTP_TESTS.log
(the file is empty)

> Task :src:protocol:http:test
          1.3sec,   16 completed,   0 failed,   0 skipped, org.apache.jmeter.protocol.http.sampler.ParallelResourcesAndIpSource
          0.0sec,    8 completed,   0 failed,   0 skipped, org.apache.jmeter.protocol.http.sampler.PostWriterTest
          0.0sec,    2 completed,   0 failed,   0 skipped, org.apache.jmeter.protocol.http.sampler.PutWriterTest
          0.2sec,    8 completed,   0 failed,   0 skipped, org.apache.jmeter.protocol.http.sampler.TestDecompression
          0.0sec,   18 completed,   0 failed,   0 skipped, org.apache.jmeter.protocol.http.sampler.TestHTTPSamplers
          0.0sec,    2 completed,   0 failed,   0 skipped, org.apache.jmeter.protocol.http.sampler.TestHttpWebdav
          0.5sec,    1 completed,   0 failed,   0 skipped, org.apache.jmeter.protocol.http.sampler.TestSerializedHTTPSampler
          0.0sec,    6 completed,   0 failed,   0 skipped, org.apache.jmeter.protocol.http.util.accesslog.TestLogFilter
          0.0sec,    3 completed,   0 failed,   0 skipped, org.apache.jmeter.protocol.http.util.accesslog.TestSessionFilter
          0.0sec,    4 completed,   0 failed,   0 skipped, org.apache.jmeter.protocol.http.util.accesslog.TestTCLogParser
          0.0sec,    3 completed,   0 failed,   0 skipped, org.apache.jmeter.protocol.http.util.TestHTTPArgument
          0.0sec,    3 completed,   0 failed,   0 skipped, org.apache.jmeter.protocol.http.util.TestHTTPFileArg
          0.0sec,    5 completed,   0 failed,   0 skipped, org.apache.jmeter.protocol.http.util.TestHTTPFileArgs
          0.0sec,    7 completed,   0 failed,   0 skipped, org.apache.jmeter.protocol.http.visualizers.RequestViewHTTPTest
          0.1sec,    1 completed,   0 failed,   0 skipped, org.apache.jmeter.resources.ResourceKeyUsageTestHttp
          0.0sec,    2 completed,   0 failed,   0 skipped, org.apache.jmeter.testelement.TestHeaderManager
          0.9sec,    9 completed,   0 failed,   0 skipped, org.apache.jmeter.protocol.http.control.TestHTTPMirrorThread
          0.2sec,   46 completed,   0 failed,   0 skipped, org.apache.jmeter.protocol.http.parser.TestBug60842HtmlParser
          0.4sec,  103 completed,   0 failed,   0 skipped, org.apache.jmeter.protocol.http.parser.TestHTMLParser
WARNING   0.0sec,    2 completed,   0 failed,   2 skipped, org.apache.jmeter.protocol.http.sampler.SamplingNamingTest

> Task :src:dist-check:batchHTMLParserTestFile_2
May 08, 2020 10:46:32 AM java.util.prefs.WindowsPreferences <init>
WARNING: Could not open/create prefs root node Software\JavaSoft\Prefs at root 0x80000002.
Windows RegCreateKeyEx(...) returned error code 5.
Creating summariser <summary>
Created the tree successfully using F:\jenkins\jenkins-slave\workspace\JMeter Windows\bin\testfiles\HTMLParserTestFile_2.jmx
Starting standalone test @ Fri May 08 10:46:32 PDT 2020 (1588959992066)
Waiting for possible Shutdown/StopTestNow/HeapDump/ThreadDump message on port 4445
summary +      1 in 00:00:00 =    3.2/s Avg:   139 Min:   139 Max:   139 Err:     0 (0.00%)
Active: 1 Started: 1 Finished: 0
summary =      1 in 00:00:00 =    3.2/s Avg:   139 Min:   139 Max:   139 Err:     0 (0.00%)
Tidying up ...    @ Fri May 08 10:46:32 PDT 2020 (1588959992898)
... end of run
No errors present in the logfile F:\jenkins\jenkins-slave\workspace\JMeter Windows\bin\HTMLParserTestFile_2.log
(the file is empty)

> Task :src:dist-check:batchHttp4ImplDigestAuth SKIPPED

> Task :src:protocol:http:test
          0.3sec,   53 completed,   0 failed,   0 skipped, org.apache.jmeter.protocol.http.sampler.TestHTTPSamplersAgainstHttpMirrorServer
          0.0sec,    7 completed,   0 failed,   0 skipped, org.apache.jmeter.protocol.http.visualizers.RequestViewHTTPTest
          0.2sec,   11 completed,   0 failed,   0 skipped, org.apache.jmeter.protocol.http.control.DNSCacheManagerSpec
          0.1sec,   58 completed,   0 failed,   0 skipped, org.apache.jmeter.protocol.http.util.HTTPUtilsSpec
FAILURE  19.8sec,  629 completed,   1 failed,   3 skipped, Gradle Test Run :src:protocol:http:test

629 tests completed, 1 failed, 3 skipped

> Task :src:protocol:http:test FAILED

> Task :src:dist-check:batchHttp4ImplPreemptiveBasicAuth
May 08, 2020 10:46:34 AM java.util.prefs.WindowsPreferences <init>
WARNING: Could not open/create prefs root node Software\JavaSoft\Prefs at root 0x80000002.
Windows RegCreateKeyEx(...) returned error code 5.
Creating summariser <summary>
Created the tree successfully using F:\jenkins\jenkins-slave\workspace\JMeter Windows\bin\testfiles\Http4ImplPreemptiveBasicAuth.jmx
Starting standalone test @ Fri May 08 10:46:34 PDT 2020 (1588959994745)
Waiting for possible Shutdown/StopTestNow/HeapDump/ThreadDump message on port 4445
summary =     12 in 00:00:07 =    1.8/s Avg:   284 Min:    96 Max:   824 Err:     0 (0.00%)
Tidying up ...    @ Fri May 08 10:46:42 PDT 2020 (1588960002052)
... end of run
No errors present in the logfile F:\jenkins\jenkins-slave\workspace\JMeter Windows\bin\Http4ImplPreemptiveBasicAuth.log
(the file is empty)

> Task :src:dist:javadocAggregate
9 warnings
checksum-dependency elapsed time: 20082ms, configurations processed: 243
    SHA-512 computation time: 1282ms (goes in parallel, it might exceed wall-clock time),
files processed: 16, processed: 4MiB, skipped: 2811MiB
    PGP signature resolution time: 1959ms (wall-clock), resolution requests: 143, signatures
resolved: 230
    PGP key resolution time: 10406ms (wall-clock), resolution requests: 143, download time:
0ms (goes in parallel, it might exceed wall-clock time), keys downloaded: 0
        PGP signature verification time: 30532ms (goes in parallel, it might exceed wall-clock
time), files processed: 261, processed: 217MiB, skipped: 2572MiB

FAILURE: Build failed with an exception.

* What went wrong:
Execution failed for task ':src:protocol:http:test'.
> There were failing tests. See the report at: file:///F:/jenkins/jenkins-slave/workspace/JMeter%20Windows/src/protocol/http/build/reports/tests/test/index.html

* Try:
Run with --stacktrace option to get the stack trace. Run with --info or --debug option to
get more log output. Run with --scan to get full insights.

* Get more help at https://help.gradle.org

Deprecated Gradle features were used in this build, making it incompatible with Gradle 7.0.
Use '--warning-mode all' to show the individual deprecation warnings.
See https://docs.gradle.org/6.3/userguide/command_line_interface.html#sec:command_line_warnings

BUILD FAILED in 3m 47s
267 actionable tasks: 169 executed, 98 up-to-date
Could not open/create prefs root node Software\JavaSoft\Prefs at root 0x80000002. Windows
RegCreateKeyEx(...) returned error code 5.
Build step 'Invoke Gradle script' changed build result to FAILURE
Build step 'Invoke Gradle script' marked build as failure

Mime
View raw message