jmeter-dev mailing list archives

Site index · List index
Message view « Date » · « Thread »
Top « Date » · « Thread »
From Apache Jenkins Server <jenk...@builds.apache.org>
Subject Build failed in Jenkins: JMeter Windows #1679
Date Thu, 07 May 2020 19:39:12 GMT
See <https://builds.apache.org/job/JMeter%20Windows/1679/display/redirect?page=changes>

Changes:

[felix.schumacher] Remove deprecation warnings in test code


------------------------------------------
[...truncated 235.07 KB...]
Starting standalone test @ Thu May 07 12:37:24 PDT 2020 (1588880244030)
Waiting for possible Shutdown/StopTestNow/HeapDump/ThreadDump message on port 4445
summary =      2 in 00:00:02 =    1.2/s Avg:   445 Min:   334 Max:   557 Err:     0 (0.00%)
Tidying up ...    @ Thu May 07 12:37:26 PDT 2020 (1588880246236)
... end of run
No errors present in the logfile F:\jenkins\jenkins-slave\workspace\JMeter Windows\bin\ResponseDecompression.log
(the file is empty)
[server] Created remote object: UnicastServerRef2 [liveRef: [endpoint:[jenkins-win-he-de-5.apache.org:54781,SSLRMIServerSocketFactory(host=jenkins-win-he-de-5.apache.org/176.9.73.62,
keyStoreLocation=rmi_keystore.jks, type=JKS, trustStoreLocation=rmi_keystore.jks, type=JKS,
alias=rmi),SSLRMIClientSocketFactory(keyStoreLocation=rmi_keystore.jks, type=JKS, trustStoreLocation=rmi_keystore.jks,
type=JKS, alias=rmi)](local),objID:[1b5c8d35:171f0a48c0d:-7fff, -8886164240888662099]]][server]


> Task :src:dist-check:batchServerBatchTestLocal
Creating summariser <summary>
Created the tree successfully using F:\jenkins\jenkins-slave\workspace\JMeter Windows\bin\testfiles\BatchTestLocal.jmx
Configuring remote engine: jenkins-win-he-de-5.apache.org:54778
Starting distributed test with remote engines: [jenkins-win-he-de-5.apache.org:54778] @ Thu
May 07 12:37:31 PDT 2020 (1588880251631)

[server] Starting the test on host jenkins-win-he-de-5.apache.org:54778 @ Thu May 07 12:37:34
PDT 2020 (1588880254296)

> Task :src:dist-check:batchServerBatchTestLocal
Remote engines have been started:[jenkins-win-he-de-5.apache.org:54778]
Waiting for possible Shutdown/StopTestNow/HeapDump/ThreadDump message on port 4445
summary +      1 in 00:00:00 =   12.2/s Avg:     6 Min:     6 Max:     6 Err:     0 (0.00%)
Active: 1 Started: 1 Finished: 0

> Task :src:dist:compileTestJava NO-SOURCE
> Task :src:dist:testClasses UP-TO-DATE
> Task :src:dist:checkstyleTest NO-SOURCE
> Task :src:dist:spotbugsTest SKIPPED
> Task :src:dist:test NO-SOURCE
> Task :src:dist:check
[server] Finished the test on host jenkins-win-he-de-5.apache.org:54778 @ Thu May 07 12:37:41
PDT 2020 (1588880261603) - exit requested.

> Task :src:dist-check:batchServerBatchTestLocal
summary +    131 in 00:00:07 =   19.5/s Avg:     3 Min:     0 Max:    61 Err:    16 (12.21%)
Active: 0 Started: 11 Finished: 11
summary =    132 in 00:00:07 =   19.5/s Avg:     3 Min:     0 Max:    61 Err:    16 (12.12%)
Tidying up remote @ Thu May 07 12:37:41 PDT 2020 (1588880261603)
... end of run
No errors present in the logfile F:\jenkins\jenkins-slave\workspace\JMeter Windows\bin\BatchTestLocal.log
(the file is empty)
No errors present in the logfile F:\jenkins\jenkins-slave\workspace\JMeter Windows\bin\BatchTestLocalServer.log
(the file is empty)

> Task :src:dist-check:batchSlowCharsFeatureHttpClient4 SKIPPED
> Task :src:dist-check:batchSlowCharsFeatureJava SKIPPED
> Task :src:dist-check:batchTCP_TESTS SKIPPED

> Task :src:dist-check:batchTEST_HTTPHttpClient4
Creating summariser <summary>
Created the tree successfully using F:\jenkins\jenkins-slave\workspace\JMeter Windows\bin\testfiles\TEST_HTTP.jmx
Starting standalone test @ Thu May 07 12:37:49 PDT 2020 (1588880269044)
Waiting for possible Shutdown/StopTestNow/HeapDump/ThreadDump message on port 4445

> Task :src:dist:distTar
> Task :src:dist:distTarSha512
> Task :src:dist:distTarSourceSha512

> Task :src:dist-check:batchTEST_HTTPHttpClient4
summary =     22 in 00:00:01 =   17.6/s Avg:    37 Min:     1 Max:   410 Err:     0 (0.00%)
Tidying up ...    @ Thu May 07 12:37:50 PDT 2020 (1588880270690)
... end of run
No errors present in the logfile F:\jenkins\jenkins-slave\workspace\JMeter Windows\bin\TEST_HTTP.log
(the file is empty)

> Task :src:dist-check:batchTEST_HTTPJava
Creating summariser <summary>
Created the tree successfully using F:\jenkins\jenkins-slave\workspace\JMeter Windows\bin\testfiles\TEST_HTTP.jmx
Starting standalone test @ Thu May 07 12:37:53 PDT 2020 (1588880273959)
Waiting for possible Shutdown/StopTestNow/HeapDump/ThreadDump message on port 4445
summary =     20 in 00:00:01 =   16.1/s Avg:    41 Min:     1 Max:   401 Err:     0 (0.00%)
Tidying up ...    @ Thu May 07 12:37:55 PDT 2020 (1588880275507)
... end of run
WARNING: the task was configured to ignore errors in the output log
Logfile contents (errors during the test, see F:\jenkins\jenkins-slave\workspace\JMeter Windows\bin\TEST_HTTP.log):
2020-05-07 12:37:55,403 ERROR o.a.j.p.h.s.HTTPJavaImpl: readResponse: java.net.ProtocolException:
Server redirected too many  times (20)
2020-05-07 12:37:55,405 ERROR o.a.j.p.h.s.HTTPJavaImpl: Cause: java.net.ProtocolException:
Server redirected too many  times (20)
2020-05-07 12:37:55,405 ERROR o.a.j.p.h.c.HttpMirrorThread: Invalid request received:''

> Task :src:dist:distZip
> Task :src:dist:distZipSha512

> Task :src:dist-check:batchTEST_HTTPS
Creating summariser <summary>
Created the tree successfully using F:\jenkins\jenkins-slave\workspace\JMeter Windows\bin\testfiles\TEST_HTTPS.jmx
Starting standalone test @ Thu May 07 12:37:58 PDT 2020 (1588880278342)
Waiting for possible Shutdown/StopTestNow/HeapDump/ThreadDump message on port 4445
summary +      1 in 00:00:02 =    0.7/s Avg:  1248 Min:  1248 Max:  1248 Err:     0 (0.00%)
Active: 1 Started: 1 Finished: 0
summary +      1 in 00:00:00 =    5.4/s Avg:   179 Min:   179 Max:   179 Err:     0 (0.00%)
Active: 0 Started: 1 Finished: 1
summary =      2 in 00:00:02 =    1.2/s Avg:   713 Min:   179 Max:  1248 Err:     0 (0.00%)
Tidying up ...    @ Thu May 07 12:38:00 PDT 2020 (1588880280536)
... end of run
No errors present in the logfile F:\jenkins\jenkins-slave\workspace\JMeter Windows\bin\TEST_HTTPS.log
(the file is empty)

> Task :src:dist-check:batchTestCookieManager
Creating summariser <summary>
Created the tree successfully using F:\jenkins\jenkins-slave\workspace\JMeter Windows\bin\testfiles\TestCookieManager.jmx
Starting standalone test @ Thu May 07 12:38:02 PDT 2020 (1588880282547)
Waiting for possible Shutdown/StopTestNow/HeapDump/ThreadDump message on port 4445
summary +      1 in 00:00:00 =    2.2/s Avg:   429 Min:   429 Max:   429 Err:     0 (0.00%)
Active: 1 Started: 1 Finished: 0

> Task :src:dist:distZipSource
> Task :src:dist:distZipSourceSha512
> Task :src:dist:processSiteXslt

> Task :src:dist-check:batchTestCookieManager
summary +      9 in 00:00:07 =    1.3/s Avg:   718 Min:     1 Max:  2011 Err:     0 (0.00%)
Active: 0 Started: 1 Finished: 1
summary =     10 in 00:00:07 =    1.3/s Avg:   689 Min:     1 Max:  2011 Err:     0 (0.00%)
Tidying up ...    @ Thu May 07 12:38:10 PDT 2020 (1588880290627)
... end of run
No errors present in the logfile F:\jenkins\jenkins-slave\workspace\JMeter Windows\bin\TestCookieManager.log
(the file is empty)

> Task :src:dist-check:batchTestHeaderManagerHttpClient4
Creating summariser <summary>
Created the tree successfully using F:\jenkins\jenkins-slave\workspace\JMeter Windows\bin\testfiles\TestHeaderManager.jmx
Starting standalone test @ Thu May 07 12:38:13 PDT 2020 (1588880293300)
Waiting for possible Shutdown/StopTestNow/HeapDump/ThreadDump message on port 4445
summary =      3 in 00:00:06 =    0.5/s Avg:  2014 Min:  2002 Max:  2037 Err:     0 (0.00%)
Tidying up ...    @ Thu May 07 12:38:20 PDT 2020 (1588880300346)
... end of run
No errors present in the logfile F:\jenkins\jenkins-slave\workspace\JMeter Windows\bin\TestHeaderManager.log
(the file is empty)

> Task :src:dist-check:batchTestHeaderManagerJava
Creating summariser <summary>
Created the tree successfully using F:\jenkins\jenkins-slave\workspace\JMeter Windows\bin\testfiles\TestHeaderManager.jmx
Starting standalone test @ Thu May 07 12:38:22 PDT 2020 (1588880302390)
Waiting for possible Shutdown/StopTestNow/HeapDump/ThreadDump message on port 4445
summary =      3 in 00:00:05 =    0.6/s Avg:  1005 Min:  1001 Max:  1013 Err:     0 (0.00%)
Tidying up ...    @ Thu May 07 12:38:28 PDT 2020 (1588880308156)
... end of run
No errors present in the logfile F:\jenkins\jenkins-slave\workspace\JMeter Windows\bin\TestHeaderManager.log
(the file is empty)

> Task :src:dist-check:batchTestKeepAlive SKIPPED
> Task :src:dist-check:batchTestRedirectionPolicies SKIPPED

> Task :src:dist-check:batchTestResultStatusAction
Creating summariser <summary>
Created the tree successfully using F:\jenkins\jenkins-slave\workspace\JMeter Windows\bin\testfiles\TestResultStatusAction.jmx
Starting standalone test @ Thu May 07 12:38:30 PDT 2020 (1588880310086)
Waiting for possible Shutdown/StopTestNow/HeapDump/ThreadDump message on port 4445
summary +      1 in 00:00:01 =    1.8/s Avg:     1 Min:     1 Max:     1 Err:     0 (0.00%)
Active: 1 Started: 1 Finished: 0
summary +    134 in 00:00:01 =  267.5/s Avg:     0 Min:     0 Max:    51 Err:    18 (13.43%)
Active: 0 Started: 4 Finished: 4
summary =    135 in 00:00:01 =  128.7/s Avg:     0 Min:     0 Max:    51 Err:    18 (13.33%)
Tidying up ...    @ Thu May 07 12:38:31 PDT 2020 (1588880311939)
... end of run
No errors present in the logfile F:\jenkins\jenkins-slave\workspace\JMeter Windows\bin\TestResultStatusAction.log
(the file is empty)

> Task :src:dist-check:batchTestSchedulerWithTimer
Creating summariser <summary>
Created the tree successfully using F:\jenkins\jenkins-slave\workspace\JMeter Windows\bin\testfiles\TestSchedulerWithTimer.jmx
Starting standalone test @ Thu May 07 12:38:33 PDT 2020 (1588880313718)
Waiting for possible Shutdown/StopTestNow/HeapDump/ThreadDump message on port 4445
summary +      1 in 00:00:00 =    2.3/s Avg:   414 Min:   414 Max:   414 Err:     0 (0.00%)
Active: 1 Started: 1 Finished: 0

> Task :src:dist:previewSite

> Task :src:dist-check:batchTestSchedulerWithTimer
summary +      4 in 00:00:05 =    0.8/s Avg:    21 Min:     1 Max:    83 Err:     0 (0.00%)
Active: 0 Started: 1 Finished: 1
summary =      5 in 00:00:06 =    0.9/s Avg:   100 Min:     1 Max:   414 Err:     0 (0.00%)
Tidying up ...    @ Thu May 07 12:38:39 PDT 2020 (1588880319971)
... end of run
No errors present in the logfile F:\jenkins\jenkins-slave\workspace\JMeter Windows\bin\TestSchedulerWithTimer.log
(the file is empty)

> Task :src:dist-check:batchTests

> Task :src:dist-check:test

Gradle Test Executor 19 STANDARD_OUT
    Setting JMeterHome: F:\jenkins\jenkins-slave\workspace\JMeter Windows\src\dist-check\..\..\.
    Initializing Properties: ../.././bin/jmeter.properties
    JMeterVersion=5.3-SNAPSHOT 64f92a1
    java.version=1.8.0_152
    java.vm.name=Java HotSpot(TM) 64-Bit Server VM
    java.vendor=Oracle Corporation
    java.home=F:\jenkins\tools\java\latest1.8\jre
    file.encoding=windows-1252
    default encoding=windows-1252
    user.home=C:\Windows\system32\config\systemprofile
    user.dir=F:\jenkins\jenkins-slave\workspace\JMeter Windows\src\dist-check
    user.language=en
    user.region=null
    user.country=US
    user.variant=
    Locale=en_US
    java.class.version=52.0
    java.awt.headless=null
    os.name=Windows Server 2016
    os.version=10.0
    os.arch=amd64

> Task :src:dist:assemble

> Task :src:dist-check:test
    o.a.j.junit.JMeterTest WARN: org.apache.jmeter.gui.JMeterGUIComponent: NoSuchMethodException
 org.apache.jmeter.gui.menu.StaticJMeterGUIComponent, missing empty Constructor or Constructor
with Object parameter
    Last class=org.apache.jmeter.protocol.smtp.sampler.gui.SmtpSamplerGui
    objects.size=77
    Last error=java.lang.InstantiationException: org.apache.jmeter.gui.menu.StaticJMeterGUIComponent
          0.1sec,    9 completed,   0 failed,   0 skipped, org.apache.jmeter.control.TestSwitchController
          0.0sec,    2 completed,   0 failed,   0 skipped, org.apache.jmeter.resources.TestPropertiesFiles
          1.3sec,    5 completed,   0 failed,   0 skipped, org.apache.jmeter.save.TestSaveService
          0.0sec,    1 completed,   0 failed,   0 skipped, org.apache.jmeter.threads.ThreadGroupLoad
          8.9sec, org.apache.jorphan.reflect.TestClassFinder > testFindClassesThatExtendStringArrayClassOfQArrayTrue()
          4.1sec, org.apache.jorphan.reflect.TestClassFinder > testFindAnnotatedClasses()
         15.0sec,    9 completed,   0 failed,   0 skipped, org.apache.jorphan.reflect.TestClassFinder
          0.1sec,    7 completed,   0 failed,   0 skipped, org.apache.jorphan.TestFunctorUsers
FAILURE   0.0sec, org.apache.jmeter.junit.JMeterTest, initializationError
    java.lang.Exception: Error creating org.apache.jmeter.protocol.smtp.sampler.gui.SmtpSamplerGui
        at org.apache.jmeter.junit.JMeterTest.instantiateClass(JMeterTest.java:543)
        at org.apache.jmeter.junit.JMeterTest.getObjects(JMeterTest.java:473)
        at org.apache.jmeter.junit.JMeterTest.suiteGUIComponents(JMeterTest.java:270)
        at org.apache.jmeter.junit.JMeterTest.suite(JMeterTest.java:147)
        Caused by: java.lang.NullPointerException
            at sun.awt.shell.Win32ShellFolder2.access$200(Win32ShellFolder2.java:72)
            at sun.awt.shell.Win32ShellFolder2$1.call(Win32ShellFolder2.java:242)
            at sun.awt.shell.Win32ShellFolder2$1.call(Win32ShellFolder2.java:237)
            at java.util.concurrent.FutureTask.run(FutureTask.java:266)
            at java.util.concurrent.ThreadPoolExecutor.runWorker(ThreadPoolExecutor.java:1149)
            at java.util.concurrent.ThreadPoolExecutor$Worker.run(ThreadPoolExecutor.java:624)
            at sun.awt.shell.Win32ShellFolderManager2$ComInvoker$3.run(Win32ShellFolderManager2.java:547)
            at java.lang.Thread.run(Thread.java:748)

FAILURE   0.0sec,    1 completed,   1 failed,   0 skipped, org.apache.jmeter.junit.JMeterTest
          0.1sec,  100 completed,   0 failed,   0 skipped, org.apache.jmeter.functions.ComponentReferenceFunctionTest
          1.0sec,   82 completed,   0 failed,   0 skipped, org.apache.jmeter.gui.action.TestLoad
          1.0sec,  374 completed,   0 failed,   0 skipped, org.apache.jmeter.testbeans.gui.PackageTest
          0.1sec,  140 completed,   0 failed,   0 skipped, org.apache.jmeter.testelement.TestElementTest
          0.4sec,   22 completed,   0 failed,   0 skipped, org.apache.jmeter.engine.util.PackageSpec
          2.6sec, org.apache.jmeter.gui.action.HtmlReportGeneratorSpec, check that report
generation succeeds and statistic are generated
          4.2sec,    3 completed,   0 failed,   0 skipped, org.apache.jmeter.gui.action.HtmlReportGeneratorSpec
          0.1sec,    2 completed,   0 failed,   0 skipped, org.apache.jmeter.gui.util.MenuFactorySpec
          0.6sec,    2 completed,   0 failed,   0 skipped, org.apache.jmeter.report.dashboard.ReportGeneratorSpec
FAILURE  30.8sec,  759 completed,   1 failed,   0 skipped, Gradle Test Run :src:dist-check:test

759 tests completed, 1 failed

> Task :src:dist-check:test FAILED
checksum-dependency elapsed time: 11127ms, configurations processed: 246 (add -PchecksumTimingsPrint
to print detailed timings)

FAILURE: Build failed with an exception.

* What went wrong:
Execution failed for task ':src:dist-check:test'.
> There were failing tests. See the report at: file:///F:/jenkins/jenkins-slave/workspace/JMeter%20Windows/src/dist-check/build/reports/tests/test/index.html

* Try:
Run with --stacktrace option to get the stack trace. Run with --info or --debug option to
get more log output. Run with --scan to get full insights.

* Get more help at https://help.gradle.org

Deprecated Gradle features were used in this build, making it incompatible with Gradle 7.0.
Use '--warning-mode all' to show the individual deprecation warnings.
See https://docs.gradle.org/6.3/userguide/command_line_interface.html#sec:command_line_warnings

BUILD FAILED in 4m 46s
287 actionable tasks: 185 executed, 102 up-to-date
Build step 'Invoke Gradle script' changed build result to FAILURE
Build step 'Invoke Gradle script' marked build as failure

Mime
View raw message