jmeter-dev mailing list archives

Site index · List index
Message view « Date » · « Thread »
Top « Date » · « Thread »
From Apache Jenkins Server <jenk...@builds.apache.org>
Subject Build failed in Jenkins: JMeter Windows #1677
Date Wed, 06 May 2020 07:53:25 GMT
See <https://builds.apache.org/job/JMeter%20Windows/1677/display/redirect?page=changes>

Changes:

[antonio] Add default values in user.properties file Useful to have the default


------------------------------------------
[...truncated 258.22 KB...]
    user.region=null
    user.country=US
    user.variant=
    Locale=en_US
    java.class.version=52.0
    java.awt.headless=null
    os.name=Windows Server 2016
    os.version=10.0
    os.arch=amd64
    o.a.j.junit.JMeterTest WARN: org.apache.jmeter.gui.JMeterGUIComponent: NoSuchMethodException
 org.apache.jmeter.gui.menu.StaticJMeterGUIComponent, missing empty Constructor or Constructor
with Object parameter
    Last class=org.apache.jmeter.protocol.smtp.sampler.gui.SmtpSamplerGui
    objects.size=77
    Last error=java.lang.InstantiationException: org.apache.jmeter.gui.menu.StaticJMeterGUIComponent

Gradle Test Executor 19 STANDARD_ERROR
    Exception in thread "AWT-EventQueue-0" java.lang.NullPointerException
    	at org.apache.jmeter.protocol.http.proxy.ProxyControl.getJmeterTreeModel(ProxyControl.java:890)
    	at org.apache.jmeter.protocol.http.proxy.ProxyControl.putSamplesIntoModel(ProxyControl.java:1137)
    	at javax.swing.Timer.fireActionPerformed(Timer.java:313)
    	at javax.swing.Timer$DoPostEvent.run(Timer.java:245)
    	at java.awt.event.InvocationEvent.dispatch(InvocationEvent.java:311)
    	at java.awt.EventQueue.dispatchEventImpl(EventQueue.java:756)
    	at java.awt.EventQueue.access$500(EventQueue.java:97)
    	at java.awt.EventQueue$3.run(EventQueue.java:709)
    	at java.awt.EventQueue$3.run(EventQueue.java:703)
    	at java.security.AccessController.doPrivileged(Native Method)
    	at java.security.ProtectionDomain$JavaSecurityAccessImpl.doIntersectionPrivilege(ProtectionDomain.java:80)
    	at java.awt.EventQueue.dispatchEvent(EventQueue.java:726)
    	at java.awt.EventDispatchThread.pumpOneEventForFilters(EventDispatchThread.java:201)
    	at java.awt.EventDispatchThread.pumpEventsForFilter(EventDispatchThread.java:116)
    	at java.awt.EventDispatchThread.pumpEventsForHierarchy(EventDispatchThread.java:105)
    	at java.awt.EventDispatchThread.pumpEvents(EventDispatchThread.java:101)
    	at java.awt.EventDispatchThread.pumpEvents(EventDispatchThread.java:93)
    	at java.awt.EventDispatchThread.run(EventDispatchThread.java:82)
          0.1sec,    9 completed,   0 failed,   0 skipped, org.apache.jmeter.control.TestSwitchController
          0.0sec,    2 completed,   0 failed,   0 skipped, org.apache.jmeter.resources.TestPropertiesFiles

TestSaveService > testLoadAndSave() STANDARD_ERROR
    Exception in thread "AWT-EventQueue-0" java.lang.NullPointerException
    	at org.apache.jmeter.protocol.http.proxy.ProxyControl.getJmeterTreeModel(ProxyControl.java:890)
    	at org.apache.jmeter.protocol.http.proxy.ProxyControl.putSamplesIntoModel(ProxyControl.java:1137)
    	at javax.swing.Timer.fireActionPerformed(Timer.java:313)
    	at javax.swing.Timer$DoPostEvent.run(Timer.java:245)
    	at java.awt.event.InvocationEvent.dispatch(InvocationEvent.java:311)
    	at java.awt.EventQueue.dispatchEventImpl(EventQueue.java:756)
    	at java.awt.EventQueue.access$500(EventQueue.java:97)
    	at java.awt.EventQueue$3.run(EventQueue.java:709)
    	at java.awt.EventQueue$3.run(EventQueue.java:703)
    	at java.security.AccessController.doPrivileged(Native Method)
    	at java.security.ProtectionDomain$JavaSecurityAccessImpl.doIntersectionPrivilege(ProtectionDomain.java:80)
    	at java.awt.EventQueue.dispatchEvent(EventQueue.java:726)
    	at java.awt.EventDispatchThread.pumpOneEventForFilters(EventDispatchThread.java:201)
    	at java.awt.EventDispatchThread.pumpEventsForFilter(EventDispatchThread.java:116)
    	at java.awt.EventDispatchThread.pumpEventsForHierarchy(EventDispatchThread.java:105)
    	at java.awt.EventDispatchThread.pumpEvents(EventDispatchThread.java:101)
    	at java.awt.EventDispatchThread.pumpEvents(EventDispatchThread.java:93)
    	at java.awt.EventDispatchThread.run(EventDispatchThread.java:82)
    Exception in thread "AWT-EventQueue-0" java.lang.NullPointerException
    	at org.apache.jmeter.protocol.http.proxy.ProxyControl.getJmeterTreeModel(ProxyControl.java:890)
    	at org.apache.jmeter.protocol.http.proxy.ProxyControl.putSamplesIntoModel(ProxyControl.java:1137)
    	at javax.swing.Timer.fireActionPerformed(Timer.java:313)
    	at javax.swing.Timer$DoPostEvent.run(Timer.java:245)
    	at java.awt.event.InvocationEvent.dispatch(InvocationEvent.java:311)
    	at java.awt.EventQueue.dispatchEventImpl(EventQueue.java:756)
    	at java.awt.EventQueue.access$500(EventQueue.java:97)
    	at java.awt.EventQueue$3.run(EventQueue.java:709)
    	at java.awt.EventQueue$3.run(EventQueue.java:703)
    	at java.security.AccessController.doPrivileged(Native Method)
    	at java.security.ProtectionDomain$JavaSecurityAccessImpl.doIntersectionPrivilege(ProtectionDomain.java:80)
    	at java.awt.EventQueue.dispatchEvent(EventQueue.java:726)
    	at java.awt.EventDispatchThread.pumpOneEventForFilters(EventDispatchThread.java:201)
    	at java.awt.EventDispatchThread.pumpEventsForFilter(EventDispatchThread.java:116)
    	at java.awt.EventDispatchThread.pumpEventsForHierarchy(EventDispatchThread.java:105)
    	at java.awt.EventDispatchThread.pumpEvents(EventDispatchThread.java:101)
    	at java.awt.EventDispatchThread.pumpEvents(EventDispatchThread.java:93)
    	at java.awt.EventDispatchThread.run(EventDispatchThread.java:82)
          1.1sec,    5 completed,   0 failed,   0 skipped, org.apache.jmeter.save.TestSaveService
          0.0sec,    1 completed,   0 failed,   0 skipped, org.apache.jmeter.threads.ThreadGroupLoad
          9.4sec, org.apache.jorphan.reflect.TestClassFinder > testFindClassesThatExtendStringArrayClassOfQArrayTrue()
          4.9sec, org.apache.jorphan.reflect.TestClassFinder > testFindAnnotatedClasses()
         16.1sec,    9 completed,   0 failed,   0 skipped, org.apache.jorphan.reflect.TestClassFinder
          0.1sec,    7 completed,   0 failed,   0 skipped, org.apache.jorphan.TestFunctorUsers
          0.1sec,  100 completed,   0 failed,   0 skipped, org.apache.jmeter.functions.ComponentReferenceFunctionTest

TestLoad > checkTestFile F:\jenkins\jenkins-slave\workspace\JMeter Windows\bin\testfiles\GenTest25.jmx
testfiles STANDARD_ERROR
    Exception in thread "AWT-EventQueue-0" java.lang.NullPointerException
    	at org.apache.jmeter.protocol.http.proxy.ProxyControl.getJmeterTreeModel(ProxyControl.java:890)
    	at org.apache.jmeter.protocol.http.proxy.ProxyControl.putSamplesIntoModel(ProxyControl.java:1137)
    	at javax.swing.Timer.fireActionPerformed(Timer.java:313)
    	at javax.swing.Timer$DoPostEvent.run(Timer.java:245)
    	at java.awt.event.InvocationEvent.dispatch(InvocationEvent.java:311)
    	at java.awt.EventQueue.dispatchEventImpl(EventQueue.java:756)
    	at java.awt.EventQueue.access$500(EventQueue.java:97)
    	at java.awt.EventQueue$3.run(EventQueue.java:709)
    	at java.awt.EventQueue$3.run(EventQueue.java:703)
    	at java.security.AccessController.doPrivileged(Native Method)
    	at java.security.ProtectionDomain$JavaSecurityAccessImpl.doIntersectionPrivilege(ProtectionDomain.java:80)
    	at java.awt.EventQueue.dispatchEvent(EventQueue.java:726)
    	at java.awt.EventDispatchThread.pumpOneEventForFilters(EventDispatchThread.java:201)
    	at java.awt.EventDispatchThread.pumpEventsForFilter(EventDispatchThread.java:116)
    	at java.awt.EventDispatchThread.pumpEventsForHierarchy(EventDispatchThread.java:105)
    	at java.awt.EventDispatchThread.pumpEvents(EventDispatchThread.java:101)
    	at java.awt.EventDispatchThread.pumpEvents(EventDispatchThread.java:93)
    	at java.awt.EventDispatchThread.run(EventDispatchThread.java:82)

TestLoad > checkTestFile F:\jenkins\jenkins-slave\workspace\JMeter Windows\bin\testfiles\TEST_HTTP.jmx
testfiles STANDARD_ERROR
    Exception in thread "AWT-EventQueue-0" java.lang.NullPointerException
    	at org.apache.jmeter.protocol.http.proxy.ProxyControl.getJmeterTreeModel(ProxyControl.java:890)
    	at org.apache.jmeter.protocol.http.proxy.ProxyControl.putSamplesIntoModel(ProxyControl.java:1137)
    	at javax.swing.Timer.fireActionPerformed(Timer.java:313)
    	at javax.swing.Timer$DoPostEvent.run(Timer.java:245)
    	at java.awt.event.InvocationEvent.dispatch(InvocationEvent.java:311)
    	at java.awt.EventQueue.dispatchEventImpl(EventQueue.java:756)
    	at java.awt.EventQueue.access$500(EventQueue.java:97)
    	at java.awt.EventQueue$3.run(EventQueue.java:709)
    	at java.awt.EventQueue$3.run(EventQueue.java:703)
    	at java.security.AccessController.doPrivileged(Native Method)
    	at java.security.ProtectionDomain$JavaSecurityAccessImpl.doIntersectionPrivilege(ProtectionDomain.java:80)
    	at java.awt.EventQueue.dispatchEvent(EventQueue.java:726)
    	at java.awt.EventDispatchThread.pumpOneEventForFilters(EventDispatchThread.java:201)
    	at java.awt.EventDispatchThread.pumpEventsForFilter(EventDispatchThread.java:116)
    	at java.awt.EventDispatchThread.pumpEventsForHierarchy(EventDispatchThread.java:105)
    	at java.awt.EventDispatchThread.pumpEvents(EventDispatchThread.java:101)
    	at java.awt.EventDispatchThread.pumpEvents(EventDispatchThread.java:93)
    	at java.awt.EventDispatchThread.run(EventDispatchThread.java:82)
          1.1sec,   82 completed,   0 failed,   0 skipped, org.apache.jmeter.gui.action.TestLoad
FAILURE   0.0sec, org.apache.jmeter.junit.JMeterTest, initializationError
    java.lang.Exception: Error creating org.apache.jmeter.protocol.smtp.sampler.gui.SmtpSamplerGui
        at org.apache.jmeter.junit.JMeterTest.instantiateClass(JMeterTest.java:543)
        at org.apache.jmeter.junit.JMeterTest.getObjects(JMeterTest.java:473)
        at org.apache.jmeter.junit.JMeterTest.suiteGUIComponents(JMeterTest.java:270)
        at org.apache.jmeter.junit.JMeterTest.suite(JMeterTest.java:147)
        Caused by: java.lang.NullPointerException
            at sun.awt.shell.Win32ShellFolder2.access$200(Win32ShellFolder2.java:72)
            at sun.awt.shell.Win32ShellFolder2$1.call(Win32ShellFolder2.java:242)
            at sun.awt.shell.Win32ShellFolder2$1.call(Win32ShellFolder2.java:237)
            at java.util.concurrent.FutureTask.run(FutureTask.java:266)
            at java.util.concurrent.ThreadPoolExecutor.runWorker(ThreadPoolExecutor.java:1149)
            at java.util.concurrent.ThreadPoolExecutor$Worker.run(ThreadPoolExecutor.java:624)
            at sun.awt.shell.Win32ShellFolderManager2$ComInvoker$3.run(Win32ShellFolderManager2.java:547)
            at java.lang.Thread.run(Thread.java:748)

FAILURE   0.0sec,    1 completed,   1 failed,   0 skipped, org.apache.jmeter.junit.JMeterTest

Gradle Test Executor 19 STANDARD_ERROR
    Exception in thread "AWT-EventQueue-0" java.lang.NullPointerException
    	at org.apache.jmeter.protocol.http.proxy.ProxyControl.getJmeterTreeModel(ProxyControl.java:890)
    	at org.apache.jmeter.protocol.http.proxy.ProxyControl.putSamplesIntoModel(ProxyControl.java:1137)
    	at javax.swing.Timer.fireActionPerformed(Timer.java:313)

PackageTest STANDARD_ERROR
    	at javax.swing.Timer$DoPostEvent.run(Timer.java:245)
    	at java.awt.event.InvocationEvent.dispatch(InvocationEvent.java:311)
    	at java.awt.EventQueue.dispatchEventImpl(EventQueue.java:756)
    	at java.awt.EventQueue.access$500(EventQueue.java:97)
    	at java.awt.EventQueue$3.run(EventQueue.java:709)
    	at java.awt.EventQueue$3.run(EventQueue.java:703)
    	at java.security.AccessController.doPrivileged(Native Method)
    	at java.security.ProtectionDomain$JavaSecurityAccessImpl.doIntersectionPrivilege(ProtectionDomain.java:80)
    	at java.awt.EventQueue.dispatchEvent(EventQueue.java:726)
    	at java.awt.EventDispatchThread.pumpOneEventForFilters(EventDispatchThread.java:201)
    	at java.awt.EventDispatchThread.pumpEventsForFilter(EventDispatchThread.java:116)
    	at java.awt.EventDispatchThread.pumpEventsForHierarchy(EventDispatchThread.java:105)
    	at java.awt.EventDispatchThread.pumpEvents(EventDispatchThread.java:101)
    	at java.awt.EventDispatchThread.pumpEvents(EventDispatchThread.java:93)

PackageTest > org.apache.jmeter.assertions.BSFAssertion - en -  en class org.apache.jmeter.assertions.BSFAssertion
STANDARD_ERROR
    	at java.awt.EventDispatchThread.run(EventDispatchThread.java:82)

PackageTest STANDARD_ERROR
    Exception in thread "AWT-EventQueue-0" java.lang.NullPointerException
    	at org.apache.jmeter.protocol.http.proxy.ProxyControl.getJmeterTreeModel(ProxyControl.java:890)
    	at org.apache.jmeter.protocol.http.proxy.ProxyControl.putSamplesIntoModel(ProxyControl.java:1137)
    	at javax.swing.Timer.fireActionPerformed(Timer.java:313)
    	at javax.swing.Timer$DoPostEvent.run(Timer.java:245)
    	at java.awt.event.InvocationEvent.dispatch(InvocationEvent.java:311)

PackageTest > org.apache.jmeter.config.KeystoreConfig - zh - TW zh_TW class org.apache.jmeter.config.KeystoreConfig
STANDARD_ERROR
    	at java.awt.EventQueue.dispatchEventImpl(EventQueue.java:756)
    	at java.awt.EventQueue.access$500(EventQueue.java:97)
    	at java.awt.EventQueue$3.run(EventQueue.java:709)
    	at java.awt.EventQueue$3.run(EventQueue.java:703)
    	at java.security.AccessController.doPrivileged(Native Method)
    	at java.security.ProtectionDomain$JavaSecurityAccessImpl.doIntersectionPrivilege(ProtectionDomain.java:80)
    	at java.awt.EventQueue.dispatchEvent(EventQueue.java:726)
    	at java.awt.EventDispatchThread.pumpOneEventForFilters(EventDispatchThread.java:201)
    	at java.awt.EventDispatchThread.pumpEventsForFilter(EventDispatchThread.java:116)
    	at java.awt.EventDispatchThread.pumpEventsForHierarchy(EventDispatchThread.java:105)
    	at java.awt.EventDispatchThread.pumpEvents(EventDispatchThread.java:101)
    	at java.awt.EventDispatchThread.pumpEvents(EventDispatchThread.java:93)
    	at java.awt.EventDispatchThread.run(EventDispatchThread.java:82)
          1.3sec,  374 completed,   0 failed,   0 skipped, org.apache.jmeter.testbeans.gui.PackageTest
          0.2sec,  140 completed,   0 failed,   0 skipped, org.apache.jmeter.testelement.TestElementTest

PackageSpec > testFunctionParse1 STANDARD_ERROR
    Exception in thread "AWT-EventQueue-0" java.lang.NullPointerException
    	at org.apache.jmeter.protocol.http.proxy.ProxyControl.getJmeterTreeModel(ProxyControl.java:890)
    	at org.apache.jmeter.protocol.http.proxy.ProxyControl.putSamplesIntoModel(ProxyControl.java:1137)
    	at javax.swing.Timer.fireActionPerformed(Timer.java:313)
    	at javax.swing.Timer$DoPostEvent.run(Timer.java:245)
    	at java.awt.event.InvocationEvent.dispatch(InvocationEvent.java:311)
    	at java.awt.EventQueue.dispatchEventImpl(EventQueue.java:756)
    	at java.awt.EventQueue.access$500(EventQueue.java:97)
    	at java.awt.EventQueue$3.run(EventQueue.java:709)
    	at java.awt.EventQueue$3.run(EventQueue.java:703)
    	at java.security.AccessController.doPrivileged(Native Method)
    	at java.security.ProtectionDomain$JavaSecurityAccessImpl.doIntersectionPrivilege(ProtectionDomain.java:80)
    	at java.awt.EventQueue.dispatchEvent(EventQueue.java:726)
    	at java.awt.EventDispatchThread.pumpOneEventForFilters(EventDispatchThread.java:201)
    	at java.awt.EventDispatchThread.pumpEventsForFilter(EventDispatchThread.java:116)
    	at java.awt.EventDispatchThread.pumpEventsForHierarchy(EventDispatchThread.java:105)
    	at java.awt.EventDispatchThread.pumpEvents(EventDispatchThread.java:101)
    	at java.awt.EventDispatchThread.pumpEvents(EventDispatchThread.java:93)
    	at java.awt.EventDispatchThread.run(EventDispatchThread.java:82)
          0.4sec,   22 completed,   0 failed,   0 skipped, org.apache.jmeter.engine.util.PackageSpec
          2.9sec, org.apache.jmeter.gui.action.HtmlReportGeneratorSpec, check that report
generation succeeds and statistic are generated
          4.6sec,    3 completed,   0 failed,   0 skipped, org.apache.jmeter.gui.action.HtmlReportGeneratorSpec
          0.2sec,    2 completed,   0 failed,   0 skipped, org.apache.jmeter.gui.util.MenuFactorySpec
          0.6sec,    2 completed,   0 failed,   0 skipped, org.apache.jmeter.report.dashboard.ReportGeneratorSpec
FAILURE  32.6sec,  759 completed,   1 failed,   0 skipped, Gradle Test Run :src:dist-check:test

759 tests completed, 1 failed

> Task :src:dist-check:test FAILED
checksum-dependency elapsed time: 99163ms, configurations processed: 246
    SHA-512 computation time: 65ms (goes in parallel, it might exceed wall-clock time), files
processed: 16, processed: 4MiB, skipped: 2860MiB
    PGP signature resolution time: 42759ms (wall-clock), resolution requests: 145, signatures
resolved: 230
    PGP key resolution time: 6877ms (wall-clock), resolution requests: 145, download time:
0ms (goes in parallel, it might exceed wall-clock time), keys downloaded: 0
        PGP signature verification time: 7188ms (goes in parallel, it might exceed wall-clock
time), files processed: 372, processed: 383MiB, skipped: 2455MiB

FAILURE: Build failed with an exception.

* What went wrong:
Execution failed for task ':src:dist-check:test'.
> There were failing tests. See the report at: file:///F:/jenkins/jenkins-slave/workspace/JMeter%20Windows/src/dist-check/build/reports/tests/test/index.html

* Try:
Run with --stacktrace option to get the stack trace. Run with --info or --debug option to
get more log output. Run with --scan to get full insights.

* Get more help at https://help.gradle.org

Deprecated Gradle features were used in this build, making it incompatible with Gradle 7.0.
Use '--warning-mode all' to show the individual deprecation warnings.
See https://docs.gradle.org/6.3/userguide/command_line_interface.html#sec:command_line_warnings

BUILD FAILED in 14m 47s
287 actionable tasks: 209 executed, 78 up-to-date
Build step 'Invoke Gradle script' changed build result to FAILURE
Build step 'Invoke Gradle script' marked build as failure

Mime
View raw message