jmeter-dev mailing list archives

Site index · List index
Message view « Date » · « Thread »
Top « Date » · « Thread »
From Apache Jenkins Server <jenk...@builds.apache.org>
Subject Build failed in Jenkins: JMeter-trunk #7801
Date Wed, 05 Aug 2020 19:59:31 GMT
See <https://builds.apache.org/job/JMeter-trunk/7801/display/redirect?page=changes>

Changes:

[pmouawad] [Bug 64647] New: groovy-dateutil is missing in distribution

[pmouawad] Updated Groovy to 3.0.5 (from 3.0.3)


------------------------------------------
[...truncated 79.97 KB...]
> Task :src:licenses:spotbugsTest NO-SOURCE
> Task :autostyleMarkdownCheck
> Task :autostyleCheck
> Task :compileJava NO-SOURCE
> Task :processResources NO-SOURCE
> Task :classes UP-TO-DATE
> Task :checkstyleMain NO-SOURCE
> Task :compileTestJava NO-SOURCE

> Task :src:jorphan:compileJava
Note: Some input files use or override a deprecated API.
Note: Recompile with -Xlint:deprecation for details.
Note: <https://builds.apache.org/job/JMeter-trunk/ws/src/jorphan/src/main/java/org/apache/jorphan/gui/DynamicStyle.java>
uses unchecked or unsafe operations.
Note: Recompile with -Xlint:unchecked for details.

> Task :src:licenses:test NO-SOURCE
> Task :processTestResources NO-SOURCE
> Task :testClasses UP-TO-DATE
> Task :src:licenses:check
> Task :checkstyleTest NO-SOURCE
> Task :src:licenses:gatherSourceLicenses
> Task :src:testkit-wiremock:compileJava
> Task :src:testkit-wiremock:processResources NO-SOURCE
> Task :src:testkit-wiremock:classes
> Task :src:testkit-wiremock:jar
> Task :src:testkit-wiremock:compileTestFixturesJava NO-SOURCE
> Task :src:testkit-wiremock:processTestFixturesResources NO-SOURCE
> Task :src:testkit-wiremock:testFixturesClasses UP-TO-DATE
> Task :src:testkit-wiremock:testFixturesJar
> Task :src:testkit-wiremock:autostyleConfigsCheck NO-SOURCE
> Task :src:testkit-wiremock:autostyleJavaCheck
> Task :src:testkit-wiremock:autostyleKotlinGradleCheck
> Task :src:testkit-wiremock:autostyleMarkdownCheck NO-SOURCE
> Task :src:testkit-wiremock:autostyleCheck
> Task :src:protocol:http:autostyleJavaCheck
> Task :src:protocol:http:autostyleKotlinGradleCheck NO-SOURCE
> Task :src:protocol:http:autostyleMarkdownCheck NO-SOURCE
> Task :src:jorphan:compileGroovy NO-SOURCE
> Task :src:protocol:http:autostyleCheck

> Task :src:licenses:renderLicenseForSource
Dependencies of license category B are not allowed for SOURCE artifacts
=======================================================================

CC-BY-SA-3.0
* openiconlibrary:openiconlibrary:

OFL-1.1
* font-awesome-font:font-awesome-font:4.2.0


> Task :gitProps
> Task :src:jorphan:processResources
> Task :src:licenses:renderLicenseForSourceCopySpec
> Task :src:jorphan:classes
> Task :src:licenses:srcLicenseDir
> Task :src:licenses:jar
> Task :src:jorphan:jar
> Task :src:components:autostyleJavaCheck
> Task :src:components:autostyleKotlinGradleCheck
> Task :src:components:autostyleMarkdownCheck NO-SOURCE
> Task :src:components:autostyleCheck
> Task :src:components:processResources
> Task :src:components:processTestResources
> Task :src:config:jar
> Task :src:config:assemble
> Task :src:core:autostyleJavaCheck
> Task :spotbugsMain NO-SOURCE
> Task :spotbugsTest NO-SOURCE
> Task :test NO-SOURCE
> Task :jar
> Task :assemble
> Task :src:dist-check:populateLibs
> Task :src:launcher:checkstyleMain
> Task :src:bshclient:checkstyleMain
> Task :src:testkit:checkstyleMain
> Task :src:testkit-wiremock:checkstyleMain
> Task :src:launcher:compileTestJava NO-SOURCE
> Task :src:testkit:compileTestJava NO-SOURCE
> Task :src:testkit-wiremock:compileTestJava NO-SOURCE
> Task :src:bshclient:compileTestJava NO-SOURCE
> Task :src:launcher:processTestResources NO-SOURCE
> Task :src:testkit:processTestResources NO-SOURCE
> Task :src:testkit-wiremock:processTestResources NO-SOURCE
> Task :src:launcher:testClasses UP-TO-DATE
> Task :src:bshclient:processTestResources NO-SOURCE
> Task :src:bshclient:testClasses UP-TO-DATE
> Task :src:testkit:testClasses UP-TO-DATE
> Task :src:launcher:checkstyleTest NO-SOURCE
> Task :src:testkit-wiremock:testClasses UP-TO-DATE
> Task :src:testkit:checkstyleTest NO-SOURCE
> Task :src:testkit:checkstyleTestFixtures NO-SOURCE
> Task :src:testkit-wiremock:checkstyleTest NO-SOURCE
> Task :src:bshclient:checkstyleTest NO-SOURCE
> Task :src:testkit-wiremock:checkstyleTestFixtures NO-SOURCE
> Task :rat
> Task :check
> Task :src:dist:buildPrintableDoc
> Task :src:jorphan:compileTestJava
> Task :src:jorphan:compileTestGroovy FAILED
> Task :src:dist:distTarSource

> Task :src:core:compileJava
Note: Some input files use or override a deprecated API.
Note: Recompile with -Xlint:deprecation for details.
Note: <https://builds.apache.org/job/JMeter-trunk/ws/src/core/src/main/java/org/apache/jmeter/save/converters/TestElementPropertyConverter.java>
uses unchecked or unsafe operations.
Note: Recompile with -Xlint:unchecked for details.

> Task :src:testkit-wiremock:spotbugsMain
> Task :src:testkit:spotbugsMain

> Task :src:bshclient:spotbugsMain
SpotBugs rule violations were found. See the report at: file://<https://builds.apache.org/job/JMeter-trunk/ws/src/bshclient/build/reports/spotbugs/main.xml>

> Task :src:launcher:spotbugsMain
checksum-dependency elapsed time: 73668ms, configurations processed: 127
    SHA-512 computation time: 2079ms (goes in parallel, it might exceed wall-clock time),
files processed: 39, processed: 6MiB, skipped: 1143MiB
    PGP signature resolution time: 32784ms (wall-clock), resolution requests: 75, signatures
resolved: 212
    PGP key resolution time: 29313ms (wall-clock), resolution requests: 75, download time:
34013ms (goes in parallel, it might exceed wall-clock time), keys downloaded: 83
        PGP signature verification time: 27097ms (goes in parallel, it might exceed wall-clock
time), files processed: 511, processed: 614MiB, skipped: 529MiB

Build jmeter FAILURE reason:                                
    Execution failed for task ':src:jorphan:compileTestGroovy':
        Checksum/PGP violations detected on resolving configuration :src:jorphan:detachedConfiguration4
          Trusted PGP keys for group org.apache.ant are [ddbcc1270a29d081], however artifact
is signed by [a2115ae15f6b8b72] only:
            org.apache.ant:ant-antlr:1.10.8 (pgp=[a2115ae15f6b8b72], sha512=[computation skipped])
            org.apache.ant:ant-junit:1.10.8 (pgp=[a2115ae15f6b8b72], sha512=[computation skipped])
            org.apache.ant:ant-launcher:1.10.8 (pgp=[a2115ae15f6b8b72], sha512=[computation
skipped])
            org.apache.ant:ant:1.10.8 (pgp=[a2115ae15f6b8b72], sha512=[computation skipped])
        
        There might be more checksum violations, however, current configuration specifies
the build to fail on the first violation.
        You might use the following properties:
          * -PchecksumIgnore temporary disables checksum-dependency-plugin (e.g. to try new
dependencies)
          * -PchecksumUpdate updates checksum.xml and it will fail after the first violation
so you can review the diff
          * -PchecksumUpdateAll (insecure) updates checksum.xml with all the new discovered
checksums
          * -PchecksumFailOn=build_finish (insecure) It will postpone the failure till the
build finish
        It will collect all the violations, however untrusted code might be executed (e.g.
from a plugin)
        You can find updated checksum.xml file at <https://builds.apache.org/job/JMeter-trunk/ws/build/checksum/checksum.xml.>
        You might add -PchecksumUpdate to update root checksum.xml file.
            at com.github.vlsi.gradle.checksum.ChecksumDependency.reportViolations(ChecksumDependency.kt:380)
            at com.github.vlsi.gradle.checksum.ChecksumDependency.verifyDependencies(ChecksumDependency.kt:309)
            at com.github.vlsi.gradle.checksum.ChecksumDependency.access$verifyDependencies(ChecksumDependency.kt:58)
            at com.github.vlsi.gradle.checksum.ChecksumDependency$resolutionListener$1$beforeResolve$4$1.invoke(ChecksumDependency.kt:99)
            at com.github.vlsi.gradle.checksum.ChecksumDependency$resolutionListener$1$beforeResolve$4$1.invoke(ChecksumDependency.kt:89)
            at com.github.vlsi.gradle.checksum.Stopwatch.invoke(Stopwatch.kt:36)
            at com.github.vlsi.gradle.checksum.Stopwatch.invoke$default(Stopwatch.kt:31)
            at com.github.vlsi.gradle.checksum.ChecksumDependency$resolutionListener$1$beforeResolve$4.execute(ChecksumDependency.kt:98)
            at com.github.vlsi.gradle.checksum.ChecksumDependency$resolutionListener$1$beforeResolve$4.execute(ChecksumDependency.kt:89)
            at org.gradle.internal.event.BroadcastDispatch$ActionInvocationHandler.dispatch(BroadcastDispatch.java:92)
            at org.gradle.internal.event.BroadcastDispatch$ActionInvocationHandler.dispatch(BroadcastDispatch.java:80)
            at org.gradle.internal.event.AbstractBroadcastDispatch.dispatch(AbstractBroadcastDispatch.java:42)
            at org.gradle.internal.event.BroadcastDispatch$SingletonDispatch.dispatch(BroadcastDispatch.java:231)
            at org.gradle.internal.event.BroadcastDispatch$SingletonDispatch.dispatch(BroadcastDispatch.java:150)
            at org.gradle.internal.event.AbstractBroadcastDispatch.dispatch(AbstractBroadcastDispatch.java:58)
            at org.gradle.internal.event.BroadcastDispatch$CompositeDispatch.dispatch(BroadcastDispatch.java:325)
            at org.gradle.internal.event.BroadcastDispatch$CompositeDispatch.dispatch(BroadcastDispatch.java:235)
            at org.gradle.internal.event.ListenerBroadcast.dispatch(ListenerBroadcast.java:141)
            at org.gradle.internal.event.ListenerBroadcast.dispatch(ListenerBroadcast.java:37)
            at org.gradle.internal.dispatch.ProxyDispatchAdapter$DispatchingInvocationHandler.invoke(ProxyDispatchAdapter.java:94)
            at org.gradle.api.internal.artifacts.configurations.DefaultConfiguration$1.run(DefaultConfiguration.java:629)
            at org.gradle.internal.operations.DefaultBuildOperationExecutor$RunnableBuildOperationWorker.execute(DefaultBuildOperationExecutor.java:402)
            at org.gradle.internal.operations.DefaultBuildOperationExecutor$RunnableBuildOperationWorker.execute(DefaultBuildOperationExecutor.java:394)
            at org.gradle.internal.operations.DefaultBuildOperationExecutor$1.execute(DefaultBuildOperationExecutor.java:165)
            at org.gradle.internal.operations.DefaultBuildOperationExecutor.execute(DefaultBuildOperationExecutor.java:250)
            at org.gradle.internal.operations.DefaultBuildOperationExecutor.execute(DefaultBuildOperationExecutor.java:158)
            at org.gradle.internal.operations.DefaultBuildOperationExecutor.run(DefaultBuildOperationExecutor.java:92)
            at org.gradle.internal.operations.DelegatingBuildOperationExecutor.run(DelegatingBuildOperationExecutor.java:31)
            at org.gradle.api.internal.artifacts.configurations.DefaultConfiguration.resolveGraphIfRequired(DefaultConfiguration.java:611)
            at org.gradle.api.internal.artifacts.configurations.DefaultConfiguration.lambda$resolveExclusively$4(DefaultConfiguration.java:592)
            at org.gradle.api.internal.project.DefaultProjectStateRegistry$SafeExclusiveLockImpl.withLock(DefaultProjectStateRegistry.java:289)
            at org.gradle.api.internal.artifacts.configurations.DefaultConfiguration.resolveExclusively(DefaultConfiguration.java:590)
            at org.gradle.api.internal.artifacts.configurations.DefaultConfiguration.resolveToStateOrLater(DefaultConfiguration.java:576)
            at org.gradle.api.internal.artifacts.configurations.DefaultConfiguration.access$1900(DefaultConfiguration.java:141)
            at org.gradle.api.internal.artifacts.configurations.DefaultConfiguration$ConfigurationFileCollection.getSelectedArtifacts(DefaultConfiguration.java:1248)
            at org.gradle.api.internal.artifacts.configurations.DefaultConfiguration$ConfigurationFileCollection.visitContents(DefaultConfiguration.java:1239)
            at org.gradle.api.internal.artifacts.configurations.DefaultConfiguration$ConfigurationFileCollection.visitStructure(DefaultConfiguration.java:1235)
            at org.gradle.api.internal.artifacts.configurations.DefaultConfiguration.visitStructure(DefaultConfiguration.java:489)
            at org.gradle.api.internal.file.CompositeFileCollection.visitStructure(CompositeFileCollection.java:152)
            at org.gradle.internal.fingerprint.impl.DefaultFileCollectionSnapshotter.snapshot(DefaultFileCollectionSnapshotter.java:50)
            at org.gradle.internal.fingerprint.impl.AbstractFileCollectionFingerprinter.fingerprint(AbstractFileCollectionFingerprinter.java:47)
            at org.gradle.api.internal.tasks.execution.ExecuteActionsTaskExecuter$TaskExecution.lambda$visitInputFileProperties$1(ExecuteActionsTaskExecuter.java:324)
            at org.gradle.internal.execution.steps.CaptureStateBeforeExecutionStep.lambda$fingerprintInputFiles$3(CaptureStateBeforeExecutionStep.java:192)
            at org.gradle.api.internal.tasks.execution.ExecuteActionsTaskExecuter$TaskExecution.visitInputFileProperties(ExecuteActionsTaskExecuter.java:322)
            at org.gradle.internal.execution.steps.CaptureStateBeforeExecutionStep.fingerprintInputFiles(CaptureStateBeforeExecutionStep.java:188)
            at org.gradle.internal.execution.steps.CaptureStateBeforeExecutionStep.captureExecutionState(CaptureStateBeforeExecutionStep.java:150)
            at org.gradle.internal.execution.steps.CaptureStateBeforeExecutionStep.lambda$captureExecutionStateOp$1(CaptureStateBeforeExecutionStep.java:104)
            at org.gradle.internal.execution.steps.BuildOperationStep$1.call(BuildOperationStep.java:40)
            at org.gradle.internal.operations.DefaultBuildOperationExecutor$CallableBuildOperationWorker.execute(DefaultBuildOperationExecutor.java:416)
            at org.gradle.internal.operations.DefaultBuildOperationExecutor$CallableBuildOperationWorker.execute(DefaultBuildOperationExecutor.java:406)
            at org.gradle.internal.operations.DefaultBuildOperationExecutor$1.execute(DefaultBuildOperationExecutor.java:165)
            at org.gradle.internal.operations.DefaultBuildOperationExecutor.execute(DefaultBuildOperationExecutor.java:250)
            at org.gradle.internal.operations.DefaultBuildOperationExecutor.execute(DefaultBuildOperationExecutor.java:158)
            at org.gradle.internal.operations.DefaultBuildOperationExecutor.call(DefaultBuildOperationExecutor.java:102)
            at org.gradle.internal.operations.DelegatingBuildOperationExecutor.call(DelegatingBuildOperationExecutor.java:36)
            at org.gradle.internal.execution.steps.BuildOperationStep.operation(BuildOperationStep.java:37)
            at org.gradle.internal.execution.steps.CaptureStateBeforeExecutionStep.captureExecutionStateOp(CaptureStateBeforeExecutionStep.java:103)
            at org.gradle.internal.execution.steps.CaptureStateBeforeExecutionStep.lambda$execute$0(CaptureStateBeforeExecutionStep.java:78)
            at org.gradle.internal.execution.steps.CaptureStateBeforeExecutionStep.execute(CaptureStateBeforeExecutionStep.java:78)
            at org.gradle.internal.execution.steps.CaptureStateBeforeExecutionStep.execute(CaptureStateBeforeExecutionStep.java:53)
            at org.gradle.internal.execution.steps.ValidateStep.execute(ValidateStep.java:74)
            at org.gradle.internal.execution.steps.SkipEmptyWorkStep.lambda$execute$2(SkipEmptyWorkStep.java:78)
            at org.gradle.internal.execution.steps.SkipEmptyWorkStep.execute(SkipEmptyWorkStep.java:78)
            at org.gradle.internal.execution.steps.SkipEmptyWorkStep.execute(SkipEmptyWorkStep.java:34)
            at org.gradle.internal.execution.steps.legacy.MarkSnapshottingInputsStartedStep.execute(MarkSnapshottingInputsStartedStep.java:39)
            at org.gradle.internal.execution.steps.LoadExecutionStateStep.execute(LoadExecutionStateStep.java:40)
            at org.gradle.internal.execution.steps.LoadExecutionStateStep.execute(LoadExecutionStateStep.java:28)


FAILURE: Build failed with an exception.

* What went wrong:
Execution failed for task ':src:jorphan:compileTestGroovy'.
> Checksum/PGP violations detected on resolving configuration :src:jorphan:detachedConfiguration4
    Trusted PGP keys for group org.apache.ant are [ddbcc1270a29d081], however artifact is
signed by [a2115ae15f6b8b72] only:
      org.apache.ant:ant-antlr:1.10.8 (pgp=[a2115ae15f6b8b72], sha512=[computation skipped])
      org.apache.ant:ant-junit:1.10.8 (pgp=[a2115ae15f6b8b72], sha512=[computation skipped])
      org.apache.ant:ant-launcher:1.10.8 (pgp=[a2115ae15f6b8b72], sha512=[computation skipped])
      org.apache.ant:ant:1.10.8 (pgp=[a2115ae15f6b8b72], sha512=[computation skipped])
  
  There might be more checksum violations, however, current configuration specifies the build
to fail on the first violation.
  You might use the following properties:
    * -PchecksumIgnore temporary disables checksum-dependency-plugin (e.g. to try new dependencies)
    * -PchecksumUpdate updates checksum.xml and it will fail after the first violation so
you can review the diff
    * -PchecksumUpdateAll (insecure) updates checksum.xml with all the new discovered checksums
    * -PchecksumFailOn=build_finish (insecure) It will postpone the failure till the build
finish
  It will collect all the violations, however untrusted code might be executed (e.g. from
a plugin)
  You can find updated checksum.xml file at <https://builds.apache.org/job/JMeter-trunk/ws/build/checksum/checksum.xml.>
  You might add -PchecksumUpdate to update root checksum.xml file.

* Try:
Run with --stacktrace option to get the stack trace. Run with --info or --debug option to
get more log output. Run with --scan to get full insights.

* Get more help at https://help.gradle.org

Deprecated Gradle features were used in this build, making it incompatible with Gradle 7.0.
Use '--warning-mode all' to show the individual deprecation warnings.
See https://docs.gradle.org/6.3/userguide/command_line_interface.html#sec:command_line_warnings

BUILD FAILED in 2m 23s
144 actionable tasks: 114 executed, 30 up-to-date

See the profiling report at: file://<https://builds.apache.org/job/JMeter-trunk/ws/build/reports/profile/profile-2020-08-05-19-57-08.html>
A fine-grained performance profile is available: use the --scan option.
Build step 'Invoke Gradle script' changed build result to FAILURE
Build step 'Invoke Gradle script' marked build as failure
Xvfb stopping
Archiving artifacts
Recording test results
ERROR: Step ?Publish JUnit test result report? failed: No test report files were found. Configuration
error?

Mime
View raw message