jmeter-dev mailing list archives

Site index · List index
Message view « Date » · « Thread »
Top « Date » · « Thread »
From Apache Jenkins Server <jenk...@builds.apache.org>
Subject Build failed in Jenkins: JMeter » JMeter-analysis #17
Date Thu, 20 Aug 2020 20:25:24 GMT
See <https://ci-builds.apache.org/job/JMeter/job/JMeter-analysis/17/display/redirect?page=changes>

Changes:

[Vladimir Sitnikov] Fix Gradle deprecations: replace testCompile with testImplementation


------------------------------------------
[...truncated 347.20 KB...]
WARNING: Illegal reflective access by com.thoughtworks.xstream.core.util.Fields (<https://ci-builds.apache.org/job/JMeter/job/JMeter-analysis/ws/lib/xstream-1.4.11.1.jar)>
to field java.util.TreeMap.comparator
WARNING: Please consider reporting this to the maintainers of com.thoughtworks.xstream.core.util.Fields
WARNING: Use --illegal-access=warn to enable warnings of further illegal reflective access
operations
WARNING: All illegal access operations will be denied in a future release
Creating summariser <summary>
Created the tree successfully using <https://ci-builds.apache.org/job/JMeter/job/JMeter-analysis/ws/bin/testfiles/TEST_HTTPS.jmx>
Starting standalone test @ Thu Aug 20 20:23:53 UTC 2020 (1597955033146)
Waiting for possible Shutdown/StopTestNow/HeapDump/ThreadDump message on port 4445
Warning: Nashorn engine is planned to be removed from a future JDK release
summary =      2 in 00:00:02 =    1.0/s Avg:   815 Min:   529 Max:  1101 Err:     0 (0.00%)
Tidying up ...    @ Thu Aug 20 20:23:55 UTC 2020 (1597955035649)
... end of run
No errors present in the logfile <https://ci-builds.apache.org/job/JMeter/job/JMeter-analysis/ws/bin/TEST_HTTPS.log>
(the file is empty)

> Task :src:dist-check:batchTestCookieManager
WARNING: An illegal reflective access operation has occurred
WARNING: Illegal reflective access by com.thoughtworks.xstream.core.util.Fields (<https://ci-builds.apache.org/job/JMeter/job/JMeter-analysis/ws/lib/xstream-1.4.11.1.jar)>
to field java.util.TreeMap.comparator
WARNING: Please consider reporting this to the maintainers of com.thoughtworks.xstream.core.util.Fields
WARNING: Use --illegal-access=warn to enable warnings of further illegal reflective access
operations
WARNING: All illegal access operations will be denied in a future release
Creating summariser <summary>
Created the tree successfully using <https://ci-builds.apache.org/job/JMeter/job/JMeter-analysis/ws/bin/testfiles/TestCookieManager.jmx>
Starting standalone test @ Thu Aug 20 20:23:58 UTC 2020 (1597955038368)
Waiting for possible Shutdown/StopTestNow/HeapDump/ThreadDump message on port 4445
Warning: Nashorn engine is planned to be removed from a future JDK release
summary +      1 in 00:00:01 =    0.8/s Avg:  1141 Min:  1141 Max:  1141 Err:     0 (0.00%)
Active: 1 Started: 1 Finished: 0
summary +      9 in 00:00:01 =   13.6/s Avg:    38 Min:     1 Max:   190 Err:     0 (0.00%)
Active: 0 Started: 1 Finished: 1
summary =     10 in 00:00:02 =    5.4/s Avg:   148 Min:     1 Max:  1141 Err:     0 (0.00%)
Tidying up ...    @ Thu Aug 20 20:24:01 UTC 2020 (1597955041217)
... end of run
No errors present in the logfile <https://ci-builds.apache.org/job/JMeter/job/JMeter-analysis/ws/bin/TestCookieManager.log>
(the file is empty)

> Task :src:dist-check:batchTestHeaderManagerHttpClient4
WARNING: An illegal reflective access operation has occurred
WARNING: Illegal reflective access by com.thoughtworks.xstream.core.util.Fields (<https://ci-builds.apache.org/job/JMeter/job/JMeter-analysis/ws/lib/xstream-1.4.11.1.jar)>
to field java.util.TreeMap.comparator
WARNING: Please consider reporting this to the maintainers of com.thoughtworks.xstream.core.util.Fields
WARNING: Use --illegal-access=warn to enable warnings of further illegal reflective access
operations
WARNING: All illegal access operations will be denied in a future release
Creating summariser <summary>
Created the tree successfully using <https://ci-builds.apache.org/job/JMeter/job/JMeter-analysis/ws/bin/testfiles/TestHeaderManager.jmx>
Starting standalone test @ Thu Aug 20 20:24:04 UTC 2020 (1597955044762)
Waiting for possible Shutdown/StopTestNow/HeapDump/ThreadDump message on port 4445
Warning: Nashorn engine is planned to be removed from a future JDK release
summary +      1 in 00:00:00 =    2.6/s Avg:    38 Min:    38 Max:    38 Err:     0 (0.00%)
Active: 1 Started: 1 Finished: 0
summary +      2 in 00:00:00 =   87.0/s Avg:     2 Min:     2 Max:     2 Err:     0 (0.00%)
Active: 0 Started: 2 Finished: 2
summary =      3 in 00:00:00 =    7.4/s Avg:    14 Min:     2 Max:    38 Err:     0 (0.00%)
Tidying up ...    @ Thu Aug 20 20:24:05 UTC 2020 (1597955045674)
... end of run
No errors present in the logfile <https://ci-builds.apache.org/job/JMeter/job/JMeter-analysis/ws/bin/TestHeaderManager.log>
(the file is empty)

> Task :src:dist-check:batchTestHeaderManagerJava
WARNING: An illegal reflective access operation has occurred
WARNING: Illegal reflective access by com.thoughtworks.xstream.core.util.Fields (<https://ci-builds.apache.org/job/JMeter/job/JMeter-analysis/ws/lib/xstream-1.4.11.1.jar)>
to field java.util.TreeMap.comparator
WARNING: Please consider reporting this to the maintainers of com.thoughtworks.xstream.core.util.Fields
WARNING: Use --illegal-access=warn to enable warnings of further illegal reflective access
operations
WARNING: All illegal access operations will be denied in a future release
Creating summariser <summary>
Created the tree successfully using <https://ci-builds.apache.org/job/JMeter/job/JMeter-analysis/ws/bin/testfiles/TestHeaderManager.jmx>
Starting standalone test @ Thu Aug 20 20:24:08 UTC 2020 (1597955048394)
Waiting for possible Shutdown/StopTestNow/HeapDump/ThreadDump message on port 4445
Warning: Nashorn engine is planned to be removed from a future JDK release
summary =      3 in 00:00:00 =   13.0/s Avg:     4 Min:     0 Max:    12 Err:     0 (0.00%)
Tidying up ...    @ Thu Aug 20 20:24:09 UTC 2020 (1597955049153)
... end of run
No errors present in the logfile <https://ci-builds.apache.org/job/JMeter/job/JMeter-analysis/ws/bin/TestHeaderManager.log>
(the file is empty)

> Task :src:dist-check:batchTestKeepAlive SKIPPED
> Task :src:dist-check:batchTestRedirectionPolicies SKIPPED

> Task :src:dist-check:batchTestResultStatusAction
WARNING: An illegal reflective access operation has occurred
WARNING: Illegal reflective access by com.thoughtworks.xstream.core.util.Fields (<https://ci-builds.apache.org/job/JMeter/job/JMeter-analysis/ws/lib/xstream-1.4.11.1.jar)>
to field java.util.TreeMap.comparator
WARNING: Please consider reporting this to the maintainers of com.thoughtworks.xstream.core.util.Fields
WARNING: Use --illegal-access=warn to enable warnings of further illegal reflective access
operations
WARNING: All illegal access operations will be denied in a future release
Creating summariser <summary>
Created the tree successfully using <https://ci-builds.apache.org/job/JMeter/job/JMeter-analysis/ws/bin/testfiles/TestResultStatusAction.jmx>
Starting standalone test @ Thu Aug 20 20:24:11 UTC 2020 (1597955051955)
Waiting for possible Shutdown/StopTestNow/HeapDump/ThreadDump message on port 4445
Warning: Nashorn engine is planned to be removed from a future JDK release
summary =    135 in 00:00:01 =   94.2/s Avg:     1 Min:     0 Max:   175 Err:    18 (13.33%)
Tidying up ...    @ Thu Aug 20 20:24:14 UTC 2020 (1597955054378)
... end of run
No errors present in the logfile <https://ci-builds.apache.org/job/JMeter/job/JMeter-analysis/ws/bin/TestResultStatusAction.log>
(the file is empty)

> Task :src:dist-check:batchTestSchedulerWithTimer
WARNING: An illegal reflective access operation has occurred
WARNING: Illegal reflective access by com.thoughtworks.xstream.core.util.Fields (<https://ci-builds.apache.org/job/JMeter/job/JMeter-analysis/ws/lib/xstream-1.4.11.1.jar)>
to field java.util.TreeMap.comparator
WARNING: Please consider reporting this to the maintainers of com.thoughtworks.xstream.core.util.Fields
WARNING: Use --illegal-access=warn to enable warnings of further illegal reflective access
operations
WARNING: All illegal access operations will be denied in a future release
Creating summariser <summary>
Created the tree successfully using <https://ci-builds.apache.org/job/JMeter/job/JMeter-analysis/ws/bin/testfiles/TestSchedulerWithTimer.jmx>
Starting standalone test @ Thu Aug 20 20:24:17 UTC 2020 (1597955057219)
Waiting for possible Shutdown/StopTestNow/HeapDump/ThreadDump message on port 4445
Warning: Nashorn engine is planned to be removed from a future JDK release
summary =      5 in 00:00:07 =    0.7/s Avg:   309 Min:     2 Max:  1176 Err:     0 (0.00%)
Tidying up ...    @ Thu Aug 20 20:24:24 UTC 2020 (1597955064931)
... end of run
No errors present in the logfile <https://ci-builds.apache.org/job/JMeter/job/JMeter-analysis/ws/bin/TestSchedulerWithTimer.log>
(the file is empty)

> Task :src:dist-check:batchTests

> Task :src:dist-check:test

Gradle Test Executor 39 STANDARD_OUT
    Setting JMeterHome: <https://ci-builds.apache.org/job/JMeter/job/JMeter-analysis/ws/src/dist-check/../../.>
    Initializing Properties: ../.././bin/jmeter.properties
    JMeterVersion=5.3.1-SNAPSHOT 769a2a1
    java.version=11.0.6
    java.vm.name=Java HotSpot(TM) 64-Bit Server VM
    java.vendor=Oracle Corporation
    java.home=/usr/local/asfpackages/java/jdk-11.0.6
    file.encoding=ISO-8859-1
    default encoding=ISO-8859-1
    user.home=/home/jenkins
    user.dir=<https://ci-builds.apache.org/job/JMeter/job/JMeter-analysis/ws/src/dist-check>
    user.language=en
    user.region=null
    user.country=US
    user.variant=
    Locale=en_US
    java.class.version=55.0
    java.awt.headless=null
    os.name=Linux
    os.version=4.15.0-76-generic
    os.arch=amd64

Gradle Test Executor 39 STANDARD_ERROR
    Warning: Nashorn engine is planned to be removed from a future JDK release
    Warning: Nashorn engine is planned to be removed from a future JDK release
    Warning: Nashorn engine is planned to be removed from a future JDK release

Gradle Test Executor 39 STANDARD_OUT
    o.a.j.junit.JMeterTest WARN: org.apache.jmeter.gui.JMeterGUIComponent: NoSuchMethodException
 org.apache.jmeter.gui.menu.StaticJMeterGUIComponent, missing empty Constructor or Constructor
with Object parameter
    o.a.j.junit.JMeterTest INFO: JMeterGUIComponent: skipping some tests org.apache.jmeter.testbeans.gui.TestBeanGUI
    o.a.j.junit.JMeterTest WARN: java.io.Serializable: NoSuchMethodException  org.apache.jmeter.gui.GlobalUndoableEdit,
missing empty Constructor or Constructor with Object parameter
    o.a.j.junit.JMeterTest WARN: java.io.Serializable: NoSuchMethodException  org.apache.jmeter.rmi.RMIServerSocketFactoryImpl,
missing empty Constructor or Constructor with Object parameter
    o.a.j.junit.JMeterTest WARN: java.io.Serializable: NoSuchMethodException  org.apache.jmeter.rmi.SSLRMIServerSocketFactory,
missing empty Constructor or Constructor with Object parameter
    o.a.j.junit.JMeterTest WARN: Error creating org.apache.jmeter.threads.RemoteThreadsListenerImpl
java.rmi.server.ExportException: Listen failed on port: 0; nested exception is: 
    	java.io.FileNotFoundException: rmi_keystore.jks (No such file or directory)
          0.1sec,    2 completed,   0 failed,   0 skipped, org.apache.jmeter.resources.TestPropertiesFiles
WARNING: An illegal reflective access operation has occurred
WARNING: Illegal reflective access by com.thoughtworks.xstream.core.util.Fields (file:/home/jenkins/.gradle/caches/modules-2/files-2.1/com.thoughtworks.xstream/xstream/1.4.11.1/6c120c45a8c480bb2fea5b56502e3993ddd74fd2/xstream-1.4.11.1.jar)
to field java.util.TreeMap.comparator
WARNING: Please consider reporting this to the maintainers of com.thoughtworks.xstream.core.util.Fields
WARNING: Use --illegal-access=warn to enable warnings of further illegal reflective access
operations
WARNING: All illegal access operations will be denied in a future release
          0.3sec,    1 completed,   0 failed,   0 skipped, org.apache.jmeter.threads.ThreadGroupLoad
          0.9sec,    5 completed,   0 failed,   0 skipped, org.apache.jmeter.save.TestSaveService
          0.0sec,    9 completed,   0 failed,   0 skipped, org.apache.jmeter.control.TestSwitchController
         11.1sec, org.apache.jorphan.reflect.TestClassFinder > testFindClassesThatExtendStringArrayClassOfQArrayTrue()
          5.5sec, org.apache.jorphan.reflect.TestClassFinder > testFindAnnotatedClasses()
         19.0sec,    9 completed,   0 failed,   0 skipped, org.apache.jorphan.reflect.TestClassFinder
          0.1sec,    7 completed,   0 failed,   0 skipped, org.apache.jorphan.TestFunctorUsers
          0.8sec,   82 completed,   0 failed,   0 skipped, org.apache.jmeter.gui.action.TestLoad
          0.1sec,  140 completed,   0 failed,   0 skipped, org.apache.jmeter.testelement.TestElementTest
          0.1sec,  100 completed,   0 failed,   0 skipped, org.apache.jmeter.functions.ComponentReferenceFunctionTest
          1.4sec,  745 completed,   0 failed,   0 skipped, org.apache.jmeter.junit.JMeterTest
          1.5sec,  374 completed,   0 failed,   0 skipped, org.apache.jmeter.testbeans.gui.PackageTest
          2.8sec, org.apache.jmeter.gui.action.HtmlReportGeneratorSpec
> check that report generation succeeds and statistic are generated
          4.7sec,    7 completed,   0 failed,   0 skipped, org.apache.jmeter.gui.action.HtmlReportGeneratorSpec
          0.2sec,    2 completed,   0 failed,   0 skipped, org.apache.jmeter.gui.util.MenuFactorySpec

org.apache.jmeter.engine.util.PackageSpec > testFunctionParse1 STANDARD_ERROR
    Warning: Nashorn engine is planned to be removed from a future JDK release
    Warning: Nashorn engine is planned to be removed from a future JDK release
    Warning: Nashorn engine is planned to be removed from a future JDK release
    Warning: Nashorn engine is planned to be removed from a future JDK release
          0.4sec,   22 completed,   0 failed,   0 skipped, org.apache.jmeter.engine.util.PackageSpec
          0.5sec,    2 completed,   0 failed,   0 skipped, org.apache.jmeter.report.dashboard.ReportGeneratorSpec
         40.9sec, 1507 completed,   0 failed,   0 skipped, Gradle Test Run :src:dist-check:test

> Task :src:dist-check:check
> Task :jacocoReport
> Task :sonarqube FAILED
checksum-dependency elapsed time: 103814ms, configurations processed: 397
    SHA-512 computation time: 64ms (goes in parallel, it might exceed wall-clock time), files
processed: 23, processed: 5MiB, skipped: 3468MiB
    PGP signature resolution time: 57323ms (wall-clock), resolution requests: 237, signatures
resolved: 275
    PGP key resolution time: 16194ms (wall-clock), resolution requests: 237, download time:
0ms (goes in parallel, it might exceed wall-clock time), keys downloaded: 0
        PGP signature verification time: 23614ms (goes in parallel, it might exceed wall-clock
time), files processed: 785, processed: 997MiB, skipped: 2451MiB

Build jmeter FAILURE reason:                                
    Execution failed for task ':sonarqube':
        org.gradle.api.UnknownDomainObjectException: SpotBugsReport with name 'xml' not found.
            at org.gradle.api.internal.DefaultNamedDomainObjectCollection.createNotFoundException(DefaultNamedDomainObjectCollection.java:504)
            at org.gradle.api.internal.DefaultNamedDomainObjectCollection.named(DefaultNamedDomainObjectCollection.java:360)
            at Build_gradle$9$2$1$1.execute(build.gradle.kts:241)
            at Build_gradle$9$2$1$1.execute(build.gradle.kts:29)
            at org.gradle.api.internal.DefaultMutationGuard$2.execute(DefaultMutationGuard.java:42)
            at org.gradle.api.internal.DefaultMutationGuard$2.execute(DefaultMutationGuard.java:42)
            at org.gradle.api.internal.collections.CollectionFilter$1.execute(CollectionFilter.java:59)
            at org.gradle.api.internal.collections.CollectionFilter$1.execute(CollectionFilter.java:59)
            at org.gradle.api.internal.DefaultDomainObjectCollection.configureEach(DefaultDomainObjectCollection.java:187)
            at org.gradle.api.internal.tasks.DefaultRealizableTaskCollection.configureEach(DefaultRealizableTaskCollection.java:234)
            at Build_gradle$9$2$1.execute(build.gradle.kts:240)
            at Build_gradle$9$2$1.execute(build.gradle.kts:29)
            at org.sonarqube.gradle.ActionBroadcast.lambda$execute$0(ActionBroadcast.java:36)
            at org.sonarqube.gradle.ActionBroadcast.execute(ActionBroadcast.java:36)
            at org.sonarqube.gradle.SonarPropertyComputer.evaluateSonarPropertiesBlocks(SonarPropertyComputer.java:148)
            at org.sonarqube.gradle.SonarPropertyComputer.computeSonarProperties(SonarPropertyComputer.java:100)
            at org.sonarqube.gradle.SonarPropertyComputer.computeSonarProperties(SonarPropertyComputer.java:141)
            at org.sonarqube.gradle.SonarPropertyComputer.computeSonarProperties(SonarPropertyComputer.java:141)
            at org.sonarqube.gradle.SonarPropertyComputer.computeSonarProperties(SonarPropertyComputer.java:82)
            at org.sonarqube.gradle.SonarQubePlugin.lambda$configureTask$1(SonarQubePlugin.java:89)
            at org.gradle.util.GUtil.uncheckedCall(GUtil.java:442)
            at org.gradle.internal.extensibility.ConventionAwareHelper$2.doGetValue(ConventionAwareHelper.java:82)
            at org.gradle.internal.extensibility.ConventionAwareHelper$MappedPropertyImpl.getValue(ConventionAwareHelper.java:128)
            at org.gradle.internal.extensibility.ConventionAwareHelper.getConventionValue(ConventionAwareHelper.java:110)
            at org.gradle.api.internal.tasks.properties.bean.AbstractNestedRuntimeBeanNode$BeanPropertyValue$1$1.create(AbstractNestedRuntimeBeanNode.java:77)
            at org.gradle.internal.deprecation.DeprecationLogger.whileDisabled(DeprecationLogger.java:228)
            at org.gradle.api.internal.tasks.properties.bean.AbstractNestedRuntimeBeanNode$BeanPropertyValue$1.get(AbstractNestedRuntimeBeanNode.java:73)
            at com.google.common.base.Suppliers$NonSerializableMemoizingSupplier.get(Suppliers.java:167)
            at org.gradle.api.internal.tasks.properties.bean.AbstractNestedRuntimeBeanNode$BeanPropertyValue.call(AbstractNestedRuntimeBeanNode.java:133)
            at org.gradle.api.internal.tasks.properties.AbstractValidatingProperty.validate(AbstractValidatingProperty.java:39)
            at org.gradle.api.internal.tasks.properties.DefaultTaskProperties.validate(DefaultTaskProperties.java:194)
            at org.gradle.api.internal.tasks.execution.ExecuteActionsTaskExecuter$TaskExecution.validate(ExecuteActionsTaskExecuter.java:507)
            at org.gradle.internal.execution.steps.ValidateStep.execute(ValidateStep.java:50)
            at org.gradle.internal.execution.steps.SkipEmptyWorkStep.lambda$execute$2(SkipEmptyWorkStep.java:78)
            at org.gradle.internal.execution.steps.SkipEmptyWorkStep.execute(SkipEmptyWorkStep.java:78)
            at org.gradle.internal.execution.steps.SkipEmptyWorkStep.execute(SkipEmptyWorkStep.java:34)
            at org.gradle.internal.execution.steps.legacy.MarkSnapshottingInputsStartedStep.execute(MarkSnapshottingInputsStartedStep.java:39)
            at org.gradle.internal.execution.steps.LoadExecutionStateStep.execute(LoadExecutionStateStep.java:40)
            at org.gradle.internal.execution.steps.LoadExecutionStateStep.execute(LoadExecutionStateStep.java:28)


FAILURE: Build failed with an exception.

* What went wrong:
Execution failed for task ':sonarqube'.
> SpotBugsReport with name 'xml' not found.

* Try:
Run with --stacktrace option to get the stack trace. Run with --info or --debug option to
get more log output. Run with --scan to get full insights.

* Get more help at https://help.gradle.org

Deprecated Gradle features were used in this build, making it incompatible with Gradle 7.0.
Use '--warning-mode all' to show the individual deprecation warnings.
See https://docs.gradle.org/6.6/userguide/command_line_interface.html#sec:command_line_warnings

BUILD FAILED in 9m 34s
358 actionable tasks: 345 executed, 13 up-to-date

See the profiling report at: file://<https://ci-builds.apache.org/job/JMeter/job/JMeter-analysis/ws/build/reports/profile/profile-2020-08-20-20-15-43.html>
A fine-grained performance profile is available: use the --scan option.
Build step 'Invoke Gradle script' changed build result to FAILURE
Build step 'Invoke Gradle script' marked build as failure
Xvfb stopping
Recording test results

Mime
View raw message