jmeter-dev mailing list archives

Site index · List index
Message view « Date » · « Thread »
Top « Date » · « Thread »
From Apache Jenkins Server <jenk...@builds.apache.org>
Subject Build failed in Jenkins: JMeter Ubuntu #1053
Date Sun, 09 Aug 2020 15:35:22 GMT
See <https://builds.apache.org/job/JMeter%20Ubuntu/1053/display/redirect?page=changes>

Changes:

[felix.schumacher] Try to make jars available for sonar scanner

[felix.schumacher] Use correct path for jars


------------------------------------------
[...truncated 206.18 KB...]
summary +      6 in 00:00:09 =    0.7/s Avg:   509 Min:     0 Max:  3000 Err:     0 (0.00%)
Active: 0 Started: 1 Finished: 1
summary =     27 in 00:00:30 =    0.9/s Avg:   593 Min:     0 Max:  3001 Err:     0 (0.00%)
Tidying up ...    @ Sun Aug 09 15:32:42 UTC 2020 (1596987162924)
... end of run
No errors present in the logfile <https://builds.apache.org/job/JMeter%20Ubuntu/ws/bin/JMS_TESTS.log>
(the file is empty)

> Task :src:dist-check:batchOS_TESTS
Creating summariser <summary>
Created the tree successfully using <https://builds.apache.org/job/JMeter%20Ubuntu/ws/bin/testfiles/OS_TESTS.jmx>
Starting standalone test @ Sun Aug 09 15:32:45 UTC 2020 (1596987165872)
Waiting for possible Shutdown/StopTestNow/HeapDump/ThreadDump message on port 4445
summary =      3 in 00:00:02 =    1.3/s Avg:   340 Min:     2 Max:  1003 Err:     0 (0.00%)
Tidying up ...    @ Sun Aug 09 15:32:48 UTC 2020 (1596987168366)
... end of run
No errors present in the logfile <https://builds.apache.org/job/JMeter%20Ubuntu/ws/bin/OS_TESTS.log>
(the file is empty)

> Task :src:dist-check:batchResponseDecompression
Creating summariser <summary>
Created the tree successfully using <https://builds.apache.org/job/JMeter%20Ubuntu/ws/bin/testfiles/ResponseDecompression.jmx>
Starting standalone test @ Sun Aug 09 15:32:50 UTC 2020 (1596987170241)
Waiting for possible Shutdown/StopTestNow/HeapDump/ThreadDump message on port 4445
summary =      2 in 00:00:02 =    1.2/s Avg:   390 Min:   324 Max:   456 Err:     0 (0.00%)
Tidying up ...    @ Sun Aug 09 15:32:52 UTC 2020 (1596987172359)
... end of run
No errors present in the logfile <https://builds.apache.org/job/JMeter%20Ubuntu/ws/bin/ResponseDecompression.log>
(the file is empty)
[server] Created remote object: UnicastServerRef2 [liveRef: [endpoint:[asf922.gq1.ygridcore.net:46445,SSLRMIServerSocketFactory(host=asf922.gq1.ygridcore.net/67.195.81.142,
keyStoreLocation=rmi_keystore.jks, type=JKS, trustStoreLocation=rmi_keystore.jks, type=JKS,
alias=rmi),SSLRMIClientSocketFactory(keyStoreLocation=rmi_keystore.jks, type=JKS, trustStoreLocation=rmi_keystore.jks,
type=JKS, alias=rmi)](local),objID:[5d5648fc:173d3da6bc9:-7fff, -5864718454418435055]]]

> Task :src:dist-check:batchServerBatchTestLocal
Creating summariser <summary>
Created the tree successfully using <https://builds.apache.org/job/JMeter%20Ubuntu/ws/bin/testfiles/BatchTestLocal.jmx>
Configuring remote engine: asf922.gq1.ygridcore.net:46303
Starting distributed test with remote engines: [asf922.gq1.ygridcore.net:46303] @ Sun Aug
09 15:32:59 UTC 2020 (1596987179726)

[server] Starting the test on host asf922.gq1.ygridcore.net:46303 @ Sun Aug 09 15:33:13 UTC
2020 (1596987193178)[server] 

> Task :src:dist-check:batchServerBatchTestLocal
Remote engines have been started:[asf922.gq1.ygridcore.net:46303]
Waiting for possible Shutdown/StopTestNow/HeapDump/ThreadDump message on port 4445
summary =    132 in 00:00:10 =   13.1/s Avg:     6 Min:     0 Max:   108 Err:    16 (12.12%)
Tidying up remote @ Sun Aug 09 15:33:26 UTC 2020 (1596987206881)

[server] Finished the test on host asf922.gq1.ygridcore.net:46303 @ Sun Aug 09 15:33:26 UTC
2020 (1596987206881) - exit requested.

> Task :src:dist-check:batchServerBatchTestLocal
... end of run
No errors present in the logfile <https://builds.apache.org/job/JMeter%20Ubuntu/ws/bin/BatchTestLocal.log>
(the file is empty)
No errors present in the logfile <https://builds.apache.org/job/JMeter%20Ubuntu/ws/bin/BatchTestLocalServer.log>
(the file is empty)

> Task :src:dist-check:batchSlowCharsFeatureHttpClient4 SKIPPED
> Task :src:dist-check:batchSlowCharsFeatureJava SKIPPED
> Task :src:dist-check:batchTCP_TESTS SKIPPED

> Task :src:dist-check:batchTEST_HTTPHttpClient4
Creating summariser <summary>
Created the tree successfully using <https://builds.apache.org/job/JMeter%20Ubuntu/ws/bin/testfiles/TEST_HTTP.jmx>
Starting standalone test @ Sun Aug 09 15:33:35 UTC 2020 (1596987215016)
Waiting for possible Shutdown/StopTestNow/HeapDump/ThreadDump message on port 4445
summary =     22 in 00:00:03 =    8.2/s Avg:    64 Min:     2 Max:  1074 Err:     0 (0.00%)
Tidying up ...    @ Sun Aug 09 15:33:38 UTC 2020 (1596987218165)
... end of run
No errors present in the logfile <https://builds.apache.org/job/JMeter%20Ubuntu/ws/bin/TEST_HTTP.log>
(the file is empty)

> Task :src:dist-check:batchTEST_HTTPJava
Creating summariser <summary>
Created the tree successfully using <https://builds.apache.org/job/JMeter%20Ubuntu/ws/bin/testfiles/TEST_HTTP.jmx>
Starting standalone test @ Sun Aug 09 15:33:45 UTC 2020 (1596987225407)
Waiting for possible Shutdown/StopTestNow/HeapDump/ThreadDump message on port 4445
summary =     20 in 00:00:02 =    9.7/s Avg:    71 Min:     1 Max:  1166 Err:     0 (0.00%)
Tidying up ...    @ Sun Aug 09 15:33:48 UTC 2020 (1596987228133)
... end of run
WARNING: the task was configured to ignore errors in the output log
Logfile contents (errors during the test, see <https://builds.apache.org/job/JMeter%20Ubuntu/ws/bin/TEST_HTTP.log)>:
2020-08-09 15:33:47,691 ERROR o.a.j.p.h.s.HTTPJavaImpl: readResponse: java.net.ProtocolException:
Server redirected too many  times (20)
2020-08-09 15:33:47,695 ERROR o.a.j.p.h.s.HTTPJavaImpl: Cause: java.net.ProtocolException:
Server redirected too many  times (20)
2020-08-09 15:33:47,695 ERROR o.a.j.p.h.c.HttpMirrorThread: Invalid request received:''

> Task :src:dist-check:batchTEST_HTTPS
Creating summariser <summary>
Created the tree successfully using <https://builds.apache.org/job/JMeter%20Ubuntu/ws/bin/testfiles/TEST_HTTPS.jmx>
Starting standalone test @ Sun Aug 09 15:33:52 UTC 2020 (1596987232938)
Waiting for possible Shutdown/StopTestNow/HeapDump/ThreadDump message on port 4445
summary +      2 in 00:00:05 =    0.4/s Avg:  1853 Min:  1170 Max:  2537 Err:     0 (0.00%)
Active: 1 Started: 1 Finished: 0
summary =      2 in 00:00:05 =    0.4/s Avg:  1853 Min:  1170 Max:  2537 Err:     0 (0.00%)
Tidying up ...    @ Sun Aug 09 15:34:00 UTC 2020 (1596987240456)
... end of run
No errors present in the logfile <https://builds.apache.org/job/JMeter%20Ubuntu/ws/bin/TEST_HTTPS.log>
(the file is empty)

> Task :src:dist-check:batchTestCookieManager
Creating summariser <summary>
Created the tree successfully using <https://builds.apache.org/job/JMeter%20Ubuntu/ws/bin/testfiles/TestCookieManager.jmx>
Starting standalone test @ Sun Aug 09 15:34:07 UTC 2020 (1596987247710)
Waiting for possible Shutdown/StopTestNow/HeapDump/ThreadDump message on port 4445
summary =     10 in 00:00:09 =    1.2/s Avg:   694 Min:     1 Max:  5936 Err:     0 (0.00%)
Tidying up ...    @ Sun Aug 09 15:34:22 UTC 2020 (1596987262711)
... end of run
No errors present in the logfile <https://builds.apache.org/job/JMeter%20Ubuntu/ws/bin/TestCookieManager.log>
(the file is empty)

> Task :src:dist-check:batchTestHeaderManagerHttpClient4
Creating summariser <summary>
Created the tree successfully using <https://builds.apache.org/job/JMeter%20Ubuntu/ws/bin/testfiles/TestHeaderManager.jmx>
Starting standalone test @ Sun Aug 09 15:34:26 UTC 2020 (1596987266323)
Waiting for possible Shutdown/StopTestNow/HeapDump/ThreadDump message on port 4445
summary =      3 in 00:00:01 =    5.0/s Avg:    26 Min:     2 Max:    69 Err:     0 (0.00%)
Tidying up ...    @ Sun Aug 09 15:34:27 UTC 2020 (1596987267788)
... end of run
No errors present in the logfile <https://builds.apache.org/job/JMeter%20Ubuntu/ws/bin/TestHeaderManager.log>
(the file is empty)

> Task :src:dist-check:batchTestHeaderManagerJava
Creating summariser <summary>
Created the tree successfully using <https://builds.apache.org/job/JMeter%20Ubuntu/ws/bin/testfiles/TestHeaderManager.jmx>
Starting standalone test @ Sun Aug 09 15:34:30 UTC 2020 (1596987270509)
Waiting for possible Shutdown/StopTestNow/HeapDump/ThreadDump message on port 4445
summary +      1 in 00:00:00 =    5.6/s Avg:    15 Min:    15 Max:    15 Err:     0 (0.00%)
Active: 1 Started: 1 Finished: 0
summary +      2 in 00:00:00 =   62.5/s Avg:     1 Min:     1 Max:     1 Err:     0 (0.00%)
Active: 0 Started: 2 Finished: 2
summary =      3 in 00:00:00 =   14.0/s Avg:     5 Min:     1 Max:    15 Err:     0 (0.00%)
Tidying up ...    @ Sun Aug 09 15:34:31 UTC 2020 (1596987271453)
... end of run
No errors present in the logfile <https://builds.apache.org/job/JMeter%20Ubuntu/ws/bin/TestHeaderManager.log>
(the file is empty)

> Task :src:dist-check:batchTestKeepAlive SKIPPED
> Task :src:dist-check:batchTestRedirectionPolicies SKIPPED

> Task :src:dist-check:batchTestResultStatusAction
Creating summariser <summary>
Created the tree successfully using <https://builds.apache.org/job/JMeter%20Ubuntu/ws/bin/testfiles/TestResultStatusAction.jmx>
Starting standalone test @ Sun Aug 09 15:34:36 UTC 2020 (1596987276443)
Waiting for possible Shutdown/StopTestNow/HeapDump/ThreadDump message on port 4445
summary =    135 in 00:00:04 =   34.3/s Avg:     5 Min:     0 Max:   508 Err:    18 (13.33%)
Tidying up ...    @ Sun Aug 09 15:34:42 UTC 2020 (1596987282344)
... end of run
No errors present in the logfile <https://builds.apache.org/job/JMeter%20Ubuntu/ws/bin/TestResultStatusAction.log>
(the file is empty)

> Task :src:dist-check:batchTestSchedulerWithTimer
Creating summariser <summary>
Created the tree successfully using <https://builds.apache.org/job/JMeter%20Ubuntu/ws/bin/testfiles/TestSchedulerWithTimer.jmx>
Starting standalone test @ Sun Aug 09 15:34:51 UTC 2020 (1596987291530)
Waiting for possible Shutdown/StopTestNow/HeapDump/ThreadDump message on port 4445
summary =      5 in 00:00:17 =    0.3/s Avg:  2156 Min:     2 Max:  8329 Err:     1 (20.00%)
Tidying up ...    @ Sun Aug 09 15:35:15 UTC 2020 (1596987315031)
... end of run
ERROR: unexpected output for TestSchedulerWithTimer.csv:
  - expected 57 bytes, <https://builds.apache.org/job/JMeter%20Ubuntu/ws/bin/testfiles/TestSchedulerWithTimer.csv>
  + actual 58 bytes, <https://builds.apache.org/job/JMeter%20Ubuntu/ws/bin/TestSchedulerWithTimer.csv>
@@ -1 +1 @@
-JSRCheckDuration,200,tearDown Thread Group 1-1,text,true
+JSRCheckDuration,200,tearDown Thread Group 1-1,text,false
ERROR: unexpected output for TestSchedulerWithTimer.xml:
  - expected 143 bytes, <https://builds.apache.org/job/JMeter%20Ubuntu/ws/bin/testfiles/TestSchedulerWithTimer.xml>
  + actual 144 bytes, <https://builds.apache.org/job/JMeter%20Ubuntu/ws/bin/TestSchedulerWithTimer.xml>
@@ -1,5 +1,5 @@
 <?xml version="1.0" encoding="UTF-8"?>
 <testResults version="1.2">
-<sample s="true" lb="JSRCheckDuration" rc="200" dt="text"/>
+<sample s="false" lb="JSRCheckDuration" rc="200" dt="text"/>
 
 </testResults>
Logfile contents (errors during the test, see <https://builds.apache.org/job/JMeter%20Ubuntu/ws/bin/TestSchedulerWithTimer.log)>:
2020-08-09 15:35:14,861 WARN o.a.j.p.j.s.J.JSRCheckDuration: Duration 8561 exceeded expected
duration of 6000

> Task :src:dist-check:batchTestSchedulerWithTimer FAILED
checksum-dependency elapsed time: 10217ms, configurations processed: 270 (add -PchecksumTimingsPrint
to print detailed timings)

Build jmeter FAILURE reason:                                
    Execution failed for task ':src:dist-check:batchTestSchedulerWithTimer':
        Failures detected while testing <https://builds.apache.org/job/JMeter%20Ubuntu/ws/bin/testfiles/TestSchedulerWithTimer.jmx>:
[unexpected output TestSchedulerWithTimer.csv, unexpected output TestSchedulerWithTimer.xml,
errors in TestSchedulerWithTimer.log]
            at org.apache.jmeter.buildtools.batchtest.BatchTest.exec(BatchTest.kt:184)
            at org.gradle.internal.reflect.JavaMethod.invoke(JavaMethod.java:104)
            at org.gradle.api.internal.project.taskfactory.StandardTaskAction.doExecute(StandardTaskAction.java:49)
            at org.gradle.api.internal.project.taskfactory.StandardTaskAction.execute(StandardTaskAction.java:42)
            at org.gradle.api.internal.project.taskfactory.StandardTaskAction.execute(StandardTaskAction.java:28)
            at org.gradle.api.internal.AbstractTask$TaskActionWrapper.execute(AbstractTask.java:727)
            at org.gradle.api.internal.AbstractTask$TaskActionWrapper.execute(AbstractTask.java:694)
            at org.gradle.api.internal.tasks.execution.ExecuteActionsTaskExecuter$3.run(ExecuteActionsTaskExecuter.java:568)
            at org.gradle.internal.operations.DefaultBuildOperationExecutor$RunnableBuildOperationWorker.execute(DefaultBuildOperationExecutor.java:402)
            at org.gradle.internal.operations.DefaultBuildOperationExecutor$RunnableBuildOperationWorker.execute(DefaultBuildOperationExecutor.java:394)
            at org.gradle.internal.operations.DefaultBuildOperationExecutor$1.execute(DefaultBuildOperationExecutor.java:165)
            at org.gradle.internal.operations.DefaultBuildOperationExecutor.execute(DefaultBuildOperationExecutor.java:250)
            at org.gradle.internal.operations.DefaultBuildOperationExecutor.execute(DefaultBuildOperationExecutor.java:158)
            at org.gradle.internal.operations.DefaultBuildOperationExecutor.run(DefaultBuildOperationExecutor.java:92)
            at org.gradle.internal.operations.DelegatingBuildOperationExecutor.run(DelegatingBuildOperationExecutor.java:31)
            at org.gradle.api.internal.tasks.execution.ExecuteActionsTaskExecuter.executeAction(ExecuteActionsTaskExecuter.java:553)
            at org.gradle.api.internal.tasks.execution.ExecuteActionsTaskExecuter.executeActions(ExecuteActionsTaskExecuter.java:536)
            at org.gradle.api.internal.tasks.execution.ExecuteActionsTaskExecuter.access$300(ExecuteActionsTaskExecuter.java:109)
            at org.gradle.api.internal.tasks.execution.ExecuteActionsTaskExecuter$TaskExecution.executeWithPreviousOutputFiles(ExecuteActionsTaskExecuter.java:276)
            at org.gradle.api.internal.tasks.execution.ExecuteActionsTaskExecuter$TaskExecution.execute(ExecuteActionsTaskExecuter.java:265)
            at org.gradle.internal.execution.steps.ExecuteStep.lambda$execute$1(ExecuteStep.java:33)
            at org.gradle.internal.execution.steps.ExecuteStep.execute(ExecuteStep.java:33)
            at org.gradle.internal.execution.steps.ExecuteStep.execute(ExecuteStep.java:26)
            at org.gradle.internal.execution.steps.CleanupOutputsStep.execute(CleanupOutputsStep.java:67)
            at org.gradle.internal.execution.steps.CleanupOutputsStep.execute(CleanupOutputsStep.java:36)
            at org.gradle.internal.execution.steps.ResolveInputChangesStep.execute(ResolveInputChangesStep.java:49)
            at org.gradle.internal.execution.steps.ResolveInputChangesStep.execute(ResolveInputChangesStep.java:34)
            at org.gradle.internal.execution.steps.CancelExecutionStep.execute(CancelExecutionStep.java:43)
            at org.gradle.internal.execution.steps.TimeoutStep.executeWithoutTimeout(TimeoutStep.java:73)
            at org.gradle.internal.execution.steps.TimeoutStep.execute(TimeoutStep.java:54)
            at org.gradle.internal.execution.steps.CatchExceptionStep.execute(CatchExceptionStep.java:34)
            at org.gradle.internal.execution.steps.CreateOutputsStep.execute(CreateOutputsStep.java:44)
            at org.gradle.internal.execution.steps.SnapshotOutputsStep.execute(SnapshotOutputsStep.java:54)
            at org.gradle.internal.execution.steps.SnapshotOutputsStep.execute(SnapshotOutputsStep.java:38)
            at org.gradle.internal.execution.steps.BroadcastChangingOutputsStep.execute(BroadcastChangingOutputsStep.java:49)
            at org.gradle.internal.execution.steps.CacheStep.executeWithoutCache(CacheStep.java:159)
            at org.gradle.internal.execution.steps.CacheStep.execute(CacheStep.java:72)
            at org.gradle.internal.execution.steps.CacheStep.execute(CacheStep.java:43)
            at org.gradle.internal.execution.steps.StoreExecutionStateStep.execute(StoreExecutionStateStep.java:44)
            at org.gradle.internal.execution.steps.StoreExecutionStateStep.execute(StoreExecutionStateStep.java:33)
            at org.gradle.internal.execution.steps.RecordOutputsStep.execute(RecordOutputsStep.java:38)
            at org.gradle.internal.execution.steps.RecordOutputsStep.execute(RecordOutputsStep.java:24)
            at org.gradle.internal.execution.steps.SkipUpToDateStep.executeBecause(SkipUpToDateStep.java:92)
            at org.gradle.internal.execution.steps.SkipUpToDateStep.lambda$execute$0(SkipUpToDateStep.java:85)
            at org.gradle.internal.execution.steps.SkipUpToDateStep.execute(SkipUpToDateStep.java:55)
            at org.gradle.internal.execution.steps.SkipUpToDateStep.execute(SkipUpToDateStep.java:39)
            at org.gradle.internal.execution.steps.ResolveChangesStep.execute(ResolveChangesStep.java:76)
            at org.gradle.internal.execution.steps.ResolveChangesStep.execute(ResolveChangesStep.java:37)
            at org.gradle.internal.execution.steps.legacy.MarkSnapshottingInputsFinishedStep.execute(MarkSnapshottingInputsFinishedStep.java:36)
            at org.gradle.internal.execution.steps.legacy.MarkSnapshottingInputsFinishedStep.execute(MarkSnapshottingInputsFinishedStep.java:26)
            at org.gradle.internal.execution.steps.ResolveCachingStateStep.execute(ResolveCachingStateStep.java:94)
            at org.gradle.internal.execution.steps.ResolveCachingStateStep.execute(ResolveCachingStateStep.java:49)
            at org.gradle.internal.execution.steps.CaptureStateBeforeExecutionStep.execute(CaptureStateBeforeExecutionStep.java:79)
            at org.gradle.internal.execution.steps.CaptureStateBeforeExecutionStep.execute(CaptureStateBeforeExecutionStep.java:53)
            at org.gradle.internal.execution.steps.ValidateStep.execute(ValidateStep.java:74)
            at org.gradle.internal.execution.steps.SkipEmptyWorkStep.lambda$execute$2(SkipEmptyWorkStep.java:78)
            at org.gradle.internal.execution.steps.SkipEmptyWorkStep.execute(SkipEmptyWorkStep.java:78)
            at org.gradle.internal.execution.steps.SkipEmptyWorkStep.execute(SkipEmptyWorkStep.java:34)
            at org.gradle.internal.execution.steps.legacy.MarkSnapshottingInputsStartedStep.execute(MarkSnapshottingInputsStartedStep.java:39)
            at org.gradle.internal.execution.steps.LoadExecutionStateStep.execute(LoadExecutionStateStep.java:40)
            at org.gradle.internal.execution.steps.LoadExecutionStateStep.execute(LoadExecutionStateStep.java:28)


FAILURE: Build failed with an exception.

* What went wrong:
Execution failed for task ':src:dist-check:batchTestSchedulerWithTimer'.
> Failures detected while testing <https://builds.apache.org/job/JMeter%20Ubuntu/ws/bin/testfiles/TestSchedulerWithTimer.jmx>:
[unexpected output TestSchedulerWithTimer.csv, unexpected output TestSchedulerWithTimer.xml,
errors in TestSchedulerWithTimer.log]

* Try:
Run with --stacktrace option to get the stack trace. Run with --info or --debug option to
get more log output. Run with --scan to get full insights.

* Get more help at https://help.gradle.org

Deprecated Gradle features were used in this build, making it incompatible with Gradle 7.0.
Use '--warning-mode all' to show the individual deprecation warnings.
See https://docs.gradle.org/6.3/userguide/command_line_interface.html#sec:command_line_warnings

BUILD FAILED in 5m 1s
258 actionable tasks: 163 executed, 95 up-to-date
Build step 'Invoke Gradle script' changed build result to FAILURE
Build step 'Invoke Gradle script' marked build as failure
[locks-and-latches] Releasing all the locks
[locks-and-latches] All the locks released

Mime
View raw message