jmeter-dev mailing list archives

Site index · List index
Message view « Date » · « Thread »
Top « Date » · « Thread »
From Apache Jenkins Server <jenk...@builds.apache.org>
Subject Build failed in Jenkins: JMeter » JMeter-trunk #115
Date Sat, 24 Oct 2020 14:57:07 GMT
See <https://ci-builds.apache.org/job/JMeter/job/JMeter-trunk/115/display/redirect?page=changes>

Changes:

[Philippe Mouawad] Bug 64795: Clarify documentation on Generate Summary Results


------------------------------------------
[...truncated 2.04 KB...]
[EnvInject] - Variables injected successfully.
[EnvInject] - Mask passwords that will be passed as build parameters.
[Gradle] - Launching build.
[JMeter-trunk] $ <https://ci-builds.apache.org/job/JMeter/job/JMeter-trunk/ws/gradlew>
"-Dorg.gradle.jvmargs=-Xmx512m -XX:MaxMetaspaceSize=512m" -PignoreSpotBugsFailures=true -Pspotbugs=true
-PCI=true -Pcoverage=true --profile --no-daemon cleanTest check assemble
To honour the JVM settings for this build a new JVM will be forked. Please consider using
the daemon: https://docs.gradle.org/6.7/userguide/gradle_daemon.html.
Daemon will be stopped at the end of the build stopping after processing
> Task :buildSrc:compileKotlin NO-SOURCE
> Task :buildSrc:compileJava NO-SOURCE
> Task :buildSrc:compileGroovy NO-SOURCE
> Task :buildSrc:pluginDescriptors UP-TO-DATE
> Task :buildSrc:processResources NO-SOURCE
> Task :buildSrc:classes UP-TO-DATE
> Task :buildSrc:inspectClassesForKotlinIC UP-TO-DATE
> Task :buildSrc:jar UP-TO-DATE
> Task :buildSrc:assemble UP-TO-DATE
> Task :buildSrc:autostyleKotlinCheck NO-SOURCE
> Task :buildSrc:batchtest:compileKotlin UP-TO-DATE
> Task :buildSrc:batchtest:compileJava NO-SOURCE
> Task :buildSrc:batchtest:pluginDescriptors UP-TO-DATE
> Task :buildSrc:batchtest:processResources UP-TO-DATE
> Task :buildSrc:batchtest:classes UP-TO-DATE
> Task :buildSrc:batchtest:inspectClassesForKotlinIC UP-TO-DATE
> Task :buildSrc:batchtest:jar UP-TO-DATE
> Task :buildSrc:batchtest:assemble UP-TO-DATE
> Task :buildSrc:autostyleKotlinGradleCheck
> Task :buildSrc:autostyleCheck
> Task :buildSrc:compileTestKotlin NO-SOURCE
> Task :buildSrc:pluginUnderTestMetadata UP-TO-DATE
> Task :buildSrc:compileTestJava NO-SOURCE
> Task :buildSrc:compileTestGroovy NO-SOURCE
> Task :buildSrc:processTestResources NO-SOURCE
> Task :buildSrc:testClasses UP-TO-DATE
> Task :buildSrc:test NO-SOURCE
> Task :buildSrc:validatePlugins UP-TO-DATE
> Task :buildSrc:check
> Task :buildSrc:build
> Task :buildSrc:batchtest:autostyleKotlinCheck
> Task :buildSrc:batchtest:autostyleKotlinGradleCheck
> Task :buildSrc:batchtest:autostyleCheck
> Task :buildSrc:batchtest:compileTestKotlin NO-SOURCE
> Task :buildSrc:batchtest:pluginUnderTestMetadata UP-TO-DATE
> Task :buildSrc:batchtest:compileTestJava NO-SOURCE
> Task :buildSrc:batchtest:processTestResources NO-SOURCE
> Task :buildSrc:batchtest:testClasses UP-TO-DATE
> Task :buildSrc:batchtest:test NO-SOURCE
> Task :buildSrc:batchtest:validatePlugins UP-TO-DATE
> Task :buildSrc:batchtest:check
> Task :buildSrc:batchtest:build
checksum-dependency elapsed time: 1244ms, configurations processed: 20 (add -PchecksumTimingsPrint
to print detailed timings)

See the profiling report at: file://<https://ci-builds.apache.org/job/JMeter/job/JMeter-trunk/ws/buildSrc/build/reports/profile/profile-2020-10-24-14-56-51.html>
A fine-grained performance profile is available: use the --scan option.

> Configure project :
Building JMeter 5.3.1-SNAPSHOT

> Configure project :src:components
RenderInBrowser is excluded from compilation. If you want to compile it, add -PenableJavaFx

> Configure project :src:dist-check
Certain tests will be skipped as they depend on external services and fail too often. Please
add -PenableFlaky to enable them: [batchHttp4ImplDigestAuth, batchHttp4ImplPreemptiveBasicAuthJava,
batchSlowCharsFeatureHttpClient4, batchSlowCharsFeatureJava, batchTCP_TESTS, batchTestKeepAlive,
batchTestRedirectionPolicies]

> Task :src:bshclient:cleanTest UP-TO-DATE
> Task :cleanTest UP-TO-DATE
> Task :src:config:cleanTest UP-TO-DATE
> Task :src:dist:cleanTest UP-TO-DATE
> Task :src:examples:cleanTest UP-TO-DATE
> Task :src:generator:cleanTest UP-TO-DATE
> Task :src:launcher:cleanTest UP-TO-DATE
> Task :src:licenses:cleanTest UP-TO-DATE
> Task :src:protocol:cleanTest UP-TO-DATE
> Task :src:jorphan:cleanTest
> Task :src:dist-check:cleanTest
> Task :src:testkit-wiremock:cleanTest UP-TO-DATE
> Task :src:functions:cleanTest
> Task :src:release:cleanTest UP-TO-DATE
> Task :src:testkit:cleanTest UP-TO-DATE
> Task :src:core:cleanTest
> Task :src:protocol:bolt:cleanTest
> Task :src:protocol:ftp:cleanTest
> Task :src:components:cleanTest
> Task :src:protocol:java:cleanTest
> Task :src:protocol:jms:cleanTest
> Task :src:protocol:jdbc:cleanTest
> Task :src:protocol:junit:cleanTest
> Task :src:protocol:junit-sample:cleanTest UP-TO-DATE
> Task :src:protocol:ldap:cleanTest
> Task :src:protocol:mongodb:cleanTest
> Task :src:protocol:mail:cleanTest
> Task :src:protocol:native:cleanTest
> Task :src:protocol:http:cleanTest
> Task :src:protocol:tcp:cleanTest
> Task :src:bom:autostyleConfigsCheck NO-SOURCE
> Task :src:bshclient:autostyleConfigsCheck NO-SOURCE
> Task :src:config:autostyleConfigsCheck NO-SOURCE
> Task :src:dist:autostyleConfigsCheck NO-SOURCE
> Task :src:config:autostyleJavaCheck NO-SOURCE
> Task :src:dist:autostyleJavaCheck NO-SOURCE
> Task :src:protocol:jms:processResources NO-SOURCE
> Task :src:protocol:ftp:processResources NO-SOURCE
> Task :src:protocol:ldap:processResources NO-SOURCE
> Task :src:protocol:native:processResources NO-SOURCE
> Task :src:protocol:junit:processResources NO-SOURCE
> Task :src:protocol:tcp:processResources NO-SOURCE
> Task :src:protocol:ftp:processTestResources NO-SOURCE
> Task :src:protocol:jms:processTestResources NO-SOURCE
> Task :src:protocol:junit:processTestResources NO-SOURCE
> Task :src:protocol:ldap:processTestResources NO-SOURCE
> Task :src:protocol:native:processTestResources NO-SOURCE
> Task :src:protocol:tcp:processTestResources NO-SOURCE
> Task :src:generator:processResources NO-SOURCE
> Task :src:protocol:junit-sample:processResources NO-SOURCE
> Task :src:protocol:autostyleConfigsCheck NO-SOURCE
> Task :src:protocol:autostyleJavaCheck NO-SOURCE
> Task :src:generator:autostyleConfigsCheck NO-SOURCE
> Task :src:functions:processResources UP-TO-DATE
> Task :src:protocol:mail:processResources UP-TO-DATE
> Task :src:protocol:mail:processTestResources NO-SOURCE
> Task :src:protocol:bolt:processResources UP-TO-DATE
> Task :src:licenses:autostyleConfigsCheck NO-SOURCE
> Task :src:licenses:autostyleJavaCheck NO-SOURCE
> Task :src:protocol:http:processResources UP-TO-DATE
> Task :src:protocol:java:processResources UP-TO-DATE
> Task :src:release:autostyleConfigsCheck NO-SOURCE
> Task :src:protocol:bolt:processTestResources NO-SOURCE
> Task :src:protocol:java:processTestResources NO-SOURCE
> Task :src:protocol:mongodb:processResources UP-TO-DATE
> Task :src:release:autostyleJavaCheck NO-SOURCE
> Task :src:functions:processTestResources UP-TO-DATE
> Task :src:dist-check:autostyleConfigsCheck NO-SOURCE
> Task :src:protocol:mongodb:processTestResources NO-SOURCE
> Task :src:protocol:jdbc:processResources UP-TO-DATE
> Task :src:protocol:ftp:autostyleConfigsCheck NO-SOURCE
> Task :src:protocol:jdbc:processTestResources NO-SOURCE
> Task :src:protocol:http:processTestResources UP-TO-DATE
> Task :src:launcher:compileJava UP-TO-DATE
> Task :src:testkit:compileJava UP-TO-DATE
> Task :src:testkit:processResources NO-SOURCE
> Task :src:testkit:classes UP-TO-DATE
> Task :src:launcher:processResources UP-TO-DATE
> Task :src:launcher:classes UP-TO-DATE
> Task :src:testkit:jar UP-TO-DATE
> Task :src:launcher:jar UP-TO-DATE
> Task :src:testkit:compileTestFixturesJava NO-SOURCE
> Task :src:launcher:autostyleConfigsCheck NO-SOURCE
> Task :src:testkit:processTestFixturesResources NO-SOURCE
> Task :src:testkit:testFixturesClasses UP-TO-DATE
> Task :src:testkit:testFixturesJar UP-TO-DATE
> Task :src:core:versionClass
> Task :src:testkit:autostyleConfigsCheck NO-SOURCE
> Task :src:protocol:bolt:autostyleConfigsCheck
> Task :src:functions:autostyleConfigsCheck
> Task :src:autostyleConfigsCheck
> Task :src:protocol:http:autostyleConfigsCheck
> Task :src:protocol:java:autostyleConfigsCheck
> Task :src:examples:autostyleConfigsCheck
> Task :src:jorphan:compileJava UP-TO-DATE
> Task :src:jorphan:compileGroovy NO-SOURCE
> Task :src:protocol:jdbc:autostyleConfigsCheck
> Task :src:jorphan:processResources UP-TO-DATE
> Task :src:jorphan:classes UP-TO-DATE
> Task :src:protocol:bolt:autostyleGroovyCheck
> Task :src:jorphan:jar UP-TO-DATE
> Task :src:functions:autostyleGroovyCheck
> Task :src:protocol:jdbc:autostyleGroovyCheck
> Task :src:dist-check:autostyleGroovyCheck
> Task :src:protocol:http:autostyleGroovyCheck
> Task :src:core:processResources UP-TO-DATE
> Task :src:testkit-wiremock:compileJava UP-TO-DATE
> Task :src:testkit-wiremock:processResources NO-SOURCE
> Task :src:testkit-wiremock:classes UP-TO-DATE
> Task :src:testkit-wiremock:jar UP-TO-DATE
> Task :src:testkit-wiremock:compileTestFixturesJava NO-SOURCE
> Task :src:testkit-wiremock:processTestFixturesResources NO-SOURCE
> Task :src:testkit-wiremock:testFixturesClasses UP-TO-DATE
> Task :src:testkit-wiremock:testFixturesJar UP-TO-DATE
> Task :src:testkit-wiremock:autostyleConfigsCheck NO-SOURCE
> Task :src:components:autostyleConfigsCheck
> Task :src:components:autostyleGroovyCheck
> Task :src:jorphan:compileTestJava UP-TO-DATE
> Task :src:jorphan:compileTestGroovy UP-TO-DATE
> Task :src:jorphan:processTestResources NO-SOURCE
> Task :src:jorphan:testClasses UP-TO-DATE
> Task :src:jorphan:testJar UP-TO-DATE
> Task :src:jorphan:autostyleConfigsCheck NO-SOURCE
> Task :src:jorphan:autostyleGroovyCheck
> Task :autostyleConfigsCheck FAILED
> Task :src:testkit-wiremock:autostyleJavaCheck
> Task :src:bshclient:autostyleJavaCheck
> Task :src:testkit:autostyleJavaCheck
> Task :src:generator:autostyleJavaCheck
> Task :src:examples:autostyleJavaCheck
> Task :src:protocol:bolt:autostyleJavaCheck
> Task :src:launcher:autostyleJavaCheck
> Task :src:protocol:ftp:autostyleJavaCheck
> Task :src:dist-check:autostyleJavaCheck
> Task :src:protocol:jdbc:autostyleJavaCheck
> Task :src:protocol:java:autostyleJavaCheck
> Task :src:functions:autostyleJavaCheck
> Task :src:jorphan:autostyleJavaCheck
> Task :src:config:autostyleKotlinGradleCheck
> Task :src:release:autostyleKotlinGradleCheck
> Task :src:components:autostyleJavaCheck
> Task :src:protocol:autostyleKotlinGradleCheck
> Task :src:autostyleKotlinGradleCheck
> Task :src:bom:autostyleKotlinGradleCheck
> Task :src:licenses:autostyleKotlinGradleCheck
> Task :src:dist:autostyleKotlinGradleCheck
> Task :src:core:compileJava
> Task :src:protocol:http:autostyleJavaCheck
checksum-dependency elapsed time: 7034ms, configurations processed: 70 (add -PchecksumTimingsPrint
to print detailed timings)

FAILURE: Build failed with an exception.

* What went wrong:
Execution failed for task ':autostyleConfigsCheck'.
> The following files have format violations:
    xdocs/usermanual/component_reference.xml
      @@ -3347,7 +3347,7 @@
       standard output. Both running and differential totals are shown.
       Output is generated every <code>n</code> seconds (default 30 seconds) on
the appropriate
       time boundary, so that multiple test runs on the same time will be synchronised.
      -<note>Since�a�summary/differential�line�is�written�only�if�there�are�samples�emitted,�the�interval�\n
      +<note>Since�a�summary/differential�line�is�written�only�if�there�are�samples�emitted,�the�interval\n
       for generation may not be respected if your test has no sample generated within the
interval</note>
       See <code>jmeter.properties</code> file for the summariser configuration
items:
       <source>
  Run './gradlew autostyleApply' to fix the violations.

* Try:
Run with --stacktrace option to get the stack trace. Run with --info or --debug option to
get more log output. Run with --scan to get full insights.

* Get more help at https://help.gradle.org

Deprecated Gradle features were used in this build, making it incompatible with Gradle 7.0.
Use '--warning-mode all' to show the individual deprecation warnings.
See https://docs.gradle.org/6.7/userguide/command_line_interface.html#sec:command_line_warnings

BUILD FAILED in 23s
95 actionable tasks: 57 executed, 38 up-to-date

See the profiling report at: file://<https://ci-builds.apache.org/job/JMeter/job/JMeter-trunk/ws/build/reports/profile/profile-2020-10-24-14-56-48.html>
A fine-grained performance profile is available: use the --scan option.
Build step 'Invoke Gradle script' changed build result to FAILURE
Build step 'Invoke Gradle script' marked build as failure
Xvfb stopping
Archiving artifacts
Recording test results
ERROR: Step ?Publish JUnit test result report? failed: No test report files were found. Configuration
error?

Mime
View raw message