jmeter-dev mailing list archives

Site index · List index
Message view « Date » · « Thread »
Top « Date » · « Thread »
From Apache Jenkins Server <jenk...@builds.apache.org>
Subject Build failed in Jenkins: JMeter » JMeter-trunk #113
Date Sun, 18 Oct 2020 13:45:54 GMT
See <https://ci-builds.apache.org/job/JMeter/job/JMeter-trunk/113/display/redirect?page=changes>

Changes:

[Philippe Mouawad] Bug 64824: Dashboard/HTML Report: Rename KO to FAIL


------------------------------------------
[...truncated 315.42 KB...]
Created the tree successfully using <https://ci-builds.apache.org/job/JMeter/job/JMeter-trunk/ws/bin/testfiles/OS_TESTS.jmx>
Starting standalone test @ Sun Oct 18 13:43:31 UTC 2020 (1603028611842)
Waiting for possible Shutdown/StopTestNow/HeapDump/ThreadDump message on port 4445
summary +      1 in 00:00:01 =    0.8/s Avg:    16 Min:    16 Max:    16 Err:     0 (0.00%)
Active: 1 Started: 1 Finished: 0
summary +      2 in 00:00:01 =    1.9/s Avg:   502 Min:     2 Max:  1002 Err:     0 (0.00%)
Active: 0 Started: 1 Finished: 1
summary =      3 in 00:00:02 =    1.3/s Avg:   340 Min:     2 Max:  1002 Err:     0 (0.00%)
Tidying up ...    @ Sun Oct 18 13:43:34 UTC 2020 (1603028614368)
... end of run
No errors present in the logfile <https://ci-builds.apache.org/job/JMeter/job/JMeter-trunk/ws/bin/OS_TESTS.log>
(the file is empty)

> Task :src:dist-check:batchResponseDecompression
Creating summariser <summary>
Created the tree successfully using <https://ci-builds.apache.org/job/JMeter/job/JMeter-trunk/ws/bin/testfiles/ResponseDecompression.jmx>
Starting standalone test @ Sun Oct 18 13:43:36 UTC 2020 (1603028616762)
Waiting for possible Shutdown/StopTestNow/HeapDump/ThreadDump message on port 4445
summary =      2 in 00:00:02 =    1.1/s Avg:   418 Min:   350 Max:   487 Err:     0 (0.00%)
Tidying up ...    @ Sun Oct 18 13:43:39 UTC 2020 (1603028619081)
... end of run
No errors present in the logfile <https://ci-builds.apache.org/job/JMeter/job/JMeter-trunk/ws/bin/ResponseDecompression.log>
(the file is empty)
[server] Created remote object: UnicastServerRef2 [liveRef: [endpoint:[asf940.gq1.ygridcore.net:40193,SSLRMIServerSocketFactory(host=asf940.gq1.ygridcore.net/67.195.81.165,
keyStoreLocation=rmi_keystore.jks, type=JKS, trustStoreLocation=rmi_keystore.jks, type=JKS,
alias=rmi),SSLRMIClientSocketFactory(keyStoreLocation=rmi_keystore.jks, type=JKS, trustStoreLocation=rmi_keystore.jks,
type=JKS, alias=rmi)](local),objID:[56f074d4:1753bf39693:-7fff, 5182033292016471139]]]

> Task :src:dist-check:batchServerBatchTestLocal
Creating summariser <summary>
Created the tree successfully using <https://ci-builds.apache.org/job/JMeter/job/JMeter-trunk/ws/bin/testfiles/BatchTestLocal.jmx>
Configuring remote engine: asf940.gq1.ygridcore.net:34409
Starting distributed test with remote engines: [asf940.gq1.ygridcore.net:34409] @ Sun Oct
18 13:43:44 UTC 2020 (1603028624412)

[server] Starting the test on host asf940.gq1.ygridcore.net:34409 @ Sun Oct 18 13:43:47 UTC
2020 (1603028627728)

> Task :src:dist-check:batchServerBatchTestLocal
Remote engines have been started:[asf940.gq1.ygridcore.net:34409]
Waiting for possible Shutdown/StopTestNow/HeapDump/ThreadDump message on port 4445
summary =    132 in 00:00:07 =   18.8/s Avg:     4 Min:     1 Max:    71 Err:    16 (12.12%)
Tidying up remote @ Sun Oct 18 13:43:55 UTC 2020 (1603028635337)

[server] Finished the test on host asf940.gq1.ygridcore.net:34409 @ Sun Oct 18 13:43:55 UTC
2020 (1603028635337) - exit requested.

> Task :src:dist-check:batchServerBatchTestLocal
... end of run
No errors present in the logfile <https://ci-builds.apache.org/job/JMeter/job/JMeter-trunk/ws/bin/BatchTestLocal.log>
(the file is empty)
No errors present in the logfile <https://ci-builds.apache.org/job/JMeter/job/JMeter-trunk/ws/bin/BatchTestLocalServer.log>
(the file is empty)

> Task :src:dist-check:batchSlowCharsFeatureHttpClient4 SKIPPED
> Task :src:dist-check:batchSlowCharsFeatureJava SKIPPED
> Task :src:dist-check:batchTCP_TESTS SKIPPED

> Task :src:dist-check:batchTEST_HTTPHttpClient4
Creating summariser <summary>
Created the tree successfully using <https://ci-builds.apache.org/job/JMeter/job/JMeter-trunk/ws/bin/testfiles/TEST_HTTP.jmx>
Starting standalone test @ Sun Oct 18 13:44:03 UTC 2020 (1603028643243)
Waiting for possible Shutdown/StopTestNow/HeapDump/ThreadDump message on port 4445
summary +      1 in 00:00:01 =    1.0/s Avg:   946 Min:   946 Max:   946 Err:     0 (0.00%)
Active: 1 Started: 1 Finished: 0
summary +     21 in 00:00:01 =   23.7/s Avg:    12 Min:     1 Max:    80 Err:     0 (0.00%)
Active: 0 Started: 1 Finished: 1
summary =     22 in 00:00:02 =   11.7/s Avg:    54 Min:     1 Max:   946 Err:     0 (0.00%)
Tidying up ...    @ Sun Oct 18 13:44:05 UTC 2020 (1603028645630)
... end of run
No errors present in the logfile <https://ci-builds.apache.org/job/JMeter/job/JMeter-trunk/ws/bin/TEST_HTTP.log>
(the file is empty)

> Task :src:dist-check:batchTEST_HTTPJava
Creating summariser <summary>
Created the tree successfully using <https://ci-builds.apache.org/job/JMeter/job/JMeter-trunk/ws/bin/testfiles/TEST_HTTP.jmx>
Starting standalone test @ Sun Oct 18 13:44:09 UTC 2020 (1603028649561)
Waiting for possible Shutdown/StopTestNow/HeapDump/ThreadDump message on port 4445
summary =     20 in 00:00:02 =   11.9/s Avg:    56 Min:     1 Max:   917 Err:     0 (0.00%)
Tidying up ...    @ Sun Oct 18 13:44:11 UTC 2020 (1603028651737)
... end of run
WARNING: the task was configured to ignore errors in the output log
Logfile contents (errors during the test, see <https://ci-builds.apache.org/job/JMeter/job/JMeter-trunk/ws/bin/TEST_HTTP.log)>:
2020-10-18 13:44:11,496 ERROR o.a.j.p.h.s.HTTPJavaImpl: readResponse: java.net.ProtocolException:
Server redirected too many  times (20)
2020-10-18 13:44:11,500 ERROR o.a.j.p.h.s.HTTPJavaImpl: Cause: java.net.ProtocolException:
Server redirected too many  times (20)
2020-10-18 13:44:11,500 ERROR o.a.j.p.h.c.HttpMirrorThread: Invalid request received:''

> Task :src:dist-check:batchTEST_HTTPS
Creating summariser <summary>
Created the tree successfully using <https://ci-builds.apache.org/job/JMeter/job/JMeter-trunk/ws/bin/testfiles/TEST_HTTPS.jmx>
Starting standalone test @ Sun Oct 18 13:44:15 UTC 2020 (1603028655013)
Waiting for possible Shutdown/StopTestNow/HeapDump/ThreadDump message on port 4445
summary =      2 in 00:00:02 =    1.1/s Avg:   776 Min:   502 Max:  1051 Err:     0 (0.00%)
Tidying up ...    @ Sun Oct 18 13:44:17 UTC 2020 (1603028657455)
... end of run
No errors present in the logfile <https://ci-builds.apache.org/job/JMeter/job/JMeter-trunk/ws/bin/TEST_HTTPS.log>
(the file is empty)

> Task :src:dist-check:batchTestCookieManager
Creating summariser <summary>
Created the tree successfully using <https://ci-builds.apache.org/job/JMeter/job/JMeter-trunk/ws/bin/testfiles/TestCookieManager.jmx>
Starting standalone test @ Sun Oct 18 13:44:19 UTC 2020 (1603028659925)
Waiting for possible Shutdown/StopTestNow/HeapDump/ThreadDump message on port 4445
summary =     10 in 00:00:02 =    6.1/s Avg:   126 Min:     1 Max:   955 Err:     0 (0.00%)
Tidying up ...    @ Sun Oct 18 13:44:22 UTC 2020 (1603028662502)
... end of run
No errors present in the logfile <https://ci-builds.apache.org/job/JMeter/job/JMeter-trunk/ws/bin/TestCookieManager.log>
(the file is empty)

> Task :src:dist-check:batchTestHeaderManagerHttpClient4
Creating summariser <summary>
Created the tree successfully using <https://ci-builds.apache.org/job/JMeter/job/JMeter-trunk/ws/bin/testfiles/TestHeaderManager.jmx>
Starting standalone test @ Sun Oct 18 13:44:25 UTC 2020 (1603028665804)
Waiting for possible Shutdown/StopTestNow/HeapDump/ThreadDump message on port 4445
summary =      3 in 00:00:00 =    7.3/s Avg:    14 Min:     1 Max:    39 Err:     0 (0.00%)
Tidying up ...    @ Sun Oct 18 13:44:26 UTC 2020 (1603028666760)
... end of run
No errors present in the logfile <https://ci-builds.apache.org/job/JMeter/job/JMeter-trunk/ws/bin/TestHeaderManager.log>
(the file is empty)

> Task :src:dist-check:batchTestHeaderManagerJava
Creating summariser <summary>
Created the tree successfully using <https://ci-builds.apache.org/job/JMeter/job/JMeter-trunk/ws/bin/testfiles/TestHeaderManager.jmx>
Starting standalone test @ Sun Oct 18 13:44:29 UTC 2020 (1603028669105)
Waiting for possible Shutdown/StopTestNow/HeapDump/ThreadDump message on port 4445
summary =      3 in 00:00:00 =   14.9/s Avg:     5 Min:     1 Max:    13 Err:     0 (0.00%)
Tidying up ...    @ Sun Oct 18 13:44:29 UTC 2020 (1603028669889)
... end of run
No errors present in the logfile <https://ci-builds.apache.org/job/JMeter/job/JMeter-trunk/ws/bin/TestHeaderManager.log>
(the file is empty)

> Task :src:dist-check:batchTestKeepAlive SKIPPED
> Task :src:dist-check:batchTestRedirectionPolicies SKIPPED

> Task :src:dist-check:batchTestResultStatusAction
Creating summariser <summary>
Created the tree successfully using <https://ci-builds.apache.org/job/JMeter/job/JMeter-trunk/ws/bin/testfiles/TestResultStatusAction.jmx>
Starting standalone test @ Sun Oct 18 13:44:32 UTC 2020 (1603028672253)
Waiting for possible Shutdown/StopTestNow/HeapDump/ThreadDump message on port 4445
summary +      1 in 00:00:01 =    1.0/s Avg:     2 Min:     2 Max:     2 Err:     0 (0.00%)
Active: 1 Started: 1 Finished: 0
summary +    134 in 00:00:00 =  407.3/s Avg:     1 Min:     0 Max:   189 Err:    18 (13.43%)
Active: 0 Started: 4 Finished: 4
summary =    135 in 00:00:01 =  104.3/s Avg:     1 Min:     0 Max:   189 Err:    18 (13.33%)
Tidying up ...    @ Sun Oct 18 13:44:34 UTC 2020 (1603028674444)
... end of run
No errors present in the logfile <https://ci-builds.apache.org/job/JMeter/job/JMeter-trunk/ws/bin/TestResultStatusAction.log>
(the file is empty)

> Task :src:dist-check:batchTestSchedulerWithTimer
Creating summariser <summary>
Created the tree successfully using <https://ci-builds.apache.org/job/JMeter/job/JMeter-trunk/ws/bin/testfiles/TestSchedulerWithTimer.jmx>
Starting standalone test @ Sun Oct 18 13:44:36 UTC 2020 (1603028676749)
Waiting for possible Shutdown/StopTestNow/HeapDump/ThreadDump message on port 4445
summary =      5 in 00:00:06 =    0.8/s Avg:   251 Min:     2 Max:   889 Err:     0 (0.00%)
Tidying up ...    @ Sun Oct 18 13:44:44 UTC 2020 (1603028684030)
... end of run
No errors present in the logfile <https://ci-builds.apache.org/job/JMeter/job/JMeter-trunk/ws/bin/TestSchedulerWithTimer.log>
(the file is empty)

> Task :src:dist-check:batchTests

> Task :src:dist-check:test

Gradle Test Executor 38 STANDARD_OUT
    Setting JMeterHome: <https://ci-builds.apache.org/job/JMeter/job/JMeter-trunk/ws/src/dist-check/../../.>
    Initializing Properties: ../.././bin/jmeter.properties
    JMeterVersion=5.3.1-SNAPSHOT 2289ac9
    java.version=1.8.0_252
    java.vm.name=OpenJDK 64-Bit Server VM
    java.vendor=Oracle Corporation
    java.home=/usr/local/asfpackages/java/openjdk-8u252-b09/jre
    file.encoding=ISO-8859-1
    default encoding=ISO-8859-1
    user.home=/home/jenkins
    user.dir=<https://ci-builds.apache.org/job/JMeter/job/JMeter-trunk/ws/src/dist-check>
    user.language=en
    user.region=null
    user.country=US
    user.variant=
    Locale=en_US
    java.class.version=52.0
    java.awt.headless=null
    os.name=Linux
    os.version=4.15.0-76-generic
    os.arch=amd64
    o.a.j.junit.JMeterTest WARN: org.apache.jmeter.gui.JMeterGUIComponent: NoSuchMethodException
 org.apache.jmeter.gui.menu.StaticJMeterGUIComponent, missing empty Constructor or Constructor
with Object parameter
    o.a.j.junit.JMeterTest INFO: JMeterGUIComponent: skipping some tests org.apache.jmeter.testbeans.gui.TestBeanGUI
    o.a.j.junit.JMeterTest WARN: java.io.Serializable: NoSuchMethodException  org.apache.jmeter.gui.GlobalUndoableEdit,
missing empty Constructor or Constructor with Object parameter
    o.a.j.junit.JMeterTest WARN: java.io.Serializable: NoSuchMethodException  org.apache.jmeter.rmi.RMIServerSocketFactoryImpl,
missing empty Constructor or Constructor with Object parameter
    o.a.j.junit.JMeterTest WARN: java.io.Serializable: NoSuchMethodException  org.apache.jmeter.rmi.SSLRMIServerSocketFactory,
missing empty Constructor or Constructor with Object parameter
    o.a.j.junit.JMeterTest WARN: Error creating org.apache.jmeter.threads.RemoteThreadsListenerImpl
java.rmi.server.ExportException: Listen failed on port: 0; nested exception is: 
    	java.io.FileNotFoundException: rmi_keystore.jks (No such file or directory)
          0.6sec,    1 completed,   0 failed,   0 skipped, org.apache.jmeter.threads.ThreadGroupLoad
          0.0sec,    2 completed,   0 failed,   0 skipped, org.apache.jmeter.resources.TestPropertiesFiles
          0.0sec,    9 completed,   0 failed,   0 skipped, org.apache.jmeter.control.TestSwitchController
          1.0sec,    5 completed,   0 failed,   0 skipped, org.apache.jmeter.save.TestSaveService
          0.1sec,    7 completed,   0 failed,   0 skipped, org.apache.jorphan.TestFunctorUsers
         12.2sec, org.apache.jorphan.reflect.TestClassFinder > testFindClassesThatExtendStringArrayClassOfQArrayTrue()
          5.7sec, org.apache.jorphan.reflect.TestClassFinder > testFindAnnotatedClasses()
         20.3sec,    9 completed,   0 failed,   0 skipped, org.apache.jorphan.reflect.TestClassFinder
          1.1sec,   83 completed,   0 failed,   0 skipped, org.apache.jmeter.gui.action.TestLoad
FAILURE   0.0sec, org.apache.jmeter.junit.JMeterTest > GUIComponents2
TestBeanGUI:org.apache.jmeter.protocol.bolt.sampler.BoltSampler
    java.lang.NullPointerException
        at org.fife.ui.rsyntaxtextarea.TokenMakerBase.addToken(TokenMakerBase.java:136)
        at org.fife.ui.rsyntaxtextarea.modes.PlainTextTokenMaker.addToken(PlainTextTokenMaker.java:268)
        at org.fife.ui.rsyntaxtextarea.modes.PlainTextTokenMaker.yylex(PlainTextTokenMaker.java:625)
        at org.fife.ui.rsyntaxtextarea.modes.PlainTextTokenMaker.getTokenList(PlainTextTokenMaker.java:338)
        at org.fife.ui.rsyntaxtextarea.RSyntaxDocument.getTokenListForLine(RSyntaxDocument.java:431)
        at org.fife.ui.rsyntaxtextarea.WrappedSyntaxView$WrappedLine.calculateLineCount(WrappedSyntaxView.java:1179)
        at org.fife.ui.rsyntaxtextarea.WrappedSyntaxView$WrappedLine.handleDocumentEvent(WrappedSyntaxView.java:1440)
        at org.fife.ui.rsyntaxtextarea.WrappedSyntaxView$WrappedLine.insertUpdate(WrappedSyntaxView.java:1464)
        at org.fife.ui.rsyntaxtextarea.WrappedSyntaxView.insertUpdate(WrappedSyntaxView.java:705)
        at javax.swing.plaf.basic.BasicTextUI$RootView.insertUpdate(BasicTextUI.java:1610)
        at javax.swing.plaf.basic.BasicTextUI$UpdateHandler.insertUpdate(BasicTextUI.java:1869)
        at javax.swing.text.AbstractDocument.fireInsertUpdate(AbstractDocument.java:201)
        at org.fife.ui.rsyntaxtextarea.RSyntaxDocument.fireInsertUpdate(RSyntaxDocument.java:187)
        at javax.swing.text.AbstractDocument.handleInsertString(AbstractDocument.java:748)
        at javax.swing.text.AbstractDocument.insertString(AbstractDocument.java:707)
        at javax.swing.text.PlainDocument.insertString(PlainDocument.java:130)
        at javax.swing.text.AbstractDocument.replace(AbstractDocument.java:669)
        at javax.swing.text.JTextComponent.setText(JTextComponent.java:1669)
        at org.apache.jmeter.gui.util.JSyntaxTextArea.setInitialText(JSyntaxTextArea.java:292)
        at org.apache.jmeter.testbeans.gui.TextAreaEditor.setValue(TextAreaEditor.java:112)
        at org.apache.jmeter.testbeans.gui.GenericTestBeanCustomizer.setEditorValue(GenericTestBeanCustomizer.java:478)
        at org.apache.jmeter.testbeans.gui.GenericTestBeanCustomizer.<init>(GenericTestBeanCustomizer.java:290)
        at org.apache.jmeter.testbeans.gui.TestBeanGUI.init(TestBeanGUI.java:426)
        at org.apache.jmeter.testbeans.gui.TestBeanGUI.configure(TestBeanGUI.java:302)
        at org.apache.jmeter.junit.JMeterTest.GUIComponents2(JMeterTest.java:395)

FAILURE   1.5sec,  752 completed,   1 failed,   0 skipped, org.apache.jmeter.junit.JMeterTest
          0.1sec,  140 completed,   0 failed,   0 skipped, org.apache.jmeter.testelement.TestElementTest
          1.6sec,  408 completed,   0 failed,   0 skipped, org.apache.jmeter.testbeans.gui.PackageTest
          0.0sec,  100 completed,   0 failed,   0 skipped, org.apache.jmeter.functions.ComponentReferenceFunctionTest
          0.2sec,    2 completed,   0 failed,   0 skipped, org.apache.jmeter.gui.util.MenuFactorySpec
          2.8sec, org.apache.jmeter.gui.action.HtmlReportGeneratorSpec
> check that report generation succeeds and statistic are generated
          4.5sec,    7 completed,   0 failed,   0 skipped, org.apache.jmeter.gui.action.HtmlReportGeneratorSpec
          0.3sec,   22 completed,   0 failed,   0 skipped, org.apache.jmeter.engine.util.PackageSpec
          0.6sec,    2 completed,   0 failed,   0 skipped, org.apache.jmeter.report.dashboard.ReportGeneratorSpec
FAILURE  41.7sec, 1549 completed,   1 failed,   0 skipped, Gradle
Test Run :src:dist-check:test

1549 tests completed, 1 failed

> Task :src:dist-check:test FAILED
checksum-dependency elapsed time: 13019ms, configurations processed: 371 (add -PchecksumTimingsPrint
to print detailed timings)

FAILURE: Build failed with an exception.

* What went wrong:
Execution failed for task ':src:dist-check:test'.
> There were failing tests. See the report at: file://<https://ci-builds.apache.org/job/JMeter/job/JMeter-trunk/ws/src/dist-check/build/reports/tests/test/index.html>

* Try:
Run with --stacktrace option to get the stack trace. Run with --info or --debug option to
get more log output. Run with --scan to get full insights.

* Get more help at https://help.gradle.org

Deprecated Gradle features were used in this build, making it incompatible with Gradle 7.0.
Use '--warning-mode all' to show the individual deprecation warnings.
See https://docs.gradle.org/6.7/userguide/command_line_interface.html#sec:command_line_warnings

BUILD FAILED in 5m 49s
358 actionable tasks: 190 executed, 168 up-to-date

See the profiling report at: file://<https://ci-builds.apache.org/job/JMeter/job/JMeter-trunk/ws/build/reports/profile/profile-2020-10-18-13-39-40.html>
A fine-grained performance profile is available: use the --scan option.
Build step 'Invoke Gradle script' changed build result to FAILURE
Build step 'Invoke Gradle script' marked build as failure
Xvfb stopping
Archiving artifacts
[Fast Archiver] Compressed 171.15 MB of artifacts by 50.7% relative to #112
Recording test results

Mime
View raw message