jmeter-dev mailing list archives

Site index · List index
Message view « Date » · « Thread »
Top « Date » · « Thread »
From Apache Jenkins Server <jenk...@builds.apache.org>
Subject Build failed in Jenkins: JMeter » JMeter Ubuntu #56
Date Thu, 01 Oct 2020 07:12:06 GMT
See <https://ci-builds.apache.org/job/JMeter/job/JMeter%20Ubuntu/56/display/redirect?page=changes>

Changes:

[github] Removed the property from docs (#578)


------------------------------------------
[...truncated 194.10 KB...]
Starting standalone test @ Thu Oct 01 07:10:59 UTC 2020 (1601536259648)
Waiting for possible Shutdown/StopTestNow/HeapDump/ThreadDump message on port 4445
summary +      1 in 00:00:00 =    9.0/s Avg:     6 Min:     6 Max:     6 Err:     0 (0.00%)
Active: 1 Started: 1 Finished: 0
summary +      8 in 00:00:00 =  285.7/s Avg:     0 Min:     0 Max:     1 Err:     0 (0.00%)
Active: 0 Started: 1 Finished: 1
summary =      9 in 00:00:00 =   64.7/s Avg:     0 Min:     0 Max:     6 Err:     0 (0.00%)
Tidying up ...    @ Thu Oct 01 07:11:00 UTC 2020 (1601536260367)
... end of run
No errors present in the logfile <https://ci-builds.apache.org/job/JMeter/job/JMeter%20Ubuntu/ws/bin/Bug56243.log>
(the file is empty)

> Task :src:components:test
WARNING   0.1sec,    9 completed,   0 failed,   1 skipped, org.apache.jmeter.extractor.json.render.RenderAsJmesPathRendererSpec
          0.0sec,    4 completed,   0 failed,   0 skipped, org.apache.jmeter.extractor.JoddExtractorSpec
          0.0sec,    7 completed,   0 failed,   0 skipped, org.apache.jmeter.assertions.MD5HexAssertionSpec
          0.1sec,    7 completed,   0 failed,   0 skipped, org.apache.jmeter.assertions.CompareAssertionSpec
          0.4sec,    5 completed,   0 failed,   0 skipped, org.apache.jmeter.assertions.gui.AssertionGuiSpec
WARNING  24.2sec,  499 completed,   0 failed,   4 skipped, Gradle
Test Run :src:components:test

> Task :src:components:check
> Task :src:components:testJar UP-TO-DATE
> Task :src:protocol:http:compileTestJava UP-TO-DATE

> Task :src:dist-check:batchBug56811
Creating summariser <summary>
Created the tree successfully using <https://ci-builds.apache.org/job/JMeter/job/JMeter%20Ubuntu/ws/bin/testfiles/Bug56811.jmx>
Starting standalone test @ Thu Oct 01 07:11:02 UTC 2020 (1601536262719)
Waiting for possible Shutdown/StopTestNow/HeapDump/ThreadDump message on port 4445

> Task :src:protocol:http:compileTestGroovy
> Task :src:protocol:http:testClasses
> Task :src:protocol:http:testJar UP-TO-DATE
> Task :src:protocol:http:spotbugsTest SKIPPED

> Task :src:dist-check:batchBug56811
summary +      1 in 00:00:01 =    1.8/s Avg:     5 Min:     5 Max:     5 Err:     0 (0.00%)
Active: 1 Started: 4 Finished: 3
summary +      8 in 00:00:00 =  170.2/s Avg:     4 Min:     0 Max:     7 Err:     3 (37.50%)
Active: 0 Started: 4 Finished: 4
summary =      9 in 00:00:01 =   14.7/s Avg:     4 Min:     0 Max:     7 Err:     3 (33.33%)
Tidying up ...    @ Thu Oct 01 07:11:03 UTC 2020 (1601536263941)
... end of run
No errors present in the logfile <https://ci-builds.apache.org/job/JMeter/job/JMeter%20Ubuntu/ws/bin/Bug56811.log>
(the file is empty)

> Task :src:dist-check:compileTestJava UP-TO-DATE
> Task :src:dist-check:compileTestGroovy
> Task :src:dist-check:testClasses
> Task :src:dist-check:spotbugsTest SKIPPED

> Task :src:dist-check:batchBug62239
Creating summariser <summary>
Created the tree successfully using <https://ci-builds.apache.org/job/JMeter/job/JMeter%20Ubuntu/ws/bin/testfiles/Bug62239.jmx>
Starting standalone test @ Thu Oct 01 07:11:10 UTC 2020 (1601536270511)
Waiting for possible Shutdown/StopTestNow/HeapDump/ThreadDump message on port 4445
summary =    108 in 00:00:00 =  295.1/s Avg:     0 Min:     0 Max:     1 Err:     0 (0.00%)
Tidying up ...    @ Thu Oct 01 07:11:11 UTC 2020 (1601536271058)
... end of run
No errors present in the logfile <https://ci-builds.apache.org/job/JMeter/job/JMeter%20Ubuntu/ws/bin/Bug62239.log>
(the file is empty)

> Task :src:protocol:http:test

Gradle Test Executor 20 STANDARD_OUT
    Setting JMeterHome: <https://ci-builds.apache.org/job/JMeter/job/JMeter%20Ubuntu/ws/src/protocol/http/../../../.>
    Initializing Properties: ../../.././bin/jmeter.properties
    JMeterVersion=5.3.1-SNAPSHOT b17ac36
    java.version=1.8.0_252
    java.vm.name=OpenJDK 64-Bit Server VM
    java.vendor=Oracle Corporation
    java.home=/usr/local/asfpackages/java/openjdk-8u252-b09/jre
    file.encoding=ISO-8859-1
    default encoding=ISO-8859-1
    user.home=/home/jenkins
    user.dir=<https://ci-builds.apache.org/job/JMeter/job/JMeter%20Ubuntu/ws/src/protocol/http>
    user.language=en
    user.region=null
    user.country=US
    user.variant=
    Locale=en_US
    java.class.version=52.0
    java.awt.headless=true
    os.name=Linux
    os.version=4.15.0-112-generic
    os.arch=amd64
          0.3sec,    1 completed,   0 failed,   0 skipped, org.apache.jmeter.resources.ResourceKeyUsageTestHttp
          0.6sec,   57 completed,   0 failed,   0 skipped, org.apache.jmeter.curl.BasicCurlParserTest
          0.0sec,    2 completed,   0 failed,   0 skipped, org.apache.jmeter.protocol.http.config.UrlConfigTest
          0.0sec,    3 completed,   0 failed,   0 skipped, org.apache.jmeter.protocol.http.config.MultipartUrlConfigTest
          0.0sec,    2 completed,   0 failed,   0 skipped, org.apache.jmeter.protocol.http.sampler.TestHttpWebdav
          0.0sec,   18 completed,   0 failed,   0 skipped, org.apache.jmeter.protocol.http.sampler.TestHTTPSamplers
FAILURE   1.2sec, org.apache.jmeter.protocol.http.control.TestCacheManagerHC4
> testCacheHttpClientBug51932()
    org.opentest4j.AssertionFailedError: Should not find valid entry. Found: CacheEntry [lastModified=Thu,
01 Oct 2020 07:11:12 GMT, etag=0xCAFEBABEDEADBEEF, expires=Thu Oct 01 07:11:14 UTC 2020, varyHeader=null]
at 1601536274007 ==> expected: <false> but was: <true>
        at org.junit.jupiter.api.AssertionUtils.fail(AssertionUtils.java:55)
        at org.junit.jupiter.api.AssertFalse.assertFalse(AssertFalse.java:40)
        at org.junit.jupiter.api.Assertions.assertFalse(Assertions.java:218)
        at org.apache.jmeter.protocol.http.control.TestCacheManagerBase.assertInvalidEntry(TestCacheManagerBase.java:341)
        at org.apache.jmeter.protocol.http.control.TestCacheManagerBase.testCacheHttpClientBug51932(TestCacheManagerBase.java:335)
        at org.junit.platform.commons.util.ReflectionUtils.invokeMethod(ReflectionUtils.java:688)
        at org.junit.jupiter.engine.execution.MethodInvocation.proceed(MethodInvocation.java:60)
        at org.junit.jupiter.engine.execution.InvocationInterceptorChain$ValidatingInvocation.proceed(InvocationInterceptorChain.java:131)
        at org.junit.jupiter.engine.extension.TimeoutInvocation.proceed(TimeoutInvocation.java:46)
        at org.junit.jupiter.engine.extension.TimeoutExtension.intercept(TimeoutExtension.java:149)
        at org.junit.jupiter.engine.extension.TimeoutExtension.interceptTestableMethod(TimeoutExtension.java:140)
        at org.junit.jupiter.engine.extension.TimeoutExtension.interceptTestMethod(TimeoutExtension.java:84)
        at org.junit.jupiter.engine.execution.ExecutableInvoker$ReflectiveInterceptorCall.lambda$ofVoidMethod$0(ExecutableInvoker.java:115)
        at org.junit.jupiter.engine.execution.ExecutableInvoker.lambda$invoke$0(ExecutableInvoker.java:105)
        at org.junit.jupiter.engine.execution.InvocationInterceptorChain$InterceptedInvocation.proceed(InvocationInterceptorChain.java:106)
        at org.junit.jupiter.engine.execution.InvocationInterceptorChain.proceed(InvocationInterceptorChain.java:64)
        at org.junit.jupiter.engine.execution.InvocationInterceptorChain.chainAndInvoke(InvocationInterceptorChain.java:45)
        at org.junit.jupiter.engine.execution.InvocationInterceptorChain.invoke(InvocationInterceptorChain.java:37)
        at org.junit.jupiter.engine.execution.ExecutableInvoker.invoke(ExecutableInvoker.java:104)
        at org.junit.jupiter.engine.execution.ExecutableInvoker.invoke(ExecutableInvoker.java:98)
        at org.junit.jupiter.engine.descriptor.TestMethodTestDescriptor.lambda$invokeTestMethod$6(TestMethodTestDescriptor.java:210)
        at org.junit.platform.engine.support.hierarchical.ThrowableCollector.execute(ThrowableCollector.java:73)
        at org.junit.jupiter.engine.descriptor.TestMethodTestDescriptor.invokeTestMethod(TestMethodTestDescriptor.java:206)
        at org.junit.jupiter.engine.descriptor.TestMethodTestDescriptor.execute(TestMethodTestDescriptor.java:131)
        at org.junit.jupiter.engine.descriptor.TestMethodTestDescriptor.execute(TestMethodTestDescriptor.java:65)
        at org.junit.platform.engine.support.hierarchical.NodeTestTask.lambda$executeRecursively$5(NodeTestTask.java:139)
        at org.junit.platform.engine.support.hierarchical.ThrowableCollector.execute(ThrowableCollector.java:73)
        at org.junit.platform.engine.support.hierarchical.NodeTestTask.lambda$executeRecursively$7(NodeTestTask.java:129)
        at org.junit.platform.engine.support.hierarchical.Node.around(Node.java:137)
        at org.junit.platform.engine.support.hierarchical.NodeTestTask.lambda$executeRecursively$8(NodeTestTask.java:127)
        at org.junit.platform.engine.support.hierarchical.ThrowableCollector.execute(ThrowableCollector.java:73)
        at org.junit.platform.engine.support.hierarchical.NodeTestTask.executeRecursively(NodeTestTask.java:126)
        at org.junit.platform.engine.support.hierarchical.NodeTestTask.execute(NodeTestTask.java:84)

          1.6sec,    2 completed,   0 failed,   0 skipped, org.apache.jmeter.protocol.http.sampler.TestHTTPHC4Impl
          1.1sec,    8 completed,   0 failed,   0 skipped, org.apache.jmeter.protocol.http.sampler.PostWriterTest
          2.1sec, org.apache.jmeter.protocol.http.proxy.TestHttpRequestHdr
> testPostRequestEncodings()
          2.2sec, org.apache.jmeter.protocol.http.control.TestCacheManagerUrlConnection
> testPrivateCache()
          2.2sec, org.apache.jmeter.protocol.http.control.TestCacheManagerUrlConnection
> testCacheHttpClientBug51932()
          2.2sec, org.apache.jmeter.protocol.http.control.TestCacheManagerHC4
> testExpires()
          2.0sec, org.apache.jmeter.protocol.http.proxy.TestHttpRequestHdr
> testEncodedArguments()
          2.2sec, org.apache.jmeter.protocol.http.proxy.TestHttpRequestHdr
> testPostMultipartFormData()
          2.0sec, org.apache.jmeter.protocol.http.proxy.TestHttpRequestHdr
> testEncodedArgumentsIPv6()
          2.4sec, org.apache.jmeter.protocol.http.proxy.TestHttpRequestHdr
> testRepeatedArguments()
          2.6sec,   10 completed,   0 failed,   0 skipped, org.apache.jmeter.protocol.http.proxy.TestHttpRequestHdr
          2.8sec, org.apache.jmeter.protocol.http.control.TestCacheManagerHC4
> testExpiresBug59962()
          2.8sec, org.apache.jmeter.protocol.http.control.TestCacheManagerUrlConnection
> testExpires()
          2.0sec, org.apache.jmeter.protocol.http.control.TestCacheManagerHC4
> testCacheControl()
          2.3sec, org.apache.jmeter.protocol.http.control.TestCacheManagerUrlConnection
> testExpiresBug59962()
          2.6sec, org.apache.jmeter.protocol.http.control.TestCacheManagerHC4
> testPrivateCacheExpireNoMaxAge()
          2.1sec, org.apache.jmeter.protocol.http.control.TestCacheManagerUrlConnection
> testCacheControl()
          3.0sec,   16 completed,   0 failed,   0 skipped, org.apache.jmeter.protocol.http.sampler.ParallelResourcesAndIpSource
          3.0sec, org.apache.jmeter.protocol.http.control.TestCacheManagerUrlConnection
> testPrivateCacheExpireNoMaxAge()
          0.4sec,    8 completed,   0 failed,   0 skipped, org.apache.jmeter.protocol.http.sampler.TestDecompression
          0.1sec,    1 completed,   0 failed,   0 skipped, org.apache.jmeter.protocol.http.sampler.PackageTest
          0.0sec,    2 completed,   0 failed,   0 skipped, org.apache.jmeter.protocol.http.sampler.PutWriterTest

> Task :src:dist-check:batchFTP_TESTS
Creating summariser <summary>
Created the tree successfully using <https://ci-builds.apache.org/job/JMeter/job/JMeter%20Ubuntu/ws/bin/testfiles/FTP_TESTS.jmx>
Starting standalone test @ Thu Oct 01 07:11:13 UTC 2020 (1601536273235)
Waiting for possible Shutdown/StopTestNow/HeapDump/ThreadDump message on port 4445
summary =      6 in 00:00:04 =    1.5/s Avg:   408 Min:    11 Max:  2125 Err:     0 (0.00%)
Tidying up ...    @ Thu Oct 01 07:11:18 UTC 2020 (1601536278147)
... end of run
No errors present in the logfile <https://ci-builds.apache.org/job/JMeter/job/JMeter%20Ubuntu/ws/bin/FTP_TESTS.log>
(the file is empty)

> Task :src:protocol:http:test
          0.5sec,    1 completed,   0 failed,   0 skipped, org.apache.jmeter.protocol.http.sampler.TestSerializedHTTPSampler
          0.0sec,    5 completed,   0 failed,   0 skipped, org.apache.jmeter.protocol.http.util.TestHTTPFileArgs
          0.0sec,    3 completed,   0 failed,   0 skipped, org.apache.jmeter.protocol.http.util.TestHTTPFileArg
          0.0sec,    4 completed,   0 failed,   0 skipped, org.apache.jmeter.protocol.http.util.accesslog.TestTCLogParser
          0.0sec,    6 completed,   0 failed,   0 skipped, org.apache.jmeter.protocol.http.util.accesslog.TestLogFilter
          0.0sec,    3 completed,   0 failed,   0 skipped, org.apache.jmeter.protocol.http.util.accesslog.TestSessionFilter
          0.0sec,    3 completed,   0 failed,   0 skipped, org.apache.jmeter.protocol.http.util.TestHTTPArgument
          4.6sec, org.apache.jmeter.protocol.http.control.TestCacheManagerHC4
> testNoCacheControlNoMaxAgeNoExpire()
          0.8sec,    4 completed,   0 failed,   0 skipped, org.apache.jmeter.protocol.http.parser.TestCssParser
          0.1sec,    6 completed,   0 failed,   0 skipped, org.apache.jmeter.protocol.http.parser.TestHtmlParsingUtils
          0.0sec,    2 completed,   0 failed,   0 skipped, org.apache.jmeter.protocol.http.parser.TestBaseParser
          0.0sec,    7 completed,   0 failed,   0 skipped, org.apache.jmeter.protocol.http.visualizers.RequestViewHTTPTest
          5.0sec, org.apache.jmeter.protocol.http.control.TestCacheManagerHC4
> testPrivateCacheNoMaxAgeNoExpire()
          5.1sec, org.apache.jmeter.protocol.http.control.TestCacheManagerUrlConnection
> testNoCacheControlNoMaxAgeNoExpire()
          5.1sec, org.apache.jmeter.protocol.http.control.TestCacheManagerUrlConnection
> testPrivateCacheNoMaxAgeNoExpire()
FAILURE   7.3sec,   25 completed,   1 failed,   0 skipped, org.apache.jmeter.protocol.http.control.TestCacheManagerHC4
          7.3sec,   24 completed,   0 failed,   0 skipped, org.apache.jmeter.protocol.http.control.TestCacheManagerUrlConnection

> Task :src:dist-check:batchHTMLParserTestFile_2
Creating summariser <summary>
Created the tree successfully using <https://ci-builds.apache.org/job/JMeter/job/JMeter%20Ubuntu/ws/bin/testfiles/HTMLParserTestFile_2.jmx>
Starting standalone test @ Thu Oct 01 07:11:20 UTC 2020 (1601536280364)
Waiting for possible Shutdown/StopTestNow/HeapDump/ThreadDump message on port 4445
summary =      1 in 00:00:01 =    0.8/s Avg:  1096 Min:  1096 Max:  1096 Err:     0 (0.00%)
Tidying up ...    @ Thu Oct 01 07:11:22 UTC 2020 (1601536282073)
... end of run
No errors present in the logfile <https://ci-builds.apache.org/job/JMeter/job/JMeter%20Ubuntu/ws/bin/HTMLParserTestFile_2.log>
(the file is empty)

> Task :src:dist-check:batchHttp4ImplDigestAuth SKIPPED

> Task :src:dist-check:batchHttp4ImplPreemptiveBasicAuth
Creating summariser <summary>
Created the tree successfully using <https://ci-builds.apache.org/job/JMeter/job/JMeter%20Ubuntu/ws/bin/testfiles/Http4ImplPreemptiveBasicAuth.jmx>
Starting standalone test @ Thu Oct 01 07:11:24 UTC 2020 (1601536284290)
Waiting for possible Shutdown/StopTestNow/HeapDump/ThreadDump message on port 4445
summary +      5 in 00:00:05 =    1.0/s Avg:   556 Min:   172 Max:  1032 Err:     0 (0.00%)
Active: 1 Started: 3 Finished: 2

> Task :src:protocol:http:test FAILED
          6.1sec, org.apache.jmeter.protocol.http.control.DnsManagerTest
> badDnsInCustomResolverShouldFailHttpSampler(String, WireMockServer)[1], [1]
HttpClient4
WARNING   6.1sec,    2 completed,   0 failed,   1 skipped, org.apache.jmeter.protocol.http.control.DnsManagerTest
          0.0sec,    1 completed,   0 failed,   0 skipped, org.apache.jmeter.protocol.http.control.TestAuthorization
          0.1sec,    5 completed,   0 failed,   0 skipped, org.apache.jmeter.protocol.http.control.TestCacheManagerThreadIteration
          0.0sec,    2 completed,   0 failed,   0 skipped, org.apache.jmeter.protocol.http.control.TestAuthManagerThreadIteration
          0.3sec,    6 completed,   0 failed,   0 skipped, org.apache.jmeter.protocol.http.control.TestAuthManager
          0.1sec,   33 completed,   0 failed,   0 skipped, org.apache.jmeter.protocol.http.control.TestHC4CookieManager
          0.0sec,    1 completed,   0 failed,   0 skipped, org.apache.jmeter.protocol.http.control.gui.TestHttpTestSampleGui
          0.1sec,    4 completed,   0 failed,   0 skipped, org.apache.jmeter.protocol.http.control.TestCookieManagerThreadIteration
          0.7sec,   18 completed,   0 failed,   0 skipped, org.apache.jmeter.protocol.http.modifier.TestAnchorModifier
          0.0sec,   17 completed,   0 failed,   0 skipped, org.apache.jmeter.protocol.http.modifier.TestURLRewritingModifier
          0.6sec,    7 completed,   0 failed,   0 skipped, org.apache.jmeter.protocol.http.proxy.TestProxyControl
          0.0sec,    2 completed,   0 failed,   0 skipped, org.apache.jmeter.testelement.TestHeaderManager
          0.1sec,   21 completed,   0 failed,   0 skipped, org.apache.jmeter.gui.action.ParseCurlCommandActionTest
WARNING   0.0sec,    2 completed,   0 failed,   2 skipped, org.apache.jmeter.protocol.http.sampler.SamplingNamingTest
          0.3sec,   53 completed,   0 failed,   0 skipped, org.apache.jmeter.protocol.http.sampler.TestHTTPSamplersAgainstHttpMirrorServer
          1.3sec,  103 completed,   0 failed,   0 skipped, org.apache.jmeter.protocol.http.parser.TestHTMLParser
          0.0sec,   46 completed,   0 failed,   0 skipped, org.apache.jmeter.protocol.http.parser.TestBug60842HtmlParser
          0.0sec,    7 completed,   0 failed,   0 skipped, org.apache.jmeter.protocol.http.visualizers.RequestViewHTTPTest
          0.9sec,    9 completed,   0 failed,   0 skipped, org.apache.jmeter.protocol.http.control.TestHTTPMirrorThread
          0.3sec,   58 completed,   0 failed,   0 skipped, org.apache.jmeter.protocol.http.util.HTTPUtilsSpec
FAILURE  27.1sec,  620 completed,   1 failed,   3 skipped,
Gradle Test Run :src:protocol:http:test

620 tests completed, 1 failed, 3 skipped

> Task :src:dist-check:batchHttp4ImplPreemptiveBasicAuth
summary +      7 in 00:00:04 =    1.6/s Avg:   398 Min:   170 Max:   721 Err:     0 (0.00%)
Active: 0 Started: 6 Finished: 6
summary =     12 in 00:00:10 =    1.3/s Avg:   464 Min:   170 Max:  1032 Err:     0 (0.00%)
Tidying up ...    @ Thu Oct 01 07:11:34 UTC 2020 (1601536294569)
... end of run
No errors present in the logfile <https://ci-builds.apache.org/job/JMeter/job/JMeter%20Ubuntu/ws/bin/Http4ImplPreemptiveBasicAuth.log>
(the file is empty)
checksum-dependency elapsed time: 163755ms, configurations processed: 270
    SHA-512 computation time: 7320ms (goes in parallel, it might exceed wall-clock time),
files processed: 26, processed: 8MiB, skipped: 3068MiB
    PGP signature resolution time: 37096ms (wall-clock), resolution requests: 161, signatures
resolved: 248
    PGP key resolution time: 86553ms (wall-clock), resolution requests: 161, download time:
0ms (goes in parallel, it might exceed wall-clock time), keys downloaded: 0
        PGP signature verification time: 181269ms (goes in parallel, it might exceed wall-clock
time), files processed: 497, processed: 509MiB, skipped: 2541MiB

FAILURE: Build failed with an exception.

* What went wrong:
Execution failed for task ':src:protocol:http:test'.
> There were failing tests. See the report at: file:///home/jenkins/workspace/JMeter/JMeter%20Ubuntu/src/protocol/http/build/reports/tests/test/index.html

* Try:
Run with --stacktrace option to get the stack trace. Run with --info or --debug option to
get more log output. Run with --scan to get full insights.

* Get more help at https://help.gradle.org

Deprecated Gradle features were used in this build, making it incompatible with Gradle 7.0.
Use '--warning-mode all' to show the individual deprecation warnings.
See https://docs.gradle.org/6.6/userguide/command_line_interface.html#sec:command_line_warnings

BUILD FAILED in 4m 27s
246 actionable tasks: 109 executed, 137 up-to-date
Build step 'Invoke Gradle script' changed build result to FAILURE
Build step 'Invoke Gradle script' marked build as failure

Mime
View raw message