jmeter-dev mailing list archives

Site index · List index
Message view « Date » · « Thread »
Top « Date » · « Thread »
From Apache Jenkins Server <jenk...@builds.apache.org>
Subject Build failed in Jenkins: JMeter » JMeter-trunk #146
Date Wed, 25 Nov 2020 16:56:49 GMT
See <https://ci-builds.apache.org/job/JMeter/job/JMeter-trunk/146/display/redirect?page=changes>

Changes:

[Felix Schumacher] Partly revert removal of LoggingManager and LogKit-adapter


------------------------------------------
[...truncated 30.33 KB...]
> Task :src:protocol:mongodb:processResources
> Task :src:protocol:mongodb:processTestResources NO-SOURCE
> Task :src:protocol:ftp:autostyleConfigsCheck NO-SOURCE
> Task :src:protocol:bolt:autostyleConfigsCheck
> Task :src:autostyleConfigsCheck
> Task :src:functions:autostyleConfigsCheck
> Task :src:examples:autostyleConfigsCheck
> Task :src:protocol:jdbc:processResources
> Task :src:protocol:java:autostyleConfigsCheck
> Task :src:protocol:jdbc:processTestResources NO-SOURCE
> Task :src:protocol:bolt:autostyleGroovyCheck
> Task :src:functions:autostyleGroovyCheck
> Task :src:protocol:http:processTestResources
> Task :src:dist-check:autostyleGroovyCheck
> Task :src:protocol:jdbc:autostyleConfigsCheck
> Task :src:protocol:jdbc:autostyleGroovyCheck
> Task :src:protocol:http:autostyleConfigsCheck
> Task :src:protocol:http:autostyleGroovyCheck
> Task :src:components:autostyleConfigsCheck
> Task :src:components:autostyleGroovyCheck
> Task :src:core:processResources
> Task :autostyleConfigsCheck
> Task :autostyleJavaCheck NO-SOURCE
> Task :src:core:processTestResources
> Task :src:core:autostyleConfigsCheck
> Task :src:core:autostyleGroovyCheck
> Task :src:testkit:compileJava
> Task :src:testkit:processResources NO-SOURCE
> Task :src:testkit:classes
> Task :src:testkit:jar
> Task :src:testkit:compileTestFixturesJava NO-SOURCE
> Task :src:testkit:processTestFixturesResources NO-SOURCE
> Task :src:testkit:testFixturesClasses UP-TO-DATE
> Task :src:testkit:testFixturesJar
> Task :src:testkit:autostyleConfigsCheck NO-SOURCE
> Task :src:launcher:compileJava
> Task :src:launcher:processResources
> Task :src:launcher:classes
> Task :src:launcher:jar
> Task :src:launcher:autostyleConfigsCheck NO-SOURCE

> Task :src:jorphan:compileJava
<https://ci-builds.apache.org/job/JMeter/job/JMeter-trunk/ws/src/jorphan/src/main/java/org/apache/jorphan/logging/Slf4jLogkitLogger.java>:20:
warning: [deprecation] Priority in org.apache.log has been deprecated
import org.apache.log.Priority;
                     ^
<https://ci-builds.apache.org/job/JMeter/job/JMeter-trunk/ws/src/jorphan/src/main/java/org/apache/jorphan/logging/LoggingManager.java>:22:
warning: [deprecation] LogTarget in org.apache.log has been deprecated
import org.apache.log.LogTarget;
                     ^
<https://ci-builds.apache.org/job/JMeter/job/JMeter-trunk/ws/src/jorphan/src/main/java/org/apache/jorphan/logging/LoggingManager.java>:23:
warning: [deprecation] Logger in org.apache.log has been deprecated
import org.apache.log.Logger;
                     ^
<https://ci-builds.apache.org/job/JMeter/job/JMeter-trunk/ws/src/jorphan/src/main/java/org/apache/jorphan/logging/LoggingManager.java>:24:
warning: [deprecation] Priority in org.apache.log has been deprecated
import org.apache.log.Priority;
                     ^

> Task :src:bshclient:autostyleJavaCheck
> Task :src:generator:autostyleJavaCheck
> Task :src:testkit:autostyleJavaCheck
> Task :src:examples:autostyleJavaCheck
> Task :src:launcher:autostyleJavaCheck
> Task :src:protocol:bolt:autostyleJavaCheck
> Task :src:protocol:bolt:autostyleKotlinGradleCheck NO-SOURCE
> Task :src:protocol:bolt:autostyleMarkdownCheck NO-SOURCE
> Task :src:protocol:bolt:autostyleCheck
> Task :src:protocol:ftp:autostyleJavaCheck
> Task :src:protocol:ftp:autostyleKotlinGradleCheck NO-SOURCE
> Task :src:protocol:ftp:autostyleMarkdownCheck NO-SOURCE
> Task :src:protocol:ftp:autostyleCheck
> Task :src:dist-check:autostyleJavaCheck
> Task :src:protocol:jdbc:autostyleJavaCheck
> Task :src:protocol:jdbc:autostyleKotlinGradleCheck NO-SOURCE
> Task :src:protocol:jdbc:autostyleMarkdownCheck NO-SOURCE
> Task :src:protocol:jdbc:autostyleCheck
> Task :src:protocol:java:autostyleJavaCheck
> Task :src:protocol:java:autostyleKotlinGradleCheck NO-SOURCE
> Task :src:protocol:java:autostyleMarkdownCheck NO-SOURCE
> Task :src:protocol:java:autostyleCheck
> Task :src:functions:autostyleJavaCheck
> Task :src:generator:autostyleKotlinGradleCheck
> Task :src:bshclient:autostyleKotlinGradleCheck
> Task :src:testkit:autostyleKotlinGradleCheck
> Task :src:examples:autostyleKotlinGradleCheck
> Task :src:bshclient:autostyleMarkdownCheck NO-SOURCE
> Task :src:bshclient:autostyleCheck
> Task :src:generator:autostyleMarkdownCheck NO-SOURCE
> Task :src:examples:autostyleMarkdownCheck NO-SOURCE
> Task :src:generator:autostyleCheck
> Task :src:examples:autostyleCheck
> Task :src:testkit:autostyleMarkdownCheck NO-SOURCE
> Task :src:testkit:autostyleCheck
> Task :src:functions:autostyleKotlinGradleCheck
> Task :src:functions:autostyleMarkdownCheck NO-SOURCE
> Task :src:functions:autostyleCheck
> Task :src:launcher:autostyleKotlinGradleCheck
> Task :src:launcher:autostyleMarkdownCheck NO-SOURCE
> Task :src:launcher:autostyleCheck
> Task :src:release:autostyleKotlinGradleCheck
> Task :src:release:autostyleMarkdownCheck NO-SOURCE
> Task :src:release:autostyleCheck
> Task :src:release:checkstyleMain NO-SOURCE
> Task :src:release:checkstyleTest NO-SOURCE
> Task :src:release:compileJava NO-SOURCE
> Task :src:release:processResources NO-SOURCE
> Task :src:release:classes UP-TO-DATE
> Task :src:release:spotbugsMain NO-SOURCE
> Task :src:release:compileTestJava NO-SOURCE
> Task :src:release:processTestResources NO-SOURCE
> Task :src:release:testClasses UP-TO-DATE
> Task :src:release:spotbugsTest NO-SOURCE
> Task :src:release:test NO-SOURCE
> Task :src:release:check
> Task :src:protocol:jms:autostyleConfigsCheck NO-SOURCE
> Task :src:config:autostyleKotlinGradleCheck
> Task :src:config:autostyleMarkdownCheck NO-SOURCE
> Task :src:config:autostyleCheck
> Task :src:config:checkstyleMain NO-SOURCE
> Task :src:config:checkstyleTest NO-SOURCE
> Task :src:config:compileJava NO-SOURCE
> Task :src:config:processResources NO-SOURCE
> Task :src:config:classes UP-TO-DATE
> Task :src:config:spotbugsMain NO-SOURCE
> Task :src:config:compileTestJava NO-SOURCE
> Task :src:config:processTestResources NO-SOURCE
> Task :src:config:testClasses UP-TO-DATE
> Task :src:config:spotbugsTest NO-SOURCE
> Task :src:config:test NO-SOURCE
> Task :src:config:check
> Task :src:protocol:junit:autostyleConfigsCheck NO-SOURCE
> Task :src:protocol:junit:autostyleJavaCheck
> Task :src:protocol:junit:autostyleKotlinGradleCheck NO-SOURCE
> Task :src:protocol:junit:autostyleMarkdownCheck NO-SOURCE
> Task :src:protocol:junit:autostyleCheck
> Task :src:protocol:autostyleKotlinGradleCheck
> Task :src:protocol:autostyleMarkdownCheck NO-SOURCE
> Task :src:protocol:autostyleCheck
> Task :src:protocol:checkstyleMain NO-SOURCE
> Task :src:protocol:checkstyleTest NO-SOURCE
> Task :src:protocol:compileJava NO-SOURCE
> Task :src:protocol:processResources NO-SOURCE
> Task :src:protocol:classes UP-TO-DATE
> Task :src:protocol:spotbugsMain NO-SOURCE
> Task :src:protocol:compileTestJava NO-SOURCE
> Task :src:protocol:processTestResources NO-SOURCE
> Task :src:protocol:testClasses UP-TO-DATE
> Task :src:protocol:spotbugsTest NO-SOURCE
> Task :src:bom:autostyleKotlinGradleCheck
> Task :src:bom:autostyleMarkdownCheck NO-SOURCE
> Task :src:protocol:test NO-SOURCE
> Task :src:bom:autostyleCheck
> Task :src:bom:check
> Task :src:protocol:check
> Task :src:protocol:junit-sample:autostyleConfigsCheck NO-SOURCE
> Task :src:protocol:ldap:autostyleConfigsCheck NO-SOURCE
> Task :src:dist-check:autostyleKotlinGradleCheck
> Task :src:dist-check:autostyleMarkdownCheck NO-SOURCE
> Task :src:dist-check:autostyleCheck
> Task :src:dist-check:checkstyleMain NO-SOURCE
> Task :src:autostyleKotlinGradleCheck
> Task :src:autostyleMarkdownCheck NO-SOURCE
> Task :src:autostyleCheck
> Task :src:check
> Task :src:protocol:mail:autostyleConfigsCheck NO-SOURCE
> Task :src:protocol:jms:autostyleJavaCheck
> Task :src:licenses:autostyleKotlinGradleCheck
> Task :src:protocol:jms:autostyleKotlinGradleCheck NO-SOURCE
> Task :src:licenses:autostyleMarkdownCheck NO-SOURCE
> Task :src:licenses:autostyleCheck
> Task :src:protocol:junit-sample:autostyleJavaCheck
> Task :src:protocol:jms:autostyleMarkdownCheck NO-SOURCE
> Task :src:licenses:checkstyleMain NO-SOURCE
> Task :src:protocol:jms:autostyleCheck
> Task :src:licenses:checkstyleTest NO-SOURCE
> Task :src:licenses:compileJava NO-SOURCE
> Task :src:protocol:junit-sample:autostyleKotlinGradleCheck NO-SOURCE
> Task :src:licenses:processResources NO-SOURCE
> Task :src:licenses:classes UP-TO-DATE
> Task :src:protocol:junit-sample:autostyleMarkdownCheck NO-SOURCE
> Task :src:licenses:spotbugsMain NO-SOURCE
> Task :src:protocol:junit-sample:autostyleCheck
> Task :src:licenses:compileTestJava NO-SOURCE
> Task :src:licenses:processTestResources NO-SOURCE
> Task :src:licenses:testClasses UP-TO-DATE
> Task :src:licenses:spotbugsTest NO-SOURCE
> Task :src:licenses:test NO-SOURCE
> Task :src:licenses:check
> Task :src:protocol:mongodb:autostyleConfigsCheck

> Task :src:jorphan:compileJava FAILED
error: warnings found and -Werror specified
Note: <https://ci-builds.apache.org/job/JMeter/job/JMeter-trunk/ws/src/jorphan/src/main/java/org/apache/jorphan/gui/DynamicStyle.java>
uses unchecked or unsafe operations.
Note: Recompile with -Xlint:unchecked for details.
1 error
4 warnings

> Task :src:protocol:mongodb:autostyleJavaCheck
> Task :src:protocol:ldap:autostyleJavaCheck
> Task :src:protocol:mail:autostyleJavaCheck
> Task :src:dist:autostyleKotlinGradleCheck
> Task :autostyleKotlinGradleCheck
> Task :src:protocol:http:autostyleJavaCheck
> Task :src:components:autostyleJavaCheck
> Task :src:core:autostyleJavaCheck
> Task :src:testkit-wiremock:compileJava
> Task :src:testkit:checkstyleMain
> Task :src:launcher:checkstyleMain
> Task :src:bshclient:checkstyleMain
> Task :src:protocol:bolt:checkstyleMain
> Task :src:protocol:ftp:checkstyleMain
> Task :src:protocol:junit:checkstyleMain
> Task :src:examples:checkstyleMain
> Task :src:dist-check:checkstyleTest
> Task :src:protocol:junit-sample:checkstyleMain
> Task :src:generator:checkstyleMain
> Task :src:protocol:jdbc:checkstyleMain
> Task :src:protocol:java:checkstyleMain
> Task :src:functions:checkstyleMain
> Task :src:protocol:jms:checkstyleMain
checksum-dependency elapsed time: 60847ms, configurations processed: 107
    SHA-512 computation time: 170ms (goes in parallel, it might exceed wall-clock time), files
processed: 26, processed: 9MiB, skipped: 1035MiB
    PGP signature resolution time: 14893ms (wall-clock), resolution requests: 64, signatures
resolved: 127
    PGP key resolution time: 30200ms (wall-clock), resolution requests: 64, download time:
17465ms (goes in parallel, it might exceed wall-clock time), keys downloaded: 55
        PGP signature verification time: 13485ms (goes in parallel, it might exceed wall-clock
time), files processed: 515, processed: 659MiB, skipped: 376MiB

FAILURE: Build failed with an exception.

* What went wrong:
Execution failed for task ':src:jorphan:compileJava'.
> Compilation failed; see the compiler error output for details.

* Try:
Run with --stacktrace option to get the stack trace. Run with --info or --debug option to
get more log output. Run with --scan to get full insights.

* Get more help at https://help.gradle.org

Deprecated Gradle features were used in this build, making it incompatible with Gradle 7.0.
Use '--warning-mode all' to show the individual deprecation warnings.
See https://docs.gradle.org/6.7/userguide/command_line_interface.html#sec:command_line_warnings

BUILD FAILED in 2m 28s
117 actionable tasks: 87 executed, 30 up-to-date

See the profiling report at: file://<https://ci-builds.apache.org/job/JMeter/job/JMeter-trunk/ws/build/reports/profile/profile-2020-11-25-16-54-25.html>
A fine-grained performance profile is available: use the --scan option.
Build step 'Invoke Gradle script' changed build result to FAILURE
Build step 'Invoke Gradle script' marked build as failure
Xvfb stopping
Archiving artifacts
Recording test results
ERROR: Step ?Publish JUnit test result report? failed: No test report files were found. Configuration
error?

Mime
View raw message