jmeter-dev mailing list archives

Site index · List index
Message view « Date » · « Thread »
Top « Date » · « Thread »
From Apache Jenkins Server <jenk...@builds.apache.org>
Subject Build failed in Jenkins: JMeter » JMeter-trunk #176
Date Fri, 18 Dec 2020 23:42:44 GMT
See <https://ci-builds.apache.org/job/JMeter/job/JMeter-trunk/176/display/redirect?page=changes>

Changes:

[Philippe Mouawad] Bug 65008 - SampleResult.setIgnore() called from PostProcessor is not


------------------------------------------
[...truncated 442.87 KB...]
2020-12-18 23:41:35,071 ERROR o.a.j.p.j.s.SubscriberSampler: Could not initialise client
javax.jms.JMSException: Wire format negotiation timeout: peer did not send his wire format.
	at org.apache.activemq.util.JMSExceptionSupport.create(JMSExceptionSupport.java:72) ~[activemq-client-5.16.0.jar:5.16.0]
	at org.apache.activemq.ActiveMQConnection.syncSendPacket(ActiveMQConnection.java:1421) ~[activemq-client-5.16.0.jar:5.16.0]
	at org.apache.activemq.ActiveMQConnection.ensureConnectionInfoSent(ActiveMQConnection.java:1486)
~[activemq-client-5.16.0.jar:5.16.0]
	at org.apache.activemq.ActiveMQConnection.setClientID(ActiveMQConnection.java:418) ~[activemq-client-5.16.0.jar:5.16.0]
	at org.apache.jmeter.protocol.jms.client.ReceiveSubscriber.<init>(ReceiveSubscriber.java:234)
~[ApacheJMeter_jms.jar:5.4.1-SNAPSHOT]
	at org.apache.jmeter.protocol.jms.client.ReceiveSubscriber.<init>(ReceiveSubscriber.java:114)
~[ApacheJMeter_jms.jar:5.4.1-SNAPSHOT]
	at org.apache.jmeter.protocol.jms.sampler.SubscriberSampler.initReceiveClient(SubscriberSampler.java:131)
~[ApacheJMeter_jms.jar:5.4.1-SNAPSHOT]
	at org.apache.jmeter.protocol.jms.sampler.SubscriberSampler.initClient(SubscriberSampler.java:345)
[ApacheJMeter_jms.jar:5.4.1-SNAPSHOT]
	at org.apache.jmeter.protocol.jms.sampler.SubscriberSampler.handleErrorAndAddTemporize(SubscriberSampler.java:238)
[ApacheJMeter_jms.jar:5.4.1-SNAPSHOT]
	at org.apache.jmeter.protocol.jms.sampler.SubscriberSampler.sample(SubscriberSampler.java:157)
[ApacheJMeter_jms.jar:5.4.1-SNAPSHOT]
	at org.apache.jmeter.protocol.jms.sampler.BaseJMSSampler.sample(BaseJMSSampler.java:98) [ApacheJMeter_jms.jar:5.4.1-SNAPSHOT]
	at org.apache.jmeter.threads.JMeterThread.doSampling(JMeterThread.java:638) [ApacheJMeter_core.jar:5.4.1-SNAPSHOT]
	at org.apache.jmeter.threads.JMeterThread.executeSamplePackage(JMeterThread.java:558) [ApacheJMeter_core.jar:5.4.1-SNAPSHOT]
	at org.apache.jmeter.threads.JMeterThread.processSampler(JMeterThread.java:489) [ApacheJMeter_core.jar:5.4.1-SNAPSHOT]
	at org.apache.jmeter.threads.JMeterThread.run(JMeterThread.java:256) [ApacheJMeter_core.jar:5.4.1-SNAPSHOT]
	at java.lang.Thread.run(Thread.java:748) [?:1.8.0_252]
Caused by: java.io.IOException: Wire format negotiation timeout: peer did not send his wire
format.
	at org.apache.activemq.transport.WireFormatNegotiator.oneway(WireFormatNegotiator.java:99)
~[activemq-client-5.16.0.jar:5.16.0]
	at org.apache.activemq.transport.MutexTransport.oneway(MutexTransport.java:68) ~[activemq-client-5.16.0.jar:5.16.0]
	at org.apache.activemq.transport.ResponseCorrelator.asyncRequest(ResponseCorrelator.java:81)
~[activemq-client-5.16.0.jar:5.16.0]
	at org.apache.activemq.transport.ResponseCorrelator.request(ResponseCorrelator.java:86) ~[activemq-client-5.16.0.jar:5.16.0]
	at org.apache.activemq.ActiveMQConnection.syncSendPacket(ActiveMQConnection.java:1392) ~[activemq-client-5.16.0.jar:5.16.0]
	... 14 more
2020-12-18 23:41:45,589 ERROR o.a.j.p.j.s.SubscriberSampler: Could not initialise client
javax.jms.JMSException: Wire format negotiation timeout: peer did not send his wire format.
	at org.apache.activemq.util.JMSExceptionSupport.create(JMSExceptionSupport.java:72) ~[activemq-client-5.16.0.jar:5.16.0]
	at org.apache.activemq.ActiveMQConnection.syncSendPacket(ActiveMQConnection.java:1421) ~[activemq-client-5.16.0.jar:5.16.0]
	at org.apache.activemq.ActiveMQConnection.ensureConnectionInfoSent(ActiveMQConnection.java:1486)
~[activemq-client-5.16.0.jar:5.16.0]
	at org.apache.activemq.ActiveMQConnection.createSession(ActiveMQConnection.java:329) ~[activemq-client-5.16.0.jar:5.16.0]
	at org.apache.jmeter.protocol.jms.client.ReceiveSubscriber.<init>(ReceiveSubscriber.java:236)
~[ApacheJMeter_jms.jar:5.4.1-SNAPSHOT]
	at org.apache.jmeter.protocol.jms.client.ReceiveSubscriber.<init>(ReceiveSubscriber.java:114)
~[ApacheJMeter_jms.jar:5.4.1-SNAPSHOT]
	at org.apache.jmeter.protocol.jms.sampler.SubscriberSampler.initReceiveClient(SubscriberSampler.java:131)
~[ApacheJMeter_jms.jar:5.4.1-SNAPSHOT]
	at org.apache.jmeter.protocol.jms.sampler.SubscriberSampler.initClient(SubscriberSampler.java:345)
[ApacheJMeter_jms.jar:5.4.1-SNAPSHOT]
	at org.apache.jmeter.protocol.jms.sampler.SubscriberSampler.threadStarted(SubscriberSampler.java:337)
[ApacheJMeter_jms.jar:5.4.1-SNAPSHOT]
	at org.apache.jmeter.threads.JMeterThread$ThreadListenerTraverser.addNode(JMeterThread.java:784)
[ApacheJMeter_core.jar:5.4.1-SNAPSHOT]
	at org.apache.jorphan.collections.HashTree.traverseInto(HashTree.java:993) [jorphan.jar:5.4.1-SNAPSHOT]
	at org.apache.jorphan.collections.HashTree.traverse(HashTree.java:976) [jorphan.jar:5.4.1-SNAPSHOT]
	at org.apache.jmeter.threads.JMeterThread.threadStarted(JMeterThread.java:752) [ApacheJMeter_core.jar:5.4.1-SNAPSHOT]
	at org.apache.jmeter.threads.JMeterThread.initRun(JMeterThread.java:740) [ApacheJMeter_core.jar:5.4.1-SNAPSHOT]
	at org.apache.jmeter.threads.JMeterThread.run(JMeterThread.java:252) [ApacheJMeter_core.jar:5.4.1-SNAPSHOT]
	at java.lang.Thread.run(Thread.java:748) [?:1.8.0_252]
Caused by: java.io.IOException: Wire format negotiation timeout: peer did not send his wire
format.
	at org.apache.activemq.transport.WireFormatNegotiator.oneway(WireFormatNegotiator.java:99)
~[activemq-client-5.16.0.jar:5.16.0]
	at org.apache.activemq.transport.MutexTransport.oneway(MutexTransport.java:68) ~[activemq-client-5.16.0.jar:5.16.0]
	at org.apache.activemq.transport.ResponseCorrelator.asyncRequest(ResponseCorrelator.java:81)
~[activemq-client-5.16.0.jar:5.16.0]
	at org.apache.activemq.transport.ResponseCorrelator.request(ResponseCorrelator.java:86) ~[activemq-client-5.16.0.jar:5.16.0]
	at org.apache.activemq.ActiveMQConnection.syncSendPacket(ActiveMQConnection.java:1392) ~[activemq-client-5.16.0.jar:5.16.0]
	... 14 more
2020-12-18 23:42:05,604 ERROR o.a.j.p.j.s.SubscriberSampler: Could not initialise client
javax.jms.JMSException: Wire format negotiation timeout: peer did not send his wire format.
	at org.apache.activemq.util.JMSExceptionSupport.create(JMSExceptionSupport.java:72) ~[activemq-client-5.16.0.jar:5.16.0]
	at org.apache.activemq.ActiveMQConnection.syncSendPacket(ActiveMQConnection.java:1421) ~[activemq-client-5.16.0.jar:5.16.0]
	at org.apache.activemq.ActiveMQConnection.ensureConnectionInfoSent(ActiveMQConnection.java:1486)
~[activemq-client-5.16.0.jar:5.16.0]
	at org.apache.activemq.ActiveMQConnection.createSession(ActiveMQConnection.java:329) ~[activemq-client-5.16.0.jar:5.16.0]
	at org.apache.jmeter.protocol.jms.client.ReceiveSubscriber.<init>(ReceiveSubscriber.java:236)
~[ApacheJMeter_jms.jar:5.4.1-SNAPSHOT]
	at org.apache.jmeter.protocol.jms.client.ReceiveSubscriber.<init>(ReceiveSubscriber.java:114)
~[ApacheJMeter_jms.jar:5.4.1-SNAPSHOT]
	at org.apache.jmeter.protocol.jms.sampler.SubscriberSampler.initReceiveClient(SubscriberSampler.java:131)
~[ApacheJMeter_jms.jar:5.4.1-SNAPSHOT]
	at org.apache.jmeter.protocol.jms.sampler.SubscriberSampler.initClient(SubscriberSampler.java:345)
[ApacheJMeter_jms.jar:5.4.1-SNAPSHOT]
	at org.apache.jmeter.protocol.jms.sampler.SubscriberSampler.threadStarted(SubscriberSampler.java:337)
[ApacheJMeter_jms.jar:5.4.1-SNAPSHOT]
	at org.apache.jmeter.protocol.jms.sampler.SubscriberSampler.threadStarted(SubscriberSampler.java:366)
[ApacheJMeter_jms.jar:5.4.1-SNAPSHOT]
	at org.apache.jmeter.protocol.jms.sampler.SubscriberSampler.sample(SubscriberSampler.java:146)
[ApacheJMeter_jms.jar:5.4.1-SNAPSHOT]
	at org.apache.jmeter.protocol.jms.sampler.BaseJMSSampler.sample(BaseJMSSampler.java:98) [ApacheJMeter_jms.jar:5.4.1-SNAPSHOT]
	at org.apache.jmeter.threads.JMeterThread.doSampling(JMeterThread.java:638) [ApacheJMeter_core.jar:5.4.1-SNAPSHOT]
	at org.apache.jmeter.threads.JMeterThread.executeSamplePackage(JMeterThread.java:558) [ApacheJMeter_core.jar:5.4.1-SNAPSHOT]
	at org.apache.jmeter.threads.JMeterThread.processSampler(JMeterThread.java:489) [ApacheJMeter_core.jar:5.4.1-SNAPSHOT]
	at org.apache.jmeter.threads.JMeterThread.run(JMeterThread.java:256) [ApacheJMeter_core.jar:5.4.1-SNAPSHOT]
	at java.lang.Thread.run(Thread.java:748) [?:1.8.0_252]
Caused by: java.io.IOException: Wire format negotiation timeout: peer did not send his wire
format.
	at org.apache.activemq.transport.WireFormatNegotiator.oneway(WireFormatNegotiator.java:99)
~[activemq-client-5.16.0.jar:5.16.0]
	at org.apache.activemq.transport.MutexTransport.oneway(MutexTransport.java:68) ~[activemq-client-5.16.0.jar:5.16.0]
	at org.apache.activemq.transport.ResponseCorrelator.asyncRequest(ResponseCorrelator.java:81)
~[activemq-client-5.16.0.jar:5.16.0]
	at org.apache.activemq.transport.ResponseCorrelator.request(ResponseCorrelator.java:86) ~[activemq-client-5.16.0.jar:5.16.0]
	at org.apache.activemq.ActiveMQConnection.syncSendPacket(ActiveMQConnection.java:1392) ~[activemq-client-5.16.0.jar:5.16.0]
	... 15 more
2020-12-18 23:42:15,610 ERROR o.a.j.p.j.s.SubscriberSampler: Could not initialise client
javax.jms.JMSException: Wire format negotiation timeout: peer did not send his wire format.
	at org.apache.activemq.util.JMSExceptionSupport.create(JMSExceptionSupport.java:72) ~[activemq-client-5.16.0.jar:5.16.0]
	at org.apache.activemq.ActiveMQConnection.syncSendPacket(ActiveMQConnection.java:1421) ~[activemq-client-5.16.0.jar:5.16.0]
	at org.apache.activemq.ActiveMQConnection.ensureConnectionInfoSent(ActiveMQConnection.java:1486)
~[activemq-client-5.16.0.jar:5.16.0]
	at org.apache.activemq.ActiveMQConnection.createSession(ActiveMQConnection.java:329) ~[activemq-client-5.16.0.jar:5.16.0]
	at org.apache.jmeter.protocol.jms.client.ReceiveSubscriber.<init>(ReceiveSubscriber.java:236)
~[ApacheJMeter_jms.jar:5.4.1-SNAPSHOT]
	at org.apache.jmeter.protocol.jms.client.ReceiveSubscriber.<init>(ReceiveSubscriber.java:114)
~[ApacheJMeter_jms.jar:5.4.1-SNAPSHOT]
	at org.apache.jmeter.protocol.jms.sampler.SubscriberSampler.initReceiveClient(SubscriberSampler.java:131)
~[ApacheJMeter_jms.jar:5.4.1-SNAPSHOT]
	at org.apache.jmeter.protocol.jms.sampler.SubscriberSampler.initClient(SubscriberSampler.java:345)
[ApacheJMeter_jms.jar:5.4.1-SNAPSHOT]
	at org.apache.jmeter.protocol.jms.sampler.SubscriberSampler.handleErrorAndAddTemporize(SubscriberSampler.java:238)
[ApacheJMeter_jms.jar:5.4.1-SNAPSHOT]
	at org.apache.jmeter.protocol.jms.sampler.SubscriberSampler.sample(SubscriberSampler.java:157)
[ApacheJMeter_jms.jar:5.4.1-SNAPSHOT]
	at org.apache.jmeter.protocol.jms.sampler.BaseJMSSampler.sample(BaseJMSSampler.java:98) [ApacheJMeter_jms.jar:5.4.1-SNAPSHOT]
	at org.apache.jmeter.threads.JMeterThread.doSampling(JMeterThread.java:638) [ApacheJMeter_core.jar:5.4.1-SNAPSHOT]
	at org.apache.jmeter.threads.JMeterThread.executeSamplePackage(JMeterThread.java:558) [ApacheJMeter_core.jar:5.4.1-SNAPSHOT]
	at org.apache.jmeter.threads.JMeterThread.processSampler(JMeterThread.java:489) [ApacheJMeter_core.jar:5.4.1-SNAPSHOT]
	at org.apache.jmeter.threads.JMeterThread.run(JMeterThread.java:256) [ApacheJMeter_core.jar:5.4.1-SNAPSHOT]
	at java.lang.Thread.run(Thread.java:748) [?:1.8.0_252]
Caused by: java.io.IOException: Wire format negotiation timeout: peer did not send his wire
format.
	at org.apache.activemq.transport.WireFormatNegotiator.oneway(WireFormatNegotiator.java:99)
~[activemq-client-5.16.0.jar:5.16.0]
	at org.apache.activemq.transport.MutexTransport.oneway(MutexTransport.java:68) ~[activemq-client-5.16.0.jar:5.16.0]
	at org.apache.activemq.transport.ResponseCorrelator.asyncRequest(ResponseCorrelator.java:81)
~[activemq-client-5.16.0.jar:5.16.0]
	at org.apache.activemq.transport.ResponseCorrelator.request(ResponseCorrelator.java:86) ~[activemq-client-5.16.0.jar:5.16.0]
	at org.apache.activemq.ActiveMQConnection.syncSendPacket(ActiveMQConnection.java:1392) ~[activemq-client-5.16.0.jar:5.16.0]
	... 14 more
2020-12-18 23:42:26,117 ERROR o.a.j.p.j.s.SubscriberSampler: Could not initialise client
javax.jms.JMSException: Wire format negotiation timeout: peer did not send his wire format.
	at org.apache.activemq.util.JMSExceptionSupport.create(JMSExceptionSupport.java:72) ~[activemq-client-5.16.0.jar:5.16.0]
	at org.apache.activemq.ActiveMQConnection.syncSendPacket(ActiveMQConnection.java:1421) ~[activemq-client-5.16.0.jar:5.16.0]
	at org.apache.activemq.ActiveMQConnection.ensureConnectionInfoSent(ActiveMQConnection.java:1486)
~[activemq-client-5.16.0.jar:5.16.0]
	at org.apache.activemq.ActiveMQConnection.createSession(ActiveMQConnection.java:329) ~[activemq-client-5.16.0.jar:5.16.0]
	at org.apache.jmeter.protocol.jms.client.ReceiveSubscriber.<init>(ReceiveSubscriber.java:236)
~[ApacheJMeter_jms.jar:5.4.1-SNAPSHOT]
	at org.apache.jmeter.protocol.jms.client.ReceiveSubscriber.<init>(ReceiveSubscriber.java:114)
~[ApacheJMeter_jms.jar:5.4.1-SNAPSHOT]
	at org.apache.jmeter.protocol.jms.sampler.SubscriberSampler.initReceiveClient(SubscriberSampler.java:131)
~[ApacheJMeter_jms.jar:5.4.1-SNAPSHOT]
	at org.apache.jmeter.protocol.jms.sampler.SubscriberSampler.initClient(SubscriberSampler.java:345)
[ApacheJMeter_jms.jar:5.4.1-SNAPSHOT]
	at org.apache.jmeter.protocol.jms.sampler.SubscriberSampler.handleErrorAndAddTemporize(SubscriberSampler.java:238)
[ApacheJMeter_jms.jar:5.4.1-SNAPSHOT]
	at org.apache.jmeter.protocol.jms.sampler.SubscriberSampler.sample(SubscriberSampler.java:157)
[ApacheJMeter_jms.jar:5.4.1-SNAPSHOT]
	at org.apache.jmeter.protocol.jms.sampler.BaseJMSSampler.sample(BaseJMSSampler.java:98) [ApacheJMeter_jms.jar:5.4.1-SNAPSHOT]
	at org.apache.jmeter.threads.JMeterThread.doSampling(JMeterThread.java:638) [ApacheJMeter_core.jar:5.4.1-SNAPSHOT]
	at org.apache.jmeter.threads.JMeterThread.executeSamplePackage(JMeterThread.java:558) [ApacheJMeter_core.jar:5.4.1-SNAPSHOT]
	at org.apache.jmeter.threads.JMeterThread.processSampler(JMeterThread.java:489) [ApacheJMeter_core.jar:5.4.1-SNAPSHOT]
	at org.apache.jmeter.threads.JMeterThread.run(JMeterThread.java:256) [ApacheJMeter_core.jar:5.4.1-SNAPSHOT]
	at java.lang.Thread.run(Thread.java:748) [?:1.8.0_252]
Caused by: java.io.IOException: Wire format negotiation timeout: peer did not send his wire
format.
	at org.apache.activemq.transport.WireFormatNegotiator.oneway(WireFormatNegotiator.java:99)
~[activemq-client-5.16.0.jar:5.16.0]
	at org.apache.activemq.transport.MutexTransport.oneway(MutexTransport.java:68) ~[activemq-client-5.16.0.jar:5.16.0]
	at org.apache.activemq.transport.ResponseCorrelator.asyncRequest(ResponseCorrelator.java:81)
~[activemq-client-5.16.0.jar:5.16.0]
	at org.apache.activemq.transport.ResponseCorrelator.request(ResponseCorrelator.java:86) ~[activemq-client-5.16.0.jar:5.16.0]
	at org.apache.activemq.ActiveMQConnection.syncSendPacket(ActiveMQConnection.java:1392) ~[activemq-client-5.16.0.jar:5.16.0]
	... 14 more
2020-12-18 23:42:27,398 ERROR o.a.j.JMeter: Uncaught exception in thread Thread[Thread-11,5,main]
java.lang.NullPointerException: Cannot invoke method stop() on null object
	at org.codehaus.groovy.runtime.NullObject.invokeMethod(NullObject.java:91) ~[groovy-3.0.7.jar:3.0.7]
	at org.codehaus.groovy.runtime.callsite.PogoMetaClassSite.call(PogoMetaClassSite.java:44)
~[groovy-3.0.7.jar:3.0.7]
	at org.codehaus.groovy.runtime.callsite.CallSiteArray.defaultCall(CallSiteArray.java:47)
~[groovy-3.0.7.jar:3.0.7]
	at org.codehaus.groovy.runtime.callsite.NullCallSite.call(NullCallSite.java:34) ~[groovy-3.0.7.jar:3.0.7]
	at org.codehaus.groovy.runtime.callsite.CallSiteArray.defaultCall(CallSiteArray.java:47)
~[groovy-3.0.7.jar:3.0.7]
	at org.codehaus.groovy.runtime.callsite.AbstractCallSite.call(AbstractCallSite.java:125)
~[groovy-3.0.7.jar:3.0.7]
	at org.codehaus.groovy.runtime.callsite.AbstractCallSite.call(AbstractCallSite.java:130)
~[groovy-3.0.7.jar:3.0.7]
	at Script4$_run_closure1.doCall(Script4.groovy:12) ~[?:?]
	at Script4$_run_closure1.doCall(Script4.groovy) ~[?:?]
	at sun.reflect.NativeMethodAccessorImpl.invoke0(Native Method) ~[?:1.8.0_252]
	at sun.reflect.NativeMethodAccessorImpl.invoke(NativeMethodAccessorImpl.java:62) ~[?:1.8.0_252]
	at sun.reflect.DelegatingMethodAccessorImpl.invoke(DelegatingMethodAccessorImpl.java:43)
~[?:1.8.0_252]
	at java.lang.reflect.Method.invoke(Method.java:498) ~[?:1.8.0_252]
	at org.codehaus.groovy.reflection.CachedMethod.invoke(CachedMethod.java:107) ~[groovy-3.0.7.jar:3.0.7]
	at groovy.lang.MetaMethod.doMethodInvoke(MetaMethod.java:323) ~[groovy-3.0.7.jar:3.0.7]
	at org.codehaus.groovy.runtime.metaclass.ClosureMetaClass.invokeMethod(ClosureMetaClass.java:263)
~[groovy-3.0.7.jar:3.0.7]
	at groovy.lang.MetaClassImpl.invokeMethod(MetaClassImpl.java:1035) ~[groovy-3.0.7.jar:3.0.7]
	at groovy.lang.Closure.call(Closure.java:412) ~[groovy-3.0.7.jar:3.0.7]
	at groovy.lang.Closure.call(Closure.java:406) ~[groovy-3.0.7.jar:3.0.7]
	at groovy.lang.Closure.run(Closure.java:493) ~[groovy-3.0.7.jar:3.0.7]
	at java.lang.Thread.run(Thread.java:748) [?:1.8.0_252]

> Task :src:dist-check:batchJMS_TESTS FAILED
checksum-dependency elapsed time: 78285ms, configurations processed: 392
    SHA-512 computation time: 386ms (goes in parallel, it might exceed wall-clock time), files
processed: 25, processed: 5MiB, skipped: 3429MiB
    PGP signature resolution time: 25585ms (wall-clock), resolution requests: 234, signatures
resolved: 267
    PGP key resolution time: 32951ms (wall-clock), resolution requests: 234, download time:
32949ms (goes in parallel, it might exceed wall-clock time), keys downloaded: 105
        PGP signature verification time: 19351ms (goes in parallel, it might exceed wall-clock
time), files processed: 615, processed: 668MiB, skipped: 2741MiB

Build jmeter FAILURE reason:                                
    Execution failed for task ':src:dist-check:batchJMS_TESTS':
        Failures detected while testing <https://ci-builds.apache.org/job/JMeter/job/JMeter-trunk/ws/bin/testfiles/JMS_TESTS.jmx>:
[unexpected output JMS_TESTS.csv, unexpected output JMS_TESTS.xml, errors in JMS_TESTS.log]
            at org.apache.jmeter.buildtools.batchtest.BatchTest.exec(BatchTest.kt:184)
            at org.gradle.internal.reflect.JavaMethod.invoke(JavaMethod.java:104)
            at org.gradle.api.internal.project.taskfactory.StandardTaskAction.doExecute(StandardTaskAction.java:58)
            at org.gradle.api.internal.project.taskfactory.StandardTaskAction.execute(StandardTaskAction.java:51)
            at org.gradle.api.internal.project.taskfactory.StandardTaskAction.execute(StandardTaskAction.java:29)
            at org.gradle.api.internal.tasks.execution.ExecuteActionsTaskExecuter$3.run(ExecuteActionsTaskExecuter.java:555)
            at org.gradle.internal.operations.DefaultBuildOperationRunner$1.execute(DefaultBuildOperationRunner.java:29)
            at org.gradle.internal.operations.DefaultBuildOperationRunner$1.execute(DefaultBuildOperationRunner.java:26)
            at org.gradle.internal.operations.DefaultBuildOperationRunner$3.execute(DefaultBuildOperationRunner.java:75)
            at org.gradle.internal.operations.DefaultBuildOperationRunner$3.execute(DefaultBuildOperationRunner.java:68)
            at org.gradle.internal.operations.DefaultBuildOperationRunner.execute(DefaultBuildOperationRunner.java:153)
            at org.gradle.internal.operations.DefaultBuildOperationRunner.execute(DefaultBuildOperationRunner.java:68)
            at org.gradle.internal.operations.DefaultBuildOperationRunner.run(DefaultBuildOperationRunner.java:56)
            at org.gradle.internal.operations.DefaultBuildOperationExecutor.lambda$run$1(DefaultBuildOperationExecutor.java:71)
            at org.gradle.internal.operations.UnmanagedBuildOperationWrapper.runWithUnmanagedSupport(UnmanagedBuildOperationWrapper.java:45)
            at org.gradle.internal.operations.DefaultBuildOperationExecutor.run(DefaultBuildOperationExecutor.java:71)
            at org.gradle.api.internal.tasks.execution.ExecuteActionsTaskExecuter.executeAction(ExecuteActionsTaskExecuter.java:540)
            at org.gradle.api.internal.tasks.execution.ExecuteActionsTaskExecuter.executeActions(ExecuteActionsTaskExecuter.java:523)
            at org.gradle.api.internal.tasks.execution.ExecuteActionsTaskExecuter.access$300(ExecuteActionsTaskExecuter.java:108)
            at org.gradle.api.internal.tasks.execution.ExecuteActionsTaskExecuter$TaskExecution.executeWithPreviousOutputFiles(ExecuteActionsTaskExecuter.java:271)
            at org.gradle.api.internal.tasks.execution.ExecuteActionsTaskExecuter$TaskExecution.execute(ExecuteActionsTaskExecuter.java:260)
            at org.gradle.internal.execution.steps.ExecuteStep.lambda$execute$1(ExecuteStep.java:34)
            at org.gradle.internal.execution.steps.ExecuteStep.execute(ExecuteStep.java:34)
            at org.gradle.internal.execution.steps.ExecuteStep.execute(ExecuteStep.java:26)
            at org.gradle.internal.execution.steps.CleanupOutputsStep.execute(CleanupOutputsStep.java:67)
            at org.gradle.internal.execution.steps.CleanupOutputsStep.execute(CleanupOutputsStep.java:36)
            at org.gradle.internal.execution.steps.ResolveInputChangesStep.execute(ResolveInputChangesStep.java:49)
            at org.gradle.internal.execution.steps.ResolveInputChangesStep.execute(ResolveInputChangesStep.java:34)
            at org.gradle.internal.execution.steps.CancelExecutionStep.execute(CancelExecutionStep.java:43)
            at org.gradle.internal.execution.steps.TimeoutStep.executeWithoutTimeout(TimeoutStep.java:73)
            at org.gradle.internal.execution.steps.TimeoutStep.execute(TimeoutStep.java:54)
            at org.gradle.internal.execution.steps.CreateOutputsStep.execute(CreateOutputsStep.java:44)
            at org.gradle.internal.execution.steps.SnapshotOutputsStep.execute(SnapshotOutputsStep.java:54)
            at org.gradle.internal.execution.steps.SnapshotOutputsStep.execute(SnapshotOutputsStep.java:38)
            at org.gradle.internal.execution.steps.BroadcastChangingOutputsStep.execute(BroadcastChangingOutputsStep.java:42)
            at org.gradle.internal.execution.steps.CacheStep.executeWithoutCache(CacheStep.java:159)
            at org.gradle.internal.execution.steps.CacheStep.execute(CacheStep.java:72)
            at org.gradle.internal.execution.steps.CacheStep.execute(CacheStep.java:43)
            at org.gradle.internal.execution.steps.StoreExecutionStateStep.execute(StoreExecutionStateStep.java:44)
            at org.gradle.internal.execution.steps.StoreExecutionStateStep.execute(StoreExecutionStateStep.java:33)
            at org.gradle.internal.execution.steps.RecordOutputsStep.execute(RecordOutputsStep.java:38)
            at org.gradle.internal.execution.steps.RecordOutputsStep.execute(RecordOutputsStep.java:24)
            at org.gradle.internal.execution.steps.SkipUpToDateStep.executeBecause(SkipUpToDateStep.java:92)
            at org.gradle.internal.execution.steps.SkipUpToDateStep.lambda$execute$0(SkipUpToDateStep.java:85)
            at org.gradle.internal.execution.steps.SkipUpToDateStep.execute(SkipUpToDateStep.java:55)
            at org.gradle.internal.execution.steps.SkipUpToDateStep.execute(SkipUpToDateStep.java:39)
            at org.gradle.internal.execution.steps.ResolveChangesStep.execute(ResolveChangesStep.java:76)
            at org.gradle.internal.execution.steps.ResolveChangesStep.execute(ResolveChangesStep.java:37)
            at org.gradle.internal.execution.steps.legacy.MarkSnapshottingInputsFinishedStep.execute(MarkSnapshottingInputsFinishedStep.java:36)
            at org.gradle.internal.execution.steps.legacy.MarkSnapshottingInputsFinishedStep.execute(MarkSnapshottingInputsFinishedStep.java:26)
            at org.gradle.internal.execution.steps.ResolveCachingStateStep.execute(ResolveCachingStateStep.java:94)
            at org.gradle.internal.execution.steps.ResolveCachingStateStep.execute(ResolveCachingStateStep.java:49)
            at org.gradle.internal.execution.steps.CaptureStateBeforeExecutionStep.execute(CaptureStateBeforeExecutionStep.java:79)
            at org.gradle.internal.execution.steps.CaptureStateBeforeExecutionStep.execute(CaptureStateBeforeExecutionStep.java:53)
            at org.gradle.internal.execution.steps.ValidateStep.execute(ValidateStep.java:74)
            at org.gradle.internal.execution.steps.SkipEmptyWorkStep.lambda$execute$2(SkipEmptyWorkStep.java:78)
            at org.gradle.internal.execution.steps.SkipEmptyWorkStep.execute(SkipEmptyWorkStep.java:78)
            at org.gradle.internal.execution.steps.SkipEmptyWorkStep.execute(SkipEmptyWorkStep.java:34)
            at org.gradle.internal.execution.steps.legacy.MarkSnapshottingInputsStartedStep.execute(MarkSnapshottingInputsStartedStep.java:39)
            at org.gradle.internal.execution.steps.LoadExecutionStateStep.execute(LoadExecutionStateStep.java:40)
            at org.gradle.internal.execution.steps.LoadExecutionStateStep.execute(LoadExecutionStateStep.java:28)


FAILURE: Build failed with an exception.

* What went wrong:
Execution failed for task ':src:dist-check:batchJMS_TESTS'.
> Failures detected while testing <https://ci-builds.apache.org/job/JMeter/job/JMeter-trunk/ws/bin/testfiles/JMS_TESTS.jmx>:
[unexpected output JMS_TESTS.csv, unexpected output JMS_TESTS.xml, errors in JMS_TESTS.log]

* Try:
Run with --stacktrace option to get the stack trace. Run with --info or --debug option to
get more log output. Run with --scan to get full insights.

* Get more help at https://help.gradle.org

Deprecated Gradle features were used in this build, making it incompatible with Gradle 7.0.
Use '--warning-mode all' to show the individual deprecation warnings.
See https://docs.gradle.org/6.7/userguide/command_line_interface.html#sec:command_line_warnings

BUILD FAILED in 17m 14s
346 actionable tasks: 316 executed, 30 up-to-date

See the profiling report at: file://<https://ci-builds.apache.org/job/JMeter/job/JMeter-trunk/ws/build/reports/profile/profile-2020-12-18-23-25-21.html>
A fine-grained performance profile is available: use the --scan option.
Build step 'Invoke Gradle script' changed build result to FAILURE
Build step 'Invoke Gradle script' marked build as failure
Xvfb stopping
Archiving artifacts
[Fast Archiver] Compressed 171.83 MB of artifacts by 81.8% relative to #175
Recording test results

Mime
View raw message